﻿PRIMA PI 2017-2018

Si scriva un programma IJVM che che, dato un certo numero di sequenza di valori, stampi a video:


A) la dimensione della sequenza più corta (MIN), ed il numero di sequenze di quella esatta lunghezza (NMIN)

B) la dimensione della sequenza più lunga (MAX), ed il numero di sequenze di quella esatta lunghezza (NMAX)

In particolare,
 
il programma caricherà i valori (tramite BIPUSH) nel seguente modo:
 
- come base della pila verrà inserito un carattere "terminatore" (0x00)
 
- dopodiché sulla pila verranno caricate delle sequenze di valori (compresi tra 0x1 e 0xFE) separate da un elemento "separatore" (0xFF)

Non è importante il formato della stampa, ma l’ideale sarebbe qualcosa di simile agli esempi di esecuzione.

Esempio di caricamento:

sequenze: {0x00, 0xAA, 0xAA, 0xFF, 0x01, 0x02, 0x03, 0xFF, 0xBB, 0xBB} ->

BIPUSH 0x00

BIPUSH 0xAA

BIPUSH 0xAA

BIPUSH 0xFF

BIPUSH 0x01

BIPUSH 0x02

BIPUSH 0x03

BIPUSH 0xFF

BIPUSH 0xBB

BIPUSH 0xBB


Esempi di esecuzione:

sequenze: {0x00, 0xAA, 0xAA, 0xFF, 0x01, 0x02, 0x03, 0xFF, 0xBB, 0xBB} ->
A) MIN: 2, NMIN: 2
B) MAX: 3, NMAX: 1

sequenze: {0x00, 0xAA, 0xAA, 0xAA, 0xAA} ->
A) MIN: 4, NMIN: 1
B) MAX: 4, NMAX: 1

sequenze: {0x00, 0xAA, 0xAA, 0xFF, 0x01, 0x02, 0xFF, 0xBB, 0xBB} ->
A) MIN: 2, NMIN: 3
B) MAX: 2, NMAX: 3

sequenze: {0x00, 0xAA, 0xAA, 0xFF, 0x01, 0x02, 0x03, 0xFF, 0xBB, 0xBB, 0xFF, 0xBB, 0xBB, 0xBB, 0xBB, 0xBB, 0xBB, 0xBB, 0xBB, 0xFF, 0xBB} ->
A) MIN: 1, NMIN: 1
B) MAX: 8, NMAX: 1

sequenze: {0x00, 0xAA, 0xAA, 0xFF, 0xFF, 0x01, 0x02, 0x03, 0xFF, 0xBB, 0xBB, 0xFF, 0xFF, 0xBB, 0xBB, 0xBB, 0xFF, 0xBB, 0xBB, 0xBB, 0xFF, 0xBB, 0xBB, 0xBB} ->
A) MIN: 0, NMIN: 2
B) MAX: 3, NMAX: 4