 _______ _______      ___   ______     _______ _______      ___   ________ _____ _____    ________  
|_   __ \_   __ \   .'   `.|_   _ `.  |_   __ \_   __ \   .'   `.|_   __  |_   _|_   _|  |_   __  | 
  | |__) || |__) | /  .-.  \ | | `. \   | |__) || |__) | /  .-.  \ | |_ \_| | |   | |      | |_ \_| 
  |  ___/ |  __ /  | |   | | | |  | |   |  ___/ |  __ /  | |   | | |  _|    | |   | |   _  |  _| _  
 _| |_   _| |  \ \_\  `-'  /_| |_.' /  _| |_   _| |  \ \_\  `-'  /_| |_    _| |_ _| |__/ |_| |__/ | 
|_____| |____| |___|`.___.'|______.'  |_____| |____| |___|`.___.'|_____|  |_____|________|________| 
                                                                                                    
Application Name: ${application.title}
Application Version: ${application.version}
Application Active Profile: ${spring.profiles.active}
