Study statistics: 
  Number of finished trials: 10
  Number of pruned trials: 0
  Number of complete trials: 10
Best trial:
  Value: 75.4908
    KL2_coef: 0.15010149249786534
    weight_decay: 0.002428896902868998

