Study statistics: 
  Number of finished trials: 5
  Number of pruned trials: 0
  Number of complete trials: 5
Best trial:
  Value: 63.60509999999999
    KL_coef: 0.18431309018900865
    weight_decay: 0.0014733197690893604

