Study statistics: 
  Number of finished trials: 1
  Number of pruned trials: 0
  Number of complete trials: 1
Best trial:
  Value: 79.90116666666665
    KL2_coef: 0.03
    weight_decay: 0.006

