Study statistics: 
  Number of finished trials: 3
  Number of pruned trials: 0
  Number of complete trials: 3
Best trial:
  Value: 62.4499
    weight_decay: 0.0
    KL_coef: 0.09177185336250268

