Study statistics: 
  Number of finished trials: 5
  Number of pruned trials: 0
  Number of complete trials: 5
Best trial:
  Value: 30.769233333333336
    KL2_coef: 2.749854956148314
    weight_decay: 0.04254405143741059

