Study statistics: 
  Number of finished trials: 5
  Number of pruned trials: 0
  Number of complete trials: 5
Best trial:
  Value: 21.654633333333333
    KL_coef: 0.32044853248835564
    weight_decay: 0.01743852698394709

