Study statistics: 
  Number of finished trials: 10
  Number of pruned trials: 0
  Number of complete trials: 10
Best trial:
  Value: 35.45336666666667
    KL_coef: 0.6930876379698699
    weight_decay: 0.005351199395470539

