Study statistics: 
  Number of finished trials: 1
  Number of pruned trials: 0
  Number of complete trials: 1
Best trial:
  Value: 43.19910000000001
    KL_coef: 1.0
    weight_decay: 0.0001

