Study statistics: 
  Number of finished trials: 5
  Number of pruned trials: 0
  Number of complete trials: 5
Best trial:
  Value: 33.303266666666666
    KL2_coef: 2.435860422098749
    weight_decay: 0.04750134077691135

