Study statistics: 
  Number of finished trials: 1
  Number of pruned trials: 0
  Number of complete trials: 1
Best trial:
  Value: 46.35333333333333
    KL_coef: 5.0
    weight_decay: 0.005

