Study statistics: 
  Number of finished trials: 5
  Number of pruned trials: 0
  Number of complete trials: 5
Best trial:
  Value: 82.77910000000001
    KL2_coef: 0.16185937830222552
    weight_decay: 0.04278584844138226

