Study statistics: 
  Number of finished trials: 5
  Number of pruned trials: 0
  Number of complete trials: 5
Best trial:
  Value: 47.4209
    KL2_coef: 0.02504509839331382
    weight_decay: 0.004397685285562369

