Study statistics: 
  Number of finished trials: 5
  Number of pruned trials: 0
  Number of complete trials: 5
Best trial:
  Value: 33.63046666666667
    KL2_coef: 3.094970146884104
    weight_decay: 0.002816908835002732

