Study statistics: 
  Number of finished trials: 3
  Number of pruned trials: 0
  Number of complete trials: 3
Best trial:
  Value: 39.383
    weight_decay: 0.0
    KL2_coef: 0.13125823303589215

