Study statistics: 
  Number of finished trials: 5
  Number of pruned trials: 0
  Number of complete trials: 5
Best trial:
  Value: 48.217150000000004
    KL_coef: 0.06622579562860141
    weight_decay: 0.0022844349204138126

