Study statistics: 
  Number of finished trials: 10
  Number of pruned trials: 0
  Number of complete trials: 10
Best trial:
  Value: 92.20753333333334
    KL2_coef: 0.4913346042867935
    weight_decay: 0.0035471555850589507

