Study statistics: 
  Number of finished trials: 10
  Number of pruned trials: 0
  Number of complete trials: 10
Best trial:
  Value: 92.3845
    KL2_coef: 2.4153305556128175
    weight_decay: 0.037796411623919224

