Study statistics: 
  Number of finished trials: 1
  Number of pruned trials: 0
  Number of complete trials: 1
Best trial:
  Value: 88.71999999999998
    KL2_coef: 0.77
    weight_decay: 0.02

