Study statistics: 
  Number of finished trials: 6
  Number of pruned trials: 0
  Number of complete trials: 6
Best trial:
  Value: 89.38633333333333
    KL_coef: 0.021798286711472797
    weight_decay: 0.0027222880270999098

