Study statistics: 
  Number of finished trials: 5
  Number of pruned trials: 0
  Number of complete trials: 5
Best trial:
  Value: 82.77576666666667
    KL2_coef: 2.4539363482068994
    weight_decay: 0.03882020994314273

