Study statistics: 
  Number of finished trials: 5
  Number of pruned trials: 0
  Number of complete trials: 5
Best trial:
  Value: 31.263366666666666
    KL2_coef: 4.858924968393392
    weight_decay: 0.001732220423082678

