INDEX VERSION 1.126+/home/fourgeot/Documents/Projet/Groupe-42A/Analyse/.metadata/.plugins/org.eclipse.jdt.core
5990989.index
1826037640.index
502732891.index
3144867037.index
1478398259.index
2744878784.index
3485262699.index
3530540584.index
3883508318.index
226184197.index
575803125.index
1943361041.index
925982370.index
2359322674.index
3107427908.index
1089239932.index
1628687906.index
813341167.index
1625540891.index
3512161136.index
3279194698.index
2253745042.index
3202973751.index
1668737176.index
821608291.index
3607846794.index
2639287113.index
2635409388.index
2424313890.index
3066711521.index
3857543539.index
3539432263.index
