[
    {
        "first_name": "Richard",
        "last_name": "Hendricks",
        "email": "richard@example.com"
    },
    {
        "first_name": "Jared",
        "last_name": "Dunn",
        "email": "jared@example.com"
    }
]
