{
    "collection": "team_settings",
    "note": "Settings for teams / Directus roles.",
    "hidden": false,
    "single": false,
    "managed": true,
    "fields": {
        "id": {
            "collection": "team_settings",
            "field": "id",
            "datatype": "INT",
            "unique": false,
            "primary_key": true,
            "auto_increment": true,
            "default_value": null,
            "note": "",
            "signed": false,
            "id": 227,
            "type": "integer",
            "sort": 1,
            "interface": "primary-key",
            "hidden_detail": false,
            "hidden_browse": false,
            "required": true,
            "options": null,
            "locked": 0,
            "translation": null,
            "readonly": false,
            "width": "full",
            "validation": null,
            "group": null,
            "length": "10"
        },
        "owner": {
            "collection": "team_settings",
            "field": "owner",
            "datatype": "INT",
            "unique": false,
            "primary_key": false,
            "auto_increment": false,
            "default_value": null,
            "note": "",
            "signed": false,
            "id": 228,
            "type": "owner",
            "sort": 2,
            "interface": "owner",
            "hidden_detail": false,
            "hidden_browse": false,
            "required": true,
            "options": {
                "template": "{{first_name}} {{last_name}}",
                "display": "both"
            },
            "locked": 0,
            "translation": null,
            "readonly": true,
            "width": "full",
            "validation": null,
            "group": null,
            "length": "10"
        },
        "created_on": {
            "collection": "team_settings",
            "field": "created_on",
            "datatype": "DATETIME",
            "unique": false,
            "primary_key": false,
            "auto_increment": false,
            "default_value": null,
            "note": "",
            "signed": true,
            "id": 229,
            "type": "datetime_created",
            "sort": 3,
            "interface": "datetime-created",
            "hidden_detail": false,
            "hidden_browse": false,
            "required": true,
            "options": null,
            "locked": 0,
            "translation": null,
            "readonly": true,
            "width": "full",
            "validation": null,
            "group": null,
            "length": null
        },
        "modified_by": {
            "collection": "team_settings",
            "field": "modified_by",
            "datatype": "INT",
            "unique": false,
            "primary_key": false,
            "auto_increment": false,
            "default_value": null,
            "note": "",
            "signed": false,
            "id": 230,
            "type": "user_updated",
            "sort": 5,
            "interface": "user-updated",
            "hidden_detail": false,
            "hidden_browse": false,
            "required": true,
            "options": {
                "template": "{{first_name}} {{last_name}}",
                "display": "both"
            },
            "locked": 0,
            "translation": null,
            "readonly": true,
            "width": "full",
            "validation": null,
            "group": null,
            "length": "10"
        },
        "modified_on": {
            "collection": "team_settings",
            "field": "modified_on",
            "datatype": "DATETIME",
            "unique": false,
            "primary_key": false,
            "auto_increment": false,
            "default_value": null,
            "note": "",
            "signed": true,
            "id": 231,
            "type": "datetime_updated",
            "sort": 4,
            "interface": "datetime-updated",
            "hidden_detail": false,
            "hidden_browse": false,
            "required": true,
            "options": null,
            "locked": 0,
            "translation": null,
            "readonly": true,
            "width": "full",
            "validation": null,
            "group": null,
            "length": null
        },
        "team": {
            "collection": "team_settings",
            "field": "team",
            "datatype": "INT",
            "unique": false,
            "primary_key": false,
            "auto_increment": false,
            "default_value": null,
            "note": "",
            "signed": false,
            "id": 234,
            "type": "m2o",
            "sort": 6,
            "interface": "user-roles",
            "hidden_detail": false,
            "hidden_browse": false,
            "required": true,
            "options": {
                "relational": true,
                "showPublic": false
            },
            "locked": 0,
            "translation": null,
            "readonly": false,
            "width": "full",
            "validation": null,
            "group": null,
            "length": "10"
        },
        "properties": {
            "collection": "team_settings",
            "field": "properties",
            "datatype": "TEXT",
            "unique": false,
            "primary_key": false,
            "auto_increment": false,
            "default_value": null,
            "note": "",
            "signed": true,
            "id": 235,
            "type": "json",
            "sort": 10,
            "interface": "key-value",
            "hidden_detail": false,
            "hidden_browse": false,
            "required": false,
            "options": {
                "keyInterface": "text-input",
                "keyType": "string",
                "keyOptions": {
                    "placeholder": "Key"
                },
                "valueInterface": "text-input",
                "valueType": "string",
                "valueOptions": {
                    "placeholder": "Value"
                }
            },
            "locked": 0,
            "translation": null,
            "readonly": false,
            "width": "full",
            "validation": null,
            "group": null,
            "length": null
        },
        "description": {
            "collection": "team_settings",
            "field": "description",
            "datatype": "TEXT",
            "unique": false,
            "primary_key": false,
            "auto_increment": false,
            "default_value": null,
            "note": "",
            "signed": true,
            "id": 326,
            "type": "string",
            "sort": 8,
            "interface": "textarea",
            "hidden_detail": false,
            "hidden_browse": false,
            "required": false,
            "options": {
                "rows": 8,
                "serif": false
            },
            "locked": 0,
            "translation": null,
            "readonly": false,
            "width": "full",
            "validation": null,
            "group": null,
            "length": null
        },
        "name": {
            "collection": "team_settings",
            "field": "name",
            "datatype": "VARCHAR",
            "unique": false,
            "primary_key": false,
            "auto_increment": false,
            "default_value": null,
            "note": "",
            "signed": true,
            "id": 328,
            "type": "string",
            "sort": 7,
            "interface": "text-input",
            "hidden_detail": false,
            "hidden_browse": false,
            "required": false,
            "options": {
                "trim": true,
                "showCharacterCount": true,
                "formatValue": false,
                "monospace": false
            },
            "locked": 0,
            "translation": null,
            "readonly": false,
            "width": "full",
            "validation": null,
            "group": null,
            "length": "200"
        },
        "notes": {
            "collection": "team_settings",
            "field": "notes",
            "datatype": "TEXT",
            "unique": false,
            "primary_key": false,
            "auto_increment": false,
            "default_value": null,
            "note": "",
            "signed": true,
            "id": 329,
            "type": "string",
            "sort": 9,
            "interface": "textarea",
            "hidden_detail": false,
            "hidden_browse": false,
            "required": false,
            "options": {
                "rows": 8,
                "serif": false
            },
            "locked": 0,
            "translation": null,
            "readonly": false,
            "width": "full",
            "validation": null,
            "group": null,
            "length": null
        },
        "status": {
            "collection": "team_settings",
            "field": "status",
            "datatype": "VARCHAR",
            "unique": false,
            "primary_key": false,
            "auto_increment": false,
            "default_value": "active",
            "note": "",
            "signed": true,
            "id": 330,
            "type": "status",
            "sort": 12,
            "interface": "status",
            "hidden_detail": false,
            "hidden_browse": false,
            "required": true,
            "options": {
                "simpleBadge": true,
                "status_mapping": {
                    "active": {
                        "name": "Active",
                        "value": "active",
                        "text_color": "blue-100",
                        "background_color": "blue",
                        "browse_subdued": false,
                        "browse_badge": true,
                        "soft_delete": false,
                        "published": true,
                        "required_fields": true
                    },
                    "suspended": {
                        "name": "Suspended",
                        "value": "suspended",
                        "text_color": "blue-grey-100",
                        "background_color": "blue-grey",
                        "browse_subdued": true,
                        "browse_badge": true,
                        "soft_delete": false,
                        "published": false,
                        "required_fields": false
                    },
                    "deleted": {
                        "name": "Deleted",
                        "value": "deleted",
                        "text_color": "red-100",
                        "background_color": "red",
                        "browse_subdued": true,
                        "browse_badge": true,
                        "soft_delete": true,
                        "published": false,
                        "required_fields": false
                    }
                }
            },
            "locked": 0,
            "translation": null,
            "readonly": false,
            "width": "full",
            "validation": null,
            "group": null,
            "length": "20"
        },
        "managers": {
            "collection": "team_settings",
            "field": "managers",
            "datatype": null,
            "unique": false,
            "primary_key": false,
            "auto_increment": false,
            "default_value": null,
            "note": null,
            "signed": false,
            "id": 311,
            "type": "O2M",
            "sort": 11,
            "interface": "many-to-many",
            "hidden_detail": false,
            "hidden_browse": false,
            "required": false,
            "options": {
                "template": "{{directus_users.first_name}} {{directus_users.last_name}} <{{directus_users.email}}>",
                "allow_create": true,
                "allow_select": true,
                "fields": "first_name, last_name, email"
            },
            "locked": 0,
            "translation": null,
            "readonly": false,
            "width": "full",
            "validation": null,
            "group": null,
            "length": null
        }
    },
    "icon": "people",
    "translation": null
}
