[
    {
        "first_name": "Gavin",
        "last_name": "Belson",
        "email": "gavin@example.com"
    },
    {
        "first_name": "Nelson",
        "last_name": "Bighetti",
        "email": "nelson@example.com"
    }
]
