{
    "collection": "folders",
    "note": "Folders for organising elements and views within the app.",
    "hidden": false,
    "single": false,
    "managed": true,
    "fields": {
        "id": {
            "collection": "folders",
            "field": "id",
            "datatype": "INT",
            "unique": false,
            "primary_key": true,
            "auto_increment": false,
            "default_value": null,
            "note": "",
            "signed": false,
            "id": 192,
            "type": "integer",
            "sort": 1,
            "interface": "primary-key",
            "hidden_detail": false,
            "hidden_browse": false,
            "required": true,
            "options": null,
            "locked": 0,
            "translation": null,
            "readonly": false,
            "width": "full",
            "validation": null,
            "group": null,
            "length": "10"
        },
        "owner": {
            "collection": "folders",
            "field": "owner",
            "datatype": "INT",
            "unique": false,
            "primary_key": false,
            "auto_increment": false,
            "default_value": null,
            "note": "",
            "signed": false,
            "id": 193,
            "type": "owner",
            "sort": 2,
            "interface": "owner",
            "hidden_detail": false,
            "hidden_browse": false,
            "required": true,
            "options": {
                "template": "{{first_name}} {{last_name}}",
                "display": "both"
            },
            "locked": 0,
            "translation": null,
            "readonly": true,
            "width": "full",
            "validation": null,
            "group": null,
            "length": "10"
        },
        "created_on": {
            "collection": "folders",
            "field": "created_on",
            "datatype": "DATETIME",
            "unique": false,
            "primary_key": false,
            "auto_increment": false,
            "default_value": null,
            "note": "",
            "signed": true,
            "id": 194,
            "type": "datetime_created",
            "sort": 3,
            "interface": "datetime-created",
            "hidden_detail": false,
            "hidden_browse": false,
            "required": true,
            "options": null,
            "locked": 0,
            "translation": null,
            "readonly": true,
            "width": "full",
            "validation": null,
            "group": null,
            "length": null
        },
        "name": {
            "collection": "folders",
            "field": "name",
            "datatype": "VARCHAR",
            "unique": true,
            "primary_key": false,
            "auto_increment": false,
            "default_value": null,
            "note": "",
            "signed": true,
            "id": 195,
            "type": "string",
            "sort": 6,
            "interface": "text-input",
            "hidden_detail": false,
            "hidden_browse": false,
            "required": true,
            "options": {
                "trim": true,
                "showCharacterCount": true,
                "formatValue": false,
                "monospace": false
            },
            "locked": 0,
            "translation": null,
            "readonly": false,
            "width": "full",
            "validation": null,
            "group": null,
            "length": "200"
        },
        "modified_on": {
            "collection": "folders",
            "field": "modified_on",
            "datatype": "DATETIME",
            "unique": false,
            "primary_key": false,
            "auto_increment": false,
            "default_value": null,
            "note": "",
            "signed": true,
            "id": 196,
            "type": "datetime_updated",
            "sort": 4,
            "interface": "datetime-updated",
            "hidden_detail": false,
            "hidden_browse": false,
            "required": true,
            "options": null,
            "locked": 0,
            "translation": null,
            "readonly": true,
            "width": "full",
            "validation": null,
            "group": null,
            "length": null
        },
        "modified_by": {
            "collection": "folders",
            "field": "modified_by",
            "datatype": "INT",
            "unique": false,
            "primary_key": false,
            "auto_increment": false,
            "default_value": null,
            "note": "",
            "signed": false,
            "id": 197,
            "type": "user_updated",
            "sort": 5,
            "interface": "user-updated",
            "hidden_detail": false,
            "hidden_browse": false,
            "required": true,
            "options": {
                "template": "{{first_name}} {{last_name}}",
                "display": "both"
            },
            "locked": 0,
            "translation": null,
            "readonly": true,
            "width": "full",
            "validation": null,
            "group": null,
            "length": "10"
        },
        "tags": {
            "collection": "folders",
            "field": "tags",
            "datatype": "VARCHAR",
            "unique": false,
            "primary_key": false,
            "auto_increment": false,
            "default_value": null,
            "note": "",
            "signed": true,
            "id": 198,
            "type": "array",
            "sort": 9,
            "interface": "tags",
            "hidden_detail": false,
            "hidden_browse": false,
            "required": false,
            "options": {
                "iconRight": "local_offer",
                "validationMessage": "Please enter a valid tag",
                "alphabetize": true,
                "lowercase": true,
                "wrap": false,
                "format": false,
                "sanitize": false
            },
            "locked": 0,
            "translation": null,
            "readonly": false,
            "width": "full",
            "validation": null,
            "group": null,
            "length": "2000"
        },
        "status": {
            "collection": "folders",
            "field": "status",
            "datatype": "VARCHAR",
            "unique": false,
            "primary_key": false,
            "auto_increment": false,
            "default_value": "private",
            "note": "",
            "signed": true,
            "id": 200,
            "type": "status",
            "sort": 8,
            "interface": "status",
            "hidden_detail": false,
            "hidden_browse": false,
            "required": true,
            "options": {
                "simpleBadge": true,
                "status_mapping": {
                    "private": {
                        "name": "Private",
                        "value": "private",
                        "text_color": "blue-grey-100",
                        "background_color": "blue-grey",
                        "browse_subdued": true,
                        "browse_badge": true,
                        "soft_delete": false,
                        "published": false,
                        "required_fields": false
                    },
                    "shared": {
                        "name": "Shared",
                        "value": "shared",
                        "text_color": "blue-100",
                        "background_color": "blue",
                        "browse_subdued": false,
                        "browse_badge": true,
                        "soft_delete": false,
                        "published": true,
                        "required_fields": true
                    },
                    "public": {
                        "newItem": true,
                        "name": "Public",
                        "value": "public",
                        "browse_badge": true,
                        "required_fields": true,
                        "published": true
                    },
                    "deleted": {
                        "name": "Deleted",
                        "value": "deleted",
                        "text_color": "red-100",
                        "background_color": "red",
                        "browse_subdued": true,
                        "browse_badge": true,
                        "soft_delete": true,
                        "published": false,
                        "required_fields": false
                    }
                }
            },
            "locked": 0,
            "translation": null,
            "readonly": false,
            "width": "full",
            "validation": null,
            "group": null,
            "length": "20"
        },
        "description": {
            "collection": "folders",
            "field": "description",
            "datatype": "TEXT",
            "unique": false,
            "primary_key": false,
            "auto_increment": false,
            "default_value": null,
            "note": "",
            "signed": true,
            "id": 317,
            "type": "string",
            "sort": 7,
            "interface": "textarea",
            "hidden_detail": false,
            "hidden_browse": false,
            "required": false,
            "options": {
                "rows": 8,
                "serif": false
            },
            "locked": 0,
            "translation": null,
            "readonly": false,
            "width": "full",
            "validation": null,
            "group": null,
            "length": null
        }
    },
    "icon": "folder",
    "translation": null
}
