<svg fill="currentColor" viewBox="0 0 16 16">
  <path d="M13.4719 0L16 2.52819L14.0731 4.4551L11.545 1.92691L13.4719 0Z" />
  <path d="M4.21314 11.7868H6.74103L12.8813 5.64644L10.3534 3.11852L4.21314 9.25885V11.7868Z" />
  <path
    d="M13.4821 14.3147H4.34628C4.32437 14.3147 4.30162 14.3231 4.27972 14.3231C4.25191 14.3231 4.2241 14.3156 4.19545 14.3147H1.68526V2.51771H7.45474L9.14 0.832428H1.68526C0.755839 0.832428 0 1.58744 0 2.51771V14.3147C0 15.245 0.755839 16 1.68526 16H13.4821C14.4123 16 15.1673 15.245 15.1673 14.3147V7.01069L13.4821 8.69597V14.3147Z" />
</svg>