<!-- Derived from center of: https://akveo.github.io/eva-icons/#/?searchKey=check&type=outline -->
<svg fill="currentColor" viewBox="0 0 16 15">
  <path
    d="M6.05915 14.2594C5.48541 14.2881 4.90804 14.0409 4.53659 13.5474L0.360169 7.99803C-0.23476 7.20753 -0.0762189 6.08442 0.71428 5.48949C1.50478 4.89457 2.62789 5.05311 3.22282 5.8436L6.02147 9.56225L12.7847 0.704361C13.3851 -0.0819894 14.5093 -0.23273 15.2957 0.367672C16.082 0.968073 16.2328 2.09226 15.6324 2.87861L7.48058 13.555C7.12881 14.0158 6.59724 14.2583 6.05915 14.2594Z" />
</svg>