<!-- Source (stroke width = 2.5px): https://feathericons.com/?query=check -->
<svg fill="currentColor" viewBox="0 0 16 12">
  <path
    d="M15.6834 0.316641C16.1055 0.73883 16.1055 1.42333 15.6834 1.84552L6.16985 11.359C5.74766 11.7812 5.06315 11.7812 4.64097 11.359L0.316641 7.03471C-0.105547 6.61252 -0.105547 5.92802 0.316641 5.50583C0.73883 5.08364 1.42333 5.08364 1.84552 5.50583L5.40541 9.06571L14.1545 0.316641C14.5767 -0.105547 15.2612 -0.105547 15.6834 0.316641Z" />
</svg>