<svg fill="currentColor" viewBox="0 0 16 16">
  <path
    d="M14.0402 2.45026C13.2428 1.65853 12.2954 1.03404 11.2534 0.613426C10.2114 0.192816 9.09596 -0.0154364 7.97242 0.000890846C5.86328 -0.004382 3.83843 0.828412 2.34332 2.31607C0.848206 3.80373 0.00529773 5.82438 2.48869e-05 7.93352C-0.00524796 10.0427 0.827547 12.0675 2.3152 13.5626C3.80286 15.0577 5.82352 15.9006 7.93265 15.9059C8.38714 15.9136 8.83132 15.7702 9.19547 15.4982C9.55963 15.2262 9.82314 14.8409 9.94464 14.4029C10.0221 14.0866 10.0213 13.7562 9.94231 13.4402C9.86332 13.1243 9.70854 12.8324 9.49135 12.5897C9.44113 12.5326 9.40836 12.4622 9.39693 12.387C9.3855 12.3118 9.3959 12.2349 9.42687 12.1654C9.45785 12.0959 9.50811 12.0367 9.5717 11.995C9.63528 11.9532 9.70951 11.9305 9.78559 11.9297H11.0978C12.3327 11.9354 13.5242 11.4738 14.4329 10.6374C15.3415 9.801 15.9001 8.65182 15.9965 7.42058C16.0261 6.50256 15.8678 5.58816 15.5314 4.73348C15.195 3.87879 14.6876 3.10184 14.0402 2.45026ZM11.1296 10.3392H9.8174C9.43419 10.337 9.05858 10.4461 8.73614 10.6531C8.41369 10.8602 8.15826 11.1564 8.00083 11.5058C7.8434 11.8552 7.79073 12.2427 7.8492 12.6215C7.90768 13.0002 8.0748 13.3538 8.33028 13.6394C8.38003 13.6896 8.41519 13.7524 8.432 13.8211C8.44881 13.8897 8.44663 13.9616 8.42571 14.0291C8.38595 14.1961 8.20304 14.2995 7.95651 14.3154C7.05336 14.3038 6.16303 14.1001 5.34474 13.7177C4.52644 13.3353 3.79895 12.7831 3.21064 12.0978C2.62234 11.4124 2.18671 10.6096 1.93273 9.74286C1.67875 8.87607 1.61225 7.96515 1.73765 7.07067C1.96443 5.56761 2.71545 4.19316 3.8579 3.19043C5.00034 2.1877 6.46058 1.6213 7.98037 1.59139H8.04399C8.9433 1.57962 9.83585 1.74806 10.669 2.08679C11.5022 2.42552 12.2591 2.92766 12.895 3.56362C13.3913 4.06017 13.7812 4.6526 14.0409 5.30477C14.3007 5.95695 14.4249 6.65521 14.406 7.35696C14.3237 8.17056 13.9436 8.92504 13.3389 9.47548C12.7341 10.0259 11.9473 10.3335 11.1296 10.3392Z" />
  <path
    d="M10.6286 4.13619C10.4243 4.25417 10.2596 4.43006 10.1553 4.64161C10.051 4.85317 10.0118 5.0909 10.0426 5.32476C10.0733 5.55861 10.1727 5.7781 10.3282 5.95546C10.4837 6.13283 10.6883 6.26012 10.9161 6.32124C11.1439 6.38236 11.3848 6.37457 11.6082 6.29885C11.8315 6.22314 12.0275 6.0829 12.1712 5.89585C12.3149 5.70881 12.3999 5.48336 12.4155 5.248C12.4311 5.01265 12.3766 4.77795 12.2588 4.57357C12.1806 4.43775 12.0763 4.31867 11.952 4.22317C11.8277 4.12766 11.6857 4.0576 11.5343 4.01698C11.3829 3.97635 11.225 3.96597 11.0696 3.98643C10.9142 4.00688 10.7643 4.05777 10.6286 4.13619Z" />
  <path
    d="M8.04399 4.77241C8.7028 4.77241 9.23687 4.23834 9.23687 3.57953C9.23687 2.92072 8.7028 2.38665 8.04399 2.38665C7.38518 2.38665 6.85111 2.92072 6.85111 3.57953C6.85111 4.23834 7.38518 4.77241 8.04399 4.77241Z" />
  <path
    d="M5.45943 4.13621C5.25505 4.01845 5.02035 3.96392 4.785 3.97952C4.54964 3.99512 4.32419 4.08015 4.13715 4.22385C3.95011 4.36755 3.80986 4.56348 3.73415 4.78687C3.65843 5.01026 3.65064 5.25108 3.71176 5.4789C3.77288 5.70671 3.90017 5.91129 4.07754 6.06678C4.2549 6.22227 4.47439 6.32169 4.70824 6.35247C4.9421 6.38324 5.17983 6.344 5.39139 6.2397C5.60294 6.1354 5.77883 5.97071 5.89682 5.76647C5.97523 5.63073 6.02612 5.48086 6.04657 5.32544C6.06703 5.17002 6.05665 5.01209 6.01603 4.86068C5.9754 4.70927 5.90534 4.56736 5.80983 4.44305C5.71433 4.31873 5.59526 4.21447 5.45943 4.13621Z" />
  <path
    d="M3.39972 7.36493C3.20407 7.49704 3.05201 7.68423 2.96281 7.90281C2.8736 8.12139 2.85126 8.36153 2.89862 8.59281C2.94597 8.8241 3.06089 9.03613 3.22882 9.20206C3.39675 9.368 3.61015 9.48037 3.84198 9.52495C4.07381 9.56954 4.31366 9.54432 4.53116 9.45251C4.74866 9.3607 4.93402 9.20641 5.06378 9.00919C5.19354 8.81197 5.26186 8.58068 5.26009 8.3446C5.25833 8.10852 5.18655 7.87828 5.05384 7.68303C4.96667 7.55288 4.85455 7.44131 4.72398 7.35478C4.59341 7.26824 4.44697 7.20845 4.29315 7.17887C4.13932 7.14929 3.98116 7.1505 3.82781 7.18244C3.67445 7.21437 3.52895 7.2764 3.39972 7.36493Z" />
</svg>