<!-- Source: https://primer.style/octicons/rows-24 -->
<svg fill="currentColor" viewBox="0 0 16 16">
  <path
    d="M16 1.4C16 1.0287 15.8525 0.672602 15.5899 0.410051C15.3274 0.1475 14.9713 0 14.6 0H1.4C1.0287 0 0.672602 0.1475 0.410051 0.410051C0.1475 0.672602 0 1.0287 0 1.4V5.8C0 6.5728 0.6272 7.2 1.4 7.2H14.6C14.9713 7.2 15.3274 7.0525 15.5899 6.78995C15.8525 6.5274 16 6.1713 16 5.8V1.4ZM14.6 1.2C14.653 1.2 14.7039 1.22107 14.7414 1.25858C14.7789 1.29609 14.8 1.34696 14.8 1.4V5.8C14.8 5.85304 14.7789 5.90391 14.7414 5.94142C14.7039 5.97893 14.653 6 14.6 6H1.4C1.34696 6 1.29609 5.97893 1.25858 5.94142C1.22107 5.90391 1.2 5.85304 1.2 5.8V1.4C1.2 1.34696 1.22107 1.29609 1.25858 1.25858C1.29609 1.22107 1.34696 1.2 1.4 1.2H14.6ZM16 10.2C16 9.8287 15.8525 9.4726 15.5899 9.21005C15.3274 8.9475 14.9713 8.8 14.6 8.8H1.4C1.0287 8.8 0.672602 8.9475 0.410051 9.21005C0.1475 9.4726 0 9.8287 0 10.2V14.6C0 15.3728 0.6272 16 1.4 16H14.6C14.9713 16 15.3274 15.8525 15.5899 15.5899C15.8525 15.3274 16 14.9713 16 14.6V10.2ZM14.6 10C14.653 10 14.7039 10.0211 14.7414 10.0586C14.7789 10.0961 14.8 10.147 14.8 10.2V14.6C14.8 14.653 14.7789 14.7039 14.7414 14.7414C14.7039 14.7789 14.653 14.8 14.6 14.8H1.4C1.34696 14.8 1.29609 14.7789 1.25858 14.7414C1.22107 14.7039 1.2 14.653 1.2 14.6V10.2C1.2 10.147 1.22107 10.0961 1.25858 10.0586C1.29609 10.0211 1.34696 10 1.4 10H14.6Z" />
</svg>