<svg fill="currentColor" viewBox="0 0 16 16">
  <path
    d="M10.453 13.4845H4.67276L3.57385 16.7813H0.0683594L6.0244 0.78125H9.07935L15.0684 16.7813H11.5629L10.453 13.4845ZM5.56287 10.8142H9.56287L7.55188 4.82521L5.56287 10.8142Z" />
</svg>