<svg fill="currentColor" viewBox="0 0 20 20">
  <path fill-rule="evenodd"
    d="M4 0C1.79086 0 0 1.79086 0 4V16C0 18.2091 1.79086 20 4 20H16C18.2091 20 20 18.2091 20 16V4C20 1.79086 18.2091 0 16 0H4ZM11.333 11.5C11.6064 11.7051 11.7432 12.0013 11.7432 12.3887C11.7432 12.7441 11.6064 13.0221 11.333 13.2227C11.0596 13.4186 10.679 13.5166 10.1914 13.5166C8.87891 13.5166 8.22266 12.9674 8.22266 11.8691H6.16504C6.16504 12.5117 6.3291 13.0768 6.65723 13.5645C6.98991 14.0521 7.4707 14.4372 8.09961 14.7197C8.72852 14.9977 9.42578 15.1367 10.1914 15.1367C11.2943 15.1367 12.1715 14.8929 12.8232 14.4053C13.4749 13.9131 13.8008 13.2363 13.8008 12.375C13.8008 11.6003 13.5342 10.9531 13.001 10.4336C12.4678 9.91406 11.6178 9.47884 10.4512 9.12793C9.81771 8.93652 9.33691 8.73145 9.00879 8.5127C8.68522 8.29395 8.52344 8.02279 8.52344 7.69922C8.52344 7.35286 8.66243 7.07487 8.94043 6.86523C9.21842 6.65104 9.60807 6.54395 10.1094 6.54395C10.6289 6.54395 11.0322 6.67155 11.3193 6.92676C11.6064 7.17741 11.75 7.5306 11.75 7.98633H13.8008C13.8008 7.38932 13.6458 6.85612 13.3359 6.38672C13.0306 5.91732 12.5999 5.55501 12.0439 5.2998C11.488 5.04004 10.8545 4.91016 10.1436 4.91016C9.43717 4.91016 8.79915 5.02865 8.22949 5.26562C7.66439 5.5026 7.22917 5.83301 6.92383 6.25684C6.62305 6.67611 6.47266 7.15462 6.47266 7.69238C6.47266 8.72689 7.03776 9.54948 8.16797 10.1602C8.58268 10.3835 9.14551 10.6113 9.85645 10.8438C10.5674 11.0716 11.0596 11.2904 11.333 11.5Z" />
</svg>