<!-- Source (stroke width = 0.5px): https://akveo.github.io/eva-icons/#/?searchKey=close&type=outline -->
<!-- Width and height for viewBox for some reason needs to be 17. -->
<svg fill="currentColor" viewBox="0 0 17 17">
  <path
    d="M15.6586 13.878L10.2678 8.49888L10.2677 8.49893L15.6586 13.878ZM8.50014 10.267L8.5 10.2669L3.12167 15.6585L8.50014 10.267ZM13.5452 1.007L8.5 6.06464L3.45445 1.00661C3.13013 0.68224 2.69024 0.5 2.23155 0.5C1.77286 0.5 1.33297 0.68224 1.00865 1.00661C0.684328 1.33097 0.50214 1.77089 0.50214 2.22959C0.50214 2.68828 0.684716 3.12859 1.00904 3.45295L6.06606 8.49893L1.00937 13.5446C0.848063 13.7048 0.720018 13.8953 0.6326 14.1051C0.545066 14.3152 0.5 14.5406 0.5 14.7683C0.5 14.9959 0.545066 15.2213 0.6326 15.4314C0.719885 15.641 0.847673 15.8312 1.00863 15.9912C1.16864 16.1522 1.35887 16.2801 1.56841 16.3674C1.77853 16.4549 2.00392 16.5 2.23155 16.5C2.45918 16.5 2.68456 16.4549 2.89469 16.3674C3.10461 16.2799 3.29562 16.1513 3.45581 15.9899L8.5 10.9332L13.5446 15.9903C13.7048 16.1517 13.8953 16.2799 14.1053 16.3674C14.3154 16.4549 14.5408 16.5 14.7685 16.5C14.9961 16.5 15.2215 16.4549 15.4316 16.3674C15.6411 16.2801 15.8313 16.1522 15.9914 15.9913C16.1523 15.8312 16.2801 15.641 16.3674 15.4314C16.4549 15.2213 16.5 14.9959 16.5 14.7683C16.5 14.5406 16.4549 14.3152 16.3674 14.1051C16.2799 13.8952 16.1514 13.7042 15.99 13.5439L10.9339 8.49893L15.9914 3.45257C16.3157 3.1282 16.4979 2.68828 16.4979 2.22959C16.4979 1.77089 16.3157 1.33097 15.9914 1.00661C15.667 0.682241 15.2271 0.5 14.7685 0.5C14.3098 0.5 13.8695 0.682628 13.5452 1.007Z" />
</svg>