<svg fill="currentColor" viewBox="0 0 16 16">
  <path
    d="M11.9242 7.52841C11.9242 7.29262 11.739 7.10736 11.5032 7.10736H9.17896C9.01054 7.10736 8.89265 6.97262 8.89265 6.82105V4.49684C8.89265 4.26105 8.70738 4.07578 8.4716 4.07578H7.54528C7.30949 4.07578 7.12423 4.26105 7.12423 4.49684V6.82105C7.12423 6.98947 6.98949 7.10736 6.83791 7.10736H4.49686C4.26107 7.10736 4.07581 7.29262 4.07581 7.52841V8.45473C4.07581 8.69052 4.26107 8.87578 4.49686 8.87578H6.82107C6.98949 8.87578 7.10738 9.01052 7.10738 9.1621V11.5032C7.10738 11.7389 7.29265 11.9242 7.52844 11.9242H8.45475C8.69054 11.9242 8.87581 11.7389 8.87581 11.5032V9.17894C8.87581 9.01052 9.01054 8.89262 9.16212 8.89262H11.5032C11.739 8.89262 11.9242 8.70736 11.9242 8.47157V7.52841Z" />
  <path
    d="M13.3726 0H2.62737C1.17895 0 0 1.17895 0 2.62737V13.3726C0 14.8211 1.17895 16 2.62737 16H13.3726C14.8211 16 16 14.8211 16 13.3726V2.62737C16 1.17895 14.8211 0 13.3726 0ZM14.2316 13.3726C14.2316 13.8442 13.8442 14.2316 13.3726 14.2316H2.62737C2.15579 14.2316 1.76842 13.8442 1.76842 13.3726V2.62737C1.76842 2.15579 2.15579 1.76842 2.62737 1.76842H13.3726C13.8442 1.76842 14.2316 2.15579 14.2316 2.62737V13.3726Z" />
</svg>