[
    {
        "id": "lu5tYjSel521BgnmXzytxv6WXpTqkVHR",
        "secret": "3AAVbdQeQItrJ_USp7YllF7OK2LkrRJArzNowb-HXfxJozP6uxMbSuZmSULArgUt",
        "slug": "client1",
        "private_key": "-----BEGIN EC PRIVATE KEY-----\nMHcCAQEEIDtIX/49aHFCW+lRt+Z3bZ0Cm6Qn/s3gYmVt80WuaaY+oAoGCCqGSM49\nAwEHoUQDQgAEcHvFnq9EqjRIPv++mij8C4ZuAWzggxyVd+yhAczRHSWU3Z9mx1pb\nyDlqmyihgwvtrgN7CFw1sME3cT/T1dc9Ew==\n-----END EC PRIVATE KEY-----",
        "roles": {
            "client_credentials": [],
            "password": [
                "role1",
                "role2"
            ],
            "refresh_token": [
                "role1",
                "role2"
            ]
        }
    },
    {
      "id": "poJs4x9zCVmT2RiC6dA9nY36dW2hVhD2",
      "secret": "2JHxjxnG3xcGjuhmizACQ9T8D7e2LrRJMTUQEFowzfxi76yBX3EjtgwQr3nMv7HR",
      "slug": "client2",
      "private_key": "-----BEGIN EC PRIVATE KEY-----\nMHcCAQEEIIYbvMB0zv42mv7AHS+bLpBqXpL+WkjZJTt+vNCD7gGjoAoGCCqGSM49\nAwEHoUQDQgAE647mZg/FY/i9zUVJfPNMfhIysCb+scDZ3hxAo1SsHjn45eZFKFdO\n+EAWXCuuHytlHc5JyrkpGP7OCUdvXo4+8w==\n-----END EC PRIVATE KEY-----",
      "roles": {
          "client_credentials": [],
          "password": [
              "role1",
              "role3"
          ],
          "refresh_token": [
            "role1",
            "role3"
        ]
      }
  }
]
