%YAML 1.1
%TAG !u! tag:unity3d.com,2011:
--- !u!1001 &540376781106991177
PrefabInstance:
  m_ObjectHideFlags: 0
  serializedVersion: 2
  m_Modification:
    m_TransformParent: {fileID: 0}
    m_Modifications:
    - target: {fileID: 1792164124619436, guid: d9c1233c47e77704e867dfabd65d276e, type: 3}
      propertyPath: m_Name
      value: Zucchini_01
      objectReference: {fileID: 0}
    - target: {fileID: 4632228771163486, guid: d9c1233c47e77704e867dfabd65d276e, type: 3}
      propertyPath: m_LocalPosition.x
      value: 2.967377
      objectReference: {fileID: 0}
    - target: {fileID: 4632228771163486, guid: d9c1233c47e77704e867dfabd65d276e, type: 3}
      propertyPath: m_LocalPosition.y
      value: 0.63
      objectReference: {fileID: 0}
    - target: {fileID: 4632228771163486, guid: d9c1233c47e77704e867dfabd65d276e, type: 3}
      propertyPath: m_LocalPosition.z
      value: -0.29
      objectReference: {fileID: 0}
    - target: {fileID: 4632228771163486, guid: d9c1233c47e77704e867dfabd65d276e, type: 3}
      propertyPath: m_LocalRotation.x
      value: 0.000000021855694
      objectReference: {fileID: 0}
    - target: {fileID: 4632228771163486, guid: d9c1233c47e77704e867dfabd65d276e, type: 3}
      propertyPath: m_LocalRotation.y
      value: -0
      objectReference: {fileID: 0}
    - target: {fileID: 4632228771163486, guid: d9c1233c47e77704e867dfabd65d276e, type: 3}
      propertyPath: m_LocalRotation.z
      value: -0
      objectReference: {fileID: 0}
    - target: {fileID: 4632228771163486, guid: d9c1233c47e77704e867dfabd65d276e, type: 3}
      propertyPath: m_LocalRotation.w
      value: 1
      objectReference: {fileID: 0}
    - target: {fileID: 4632228771163486, guid: d9c1233c47e77704e867dfabd65d276e, type: 3}
      propertyPath: m_RootOrder
      value: 0
      objectReference: {fileID: 0}
    - target: {fileID: 4632228771163486, guid: d9c1233c47e77704e867dfabd65d276e, type: 3}
      propertyPath: m_LocalEulerAnglesHint.x
      value: 0
      objectReference: {fileID: 0}
    - target: {fileID: 4632228771163486, guid: d9c1233c47e77704e867dfabd65d276e, type: 3}
      propertyPath: m_LocalEulerAnglesHint.y
      value: 0
      objectReference: {fileID: 0}
    - target: {fileID: 4632228771163486, guid: d9c1233c47e77704e867dfabd65d276e, type: 3}
      propertyPath: m_LocalEulerAnglesHint.z
      value: 0
      objectReference: {fileID: 0}
    - target: {fileID: 4632228771163486, guid: d9c1233c47e77704e867dfabd65d276e, type: 3}
      propertyPath: m_LocalScale.x
      value: 5
      objectReference: {fileID: 0}
    - target: {fileID: 4632228771163486, guid: d9c1233c47e77704e867dfabd65d276e, type: 3}
      propertyPath: m_LocalScale.y
      value: 5
      objectReference: {fileID: 0}
    - target: {fileID: 4632228771163486, guid: d9c1233c47e77704e867dfabd65d276e, type: 3}
      propertyPath: m_LocalScale.z
      value: 5
      objectReference: {fileID: 0}
    m_RemovedComponents: []
  m_SourcePrefab: {fileID: 100100000, guid: d9c1233c47e77704e867dfabd65d276e, type: 3}
