%YAML 1.1
%TAG !u! tag:unity3d.com,2011:
--- !u!1001 &5920527664950376782
PrefabInstance:
  m_ObjectHideFlags: 0
  serializedVersion: 2
  m_Modification:
    m_TransformParent: {fileID: 0}
    m_Modifications:
    - target: {fileID: 1336107517388176, guid: f89c4abd638b29f43bff133c5605e4cf, type: 3}
      propertyPath: m_Name
      value: Cucumber_01
      objectReference: {fileID: 0}
    - target: {fileID: 4496628612075550, guid: f89c4abd638b29f43bff133c5605e4cf, type: 3}
      propertyPath: m_LocalPosition.x
      value: 4.3526554
      objectReference: {fileID: 0}
    - target: {fileID: 4496628612075550, guid: f89c4abd638b29f43bff133c5605e4cf, type: 3}
      propertyPath: m_LocalPosition.y
      value: 1.04
      objectReference: {fileID: 0}
    - target: {fileID: 4496628612075550, guid: f89c4abd638b29f43bff133c5605e4cf, type: 3}
      propertyPath: m_LocalPosition.z
      value: 0.20408311
      objectReference: {fileID: 0}
    - target: {fileID: 4496628612075550, guid: f89c4abd638b29f43bff133c5605e4cf, type: 3}
      propertyPath: m_LocalRotation.x
      value: 0
      objectReference: {fileID: 0}
    - target: {fileID: 4496628612075550, guid: f89c4abd638b29f43bff133c5605e4cf, type: 3}
      propertyPath: m_LocalRotation.y
      value: -0
      objectReference: {fileID: 0}
    - target: {fileID: 4496628612075550, guid: f89c4abd638b29f43bff133c5605e4cf, type: 3}
      propertyPath: m_LocalRotation.z
      value: -0
      objectReference: {fileID: 0}
    - target: {fileID: 4496628612075550, guid: f89c4abd638b29f43bff133c5605e4cf, type: 3}
      propertyPath: m_LocalRotation.w
      value: 1
      objectReference: {fileID: 0}
    - target: {fileID: 4496628612075550, guid: f89c4abd638b29f43bff133c5605e4cf, type: 3}
      propertyPath: m_RootOrder
      value: 0
      objectReference: {fileID: 0}
    - target: {fileID: 4496628612075550, guid: f89c4abd638b29f43bff133c5605e4cf, type: 3}
      propertyPath: m_LocalEulerAnglesHint.x
      value: 0
      objectReference: {fileID: 0}
    - target: {fileID: 4496628612075550, guid: f89c4abd638b29f43bff133c5605e4cf, type: 3}
      propertyPath: m_LocalEulerAnglesHint.y
      value: 0
      objectReference: {fileID: 0}
    - target: {fileID: 4496628612075550, guid: f89c4abd638b29f43bff133c5605e4cf, type: 3}
      propertyPath: m_LocalEulerAnglesHint.z
      value: 0
      objectReference: {fileID: 0}
    - target: {fileID: 4496628612075550, guid: f89c4abd638b29f43bff133c5605e4cf, type: 3}
      propertyPath: m_LocalScale.x
      value: 5
      objectReference: {fileID: 0}
    - target: {fileID: 4496628612075550, guid: f89c4abd638b29f43bff133c5605e4cf, type: 3}
      propertyPath: m_LocalScale.y
      value: 5
      objectReference: {fileID: 0}
    - target: {fileID: 4496628612075550, guid: f89c4abd638b29f43bff133c5605e4cf, type: 3}
      propertyPath: m_LocalScale.z
      value: 5
      objectReference: {fileID: 0}
    m_RemovedComponents: []
  m_SourcePrefab: {fileID: 100100000, guid: f89c4abd638b29f43bff133c5605e4cf, type: 3}
