%YAML 1.1
%TAG !u! tag:unity3d.com,2011:
--- !u!1001 &1872176720022050376
PrefabInstance:
  m_ObjectHideFlags: 0
  serializedVersion: 2
  m_Modification:
    m_TransformParent: {fileID: 0}
    m_Modifications:
    - target: {fileID: 175876, guid: 23d25b2e2d4364dd4b92c52ef40cd36e, type: 3}
      propertyPath: m_Name
      value: PFB_Building_Full
      objectReference: {fileID: 0}
    - target: {fileID: 451208, guid: 23d25b2e2d4364dd4b92c52ef40cd36e, type: 3}
      propertyPath: m_LocalPosition.x
      value: -15.019514
      objectReference: {fileID: 0}
    - target: {fileID: 451208, guid: 23d25b2e2d4364dd4b92c52ef40cd36e, type: 3}
      propertyPath: m_LocalPosition.y
      value: -0.04
      objectReference: {fileID: 0}
    - target: {fileID: 451208, guid: 23d25b2e2d4364dd4b92c52ef40cd36e, type: 3}
      propertyPath: m_LocalPosition.z
      value: 3.9097745
      objectReference: {fileID: 0}
    - target: {fileID: 451208, guid: 23d25b2e2d4364dd4b92c52ef40cd36e, type: 3}
      propertyPath: m_LocalRotation.x
      value: 0
      objectReference: {fileID: 0}
    - target: {fileID: 451208, guid: 23d25b2e2d4364dd4b92c52ef40cd36e, type: 3}
      propertyPath: m_LocalRotation.y
      value: 0
      objectReference: {fileID: 0}
    - target: {fileID: 451208, guid: 23d25b2e2d4364dd4b92c52ef40cd36e, type: 3}
      propertyPath: m_LocalRotation.z
      value: 0
      objectReference: {fileID: 0}
    - target: {fileID: 451208, guid: 23d25b2e2d4364dd4b92c52ef40cd36e, type: 3}
      propertyPath: m_LocalRotation.w
      value: 1
      objectReference: {fileID: 0}
    - target: {fileID: 451208, guid: 23d25b2e2d4364dd4b92c52ef40cd36e, type: 3}
      propertyPath: m_RootOrder
      value: 0
      objectReference: {fileID: 0}
    - target: {fileID: 451208, guid: 23d25b2e2d4364dd4b92c52ef40cd36e, type: 3}
      propertyPath: m_LocalEulerAnglesHint.x
      value: 0
      objectReference: {fileID: 0}
    - target: {fileID: 451208, guid: 23d25b2e2d4364dd4b92c52ef40cd36e, type: 3}
      propertyPath: m_LocalEulerAnglesHint.y
      value: 0
      objectReference: {fileID: 0}
    - target: {fileID: 451208, guid: 23d25b2e2d4364dd4b92c52ef40cd36e, type: 3}
      propertyPath: m_LocalEulerAnglesHint.z
      value: 0
      objectReference: {fileID: 0}
    m_RemovedComponents: []
  m_SourcePrefab: {fileID: 100100000, guid: 23d25b2e2d4364dd4b92c52ef40cd36e, type: 3}
