<?xml version="1.0" encoding="UTF-8" standalone="no"?>
<!-- Created with Inkscape (http://www.inkscape.org/) -->

<svg
   width="49.458035mm"
   height="29.306309mm"
   viewBox="0 0 49.458035 29.306309"
   version="1.1"
   id="svg74207"
   inkscape:version="1.1.1 (3bf5ae0d25, 2021-09-20)"
   sodipodi:docname="arrow_fanout.svg"
   xmlns:inkscape="http://www.inkscape.org/namespaces/inkscape"
   xmlns:sodipodi="http://sodipodi.sourceforge.net/DTD/sodipodi-0.dtd"
   xmlns="http://www.w3.org/2000/svg"
   xmlns:svg="http://www.w3.org/2000/svg">
  <sodipodi:namedview
     id="namedview74209"
     pagecolor="#ffffff"
     bordercolor="#666666"
     borderopacity="1.0"
     inkscape:pageshadow="2"
     inkscape:pageopacity="0.0"
     inkscape:pagecheckerboard="0"
     inkscape:document-units="mm"
     showgrid="false"
     inkscape:zoom="0.74118967"
     inkscape:cx="128.84691"
     inkscape:cy="-39.800878"
     inkscape:window-width="1920"
     inkscape:window-height="1017"
     inkscape:window-x="1192"
     inkscape:window-y="595"
     inkscape:window-maximized="1"
     inkscape:current-layer="g71286" />
  <defs
     id="defs74204">
    <marker
       inkscape:stockid="Arrow2Lstart"
       orient="auto"
       refY="0"
       refX="0"
       id="Arrow2Lstart"
       style="overflow:visible">
      <path
         id="path3786"
         style="font-size:12px;fill-rule:evenodd;stroke-width:0.625;stroke-linejoin:round"
         d="M 8.7185878,4.0337352 -2.2072895,0.01601326 8.7185884,-4.0017078 c -1.7454984,2.3720609 -1.7354408,5.6174519 -6e-7,8.035443 z"
         transform="matrix(1.1,0,0,1.1,1.1,0)"
         inkscape:connector-curvature="0" />
    </marker>
    <marker
       inkscape:stockid="Arrow2Lend"
       orient="auto"
       refY="0"
       refX="0"
       id="Arrow2Lend"
       style="overflow:visible">
      <path
         id="path3789"
         style="font-size:12px;fill-rule:evenodd;stroke-width:0.625;stroke-linejoin:round"
         d="M 8.7185878,4.0337352 -2.2072895,0.01601326 8.7185884,-4.0017078 c -1.7454984,2.3720609 -1.7354408,5.6174519 -6e-7,8.035443 z"
         transform="matrix(-1.1,0,0,-1.1,-1.1,0)"
         inkscape:connector-curvature="0" />
    </marker>
    <marker
       inkscape:stockid="Arrow2Lstart"
       orient="auto"
       refY="0"
       refX="0"
       id="marker74178"
       style="overflow:visible">
      <path
         id="path74176"
         style="font-size:12px;fill-rule:evenodd;stroke-width:0.625;stroke-linejoin:round"
         d="M 8.7185878,4.0337352 -2.2072895,0.01601326 8.7185884,-4.0017078 c -1.7454984,2.3720609 -1.7354408,5.6174519 -6e-7,8.035443 z"
         transform="matrix(1.1,0,0,1.1,1.1,0)"
         inkscape:connector-curvature="0" />
    </marker>
  </defs>
  <g
     inkscape:label="Layer 1"
     inkscape:groupmode="layer"
     id="layer1"
     transform="translate(-70.939253,-159.1918)">
    <g
       id="g71286"
       transform="matrix(0.26458333,0,0,0.26458333,70.70642,79.949091)">
      <text
         xml:space="preserve"
         style="font-style:normal;font-variant:normal;font-weight:normal;font-stretch:normal;line-height:0%;font-family:'CMU Typewriter Text';-inkscape-font-specification:'CMU Typewriter Text';letter-spacing:0px;word-spacing:0;fill:#000000;fill-opacity:1;stroke:none"
         x="29.175781"
         y="410"
         id="text3003-5-3-1-1-4-3-9-1-9-8"
         inkscape:transform-center-y="-4.3164062"><tspan
           sodipodi:role="line"
           id="tspan3005-5-6-1-23-2-6-2-7-6-8"
           x="29.175781"
           y="410"
           style="font-style:normal;font-variant:normal;font-weight:normal;font-stretch:normal;font-size:24px;font-family:'CMU Typewriter Text';-inkscape-font-specification:'CMU Typewriter Text'">sf1 <tspan
   style="font-style:normal;font-variant:normal;font-weight:normal;font-stretch:normal;font-family:'CMU Typewriter Text';-inkscape-font-specification:'CMU Typewriter Text'"
   id="tspan5324">&amp;&amp;&amp;</tspan> sf2</tspan></text>
      <rect
         y="300"
         x="40"
         height="90"
         width="110"
         id="rect2995-2-7-9-9-3"
         style="fill:none;stroke:#000000" />
      <path
         sodipodi:nodetypes="cc"
         inkscape:connector-curvature="0"
         id="path6908-7-6-9-9-2-8"
         d="m 175,365 c -20.62223,0 -23.72301,0 -45,0"
         style="fill:none;stroke:#000000;stroke-width:1px;stroke-linecap:butt;stroke-linejoin:miter;stroke-opacity:1;marker-start:url(#Arrow2Lstart)" />
      <path
         sodipodi:nodetypes="cc"
         inkscape:connector-curvature="0"
         id="path6906-6-7-6-9-1-2"
         d="m 25,345 25,0.0866"
         style="fill:none;stroke:#000000;stroke-width:1px;stroke-linecap:butt;stroke-linejoin:miter;stroke-opacity:1;marker-start:url(#Arrow2Lend);marker-end:none" />
      <path
         sodipodi:nodetypes="cc"
         inkscape:connector-curvature="0"
         id="path6908-7-6-9-9-2-3-6"
         d="m 175,325 c -20.62223,0 -23.72301,0 -45,0"
         style="fill:none;stroke:#000000;stroke-width:1px;stroke-linecap:butt;stroke-linejoin:miter;stroke-opacity:1;marker-start:url(#Arrow2Lstart)" />
      <path
         inkscape:connector-curvature="0"
         id="path9102"
         d="M 50,345 70,325 H 80"
         style="fill:none;stroke:#000000;stroke-width:1px;stroke-linecap:butt;stroke-linejoin:miter;stroke-opacity:1;marker-end:none" />
      <path
         inkscape:connector-curvature="0"
         id="path9110"
         d="m 50,345 20,20 h 10"
         style="fill:none;stroke:#000000;stroke-width:1px;stroke-linecap:butt;stroke-linejoin:miter;stroke-opacity:1;marker-start:none;marker-end:none"
         sodipodi:nodetypes="ccc" />
      <text
         xml:space="preserve"
         style="font-style:italic;font-variant:normal;font-weight:500;font-stretch:normal;line-height:0%;font-family:'CMU Serif';-inkscape-font-specification:'CMU Serif Medium Italic';letter-spacing:0px;word-spacing:0;fill:#000000;fill-opacity:1;stroke:none"
         x="87.105499"
         y="370"
         id="text3003-5-3-1-1-4-5-3-3"
         inkscape:transform-center-y="-4.3164062"><tspan
           sodipodi:role="line"
           id="tspan3005-5-6-1-23-2-0-7-9"
           x="87.105499"
           y="370"
           style="font-style:italic;font-variant:normal;font-weight:500;font-stretch:normal;font-size:24px;font-family:'CMU Serif';-inkscape-font-specification:'CMU Serif Medium Italic'">sf2</tspan></text>
      <rect
         style="fill:none;stroke:#000000;stroke-width:1;stroke-linecap:butt;stroke-linejoin:miter;stroke-miterlimit:4;stroke-dasharray:none"
         id="rect6126-0-6-0-1-8-4-1"
         width="50.000069"
         height="30.000011"
         x="-130.00006"
         y="350"
         transform="scale(-1,1)" />
      <text
         xml:space="preserve"
         style="font-style:italic;font-variant:normal;font-weight:500;font-stretch:normal;line-height:0%;font-family:'CMU Serif';-inkscape-font-specification:'CMU Serif Medium Italic';letter-spacing:0px;word-spacing:0;fill:#000000;fill-opacity:1;stroke:none"
         x="88.209991"
         y="330"
         id="text3003-5-3-1-1-4-5-3-6-22"
         inkscape:transform-center-y="-4.3164062"><tspan
           sodipodi:role="line"
           id="tspan3005-5-6-1-23-2-0-7-1-9"
           x="88.209991"
           y="330"
           style="font-style:italic;font-variant:normal;font-weight:500;font-stretch:normal;font-size:24px;font-family:'CMU Serif';-inkscape-font-specification:'CMU Serif Medium Italic'">sf1</tspan></text>
      <rect
         style="fill:none;stroke:#000000;stroke-width:1;stroke-linecap:butt;stroke-linejoin:miter;stroke-miterlimit:4;stroke-dasharray:none"
         id="rect6126-0-6-0-1-8-4-8-4"
         width="50.000069"
         height="30.000011"
         x="-130.00006"
         y="310"
         transform="scale(-1,1)" />
      <text
         id="text7722-0-54"
         y="350"
         x="0"
         style="font-style:normal;font-variant:normal;font-weight:normal;font-stretch:normal;line-height:0%;font-family:'CMU Typewriter Text';-inkscape-font-specification:'CMU Typewriter Text';letter-spacing:0px;word-spacing:0;fill:#000000;fill-opacity:1;stroke:none"
         xml:space="preserve"><tspan
           y="350"
           x="0"
           id="tspan7724-8-4"
           sodipodi:role="line"
           style="font-style:normal;font-variant:normal;font-weight:normal;font-stretch:normal;font-size:16px;font-family:'CMU Typewriter Text';-inkscape-font-specification:'CMU Typewriter Text'">a</tspan></text>
      <text
         id="text7722-5-4"
         y="330"
         x="180"
         style="font-style:normal;font-variant:normal;font-weight:normal;font-stretch:normal;line-height:0%;font-family:'CMU Typewriter Text';-inkscape-font-specification:'CMU Typewriter Text';letter-spacing:0px;word-spacing:0;fill:#000000;fill-opacity:1;stroke:none"
         xml:space="preserve"><tspan
           y="330"
           x="180"
           id="tspan7724-4-6"
           sodipodi:role="line"
           style="font-style:normal;font-variant:normal;font-weight:normal;font-stretch:normal;font-size:16px;font-family:'CMU Typewriter Text';-inkscape-font-specification:'CMU Typewriter Text'">b</tspan></text>
      <text
         id="text7722-5-9-29"
         y="370"
         x="180"
         style="font-style:normal;font-variant:normal;font-weight:normal;font-stretch:normal;line-height:0%;font-family:'CMU Typewriter Text';-inkscape-font-specification:'CMU Typewriter Text';letter-spacing:0px;word-spacing:0;fill:#000000;fill-opacity:1;stroke:none"
         xml:space="preserve"><tspan
           y="370"
           x="180"
           id="tspan7724-4-1-3"
           sodipodi:role="line"
           style="font-style:normal;font-variant:normal;font-weight:normal;font-stretch:normal;font-size:16px;font-family:'CMU Typewriter Text';-inkscape-font-specification:'CMU Typewriter Text'">c</tspan></text>
    </g>
  </g>
</svg>
