<?xml version="1.0" encoding="UTF-8" standalone="no"?>
<!-- Created with Inkscape (http://www.inkscape.org/) -->

<svg
   width="65.333031mm"
   height="18.691223mm"
   viewBox="0 0 65.333031 18.691223"
   version="1.1"
   id="svg73227"
   inkscape:version="1.1.1 (3bf5ae0d25, 2021-09-20)"
   sodipodi:docname="arrow_rcompose_.svg"
   xmlns:inkscape="http://www.inkscape.org/namespaces/inkscape"
   xmlns:sodipodi="http://sodipodi.sourceforge.net/DTD/sodipodi-0.dtd"
   xmlns="http://www.w3.org/2000/svg"
   xmlns:svg="http://www.w3.org/2000/svg">
  <sodipodi:namedview
     id="namedview73229"
     pagecolor="#ffffff"
     bordercolor="#666666"
     borderopacity="1.0"
     inkscape:pageshadow="2"
     inkscape:pageopacity="0.0"
     inkscape:pagecheckerboard="0"
     inkscape:document-units="mm"
     showgrid="false"
     inkscape:zoom="2.9647587"
     inkscape:cx="119.57128"
     inkscape:cy="25.803112"
     inkscape:window-width="1920"
     inkscape:window-height="1017"
     inkscape:window-x="1192"
     inkscape:window-y="595"
     inkscape:window-maximized="1"
     inkscape:current-layer="layer1" />
  <defs
     id="defs73224">
    <marker
       inkscape:stockid="Arrow2Lend"
       orient="auto"
       refY="0"
       refX="0"
       id="Arrow2Lend"
       style="overflow:visible">
      <path
         id="path3789"
         style="font-size:12px;fill-rule:evenodd;stroke-width:0.625;stroke-linejoin:round"
         d="M 8.7185878,4.0337352 -2.2072895,0.01601326 8.7185884,-4.0017078 c -1.7454984,2.3720609 -1.7354408,5.6174519 -6e-7,8.035443 z"
         transform="matrix(-1.1,0,0,-1.1,-1.1,0)"
         inkscape:connector-curvature="0" />
    </marker>
    <marker
       inkscape:stockid="Arrow2Lstart"
       orient="auto"
       refY="0"
       refX="0"
       id="Arrow2Lstart"
       style="overflow:visible">
      <path
         id="path3786"
         style="font-size:12px;fill-rule:evenodd;stroke-width:0.625;stroke-linejoin:round"
         d="M 8.7185878,4.0337352 -2.2072895,0.01601326 8.7185884,-4.0017078 c -1.7454984,2.3720609 -1.7354408,5.6174519 -6e-7,8.035443 z"
         transform="matrix(1.1,0,0,1.1,1.1,0)"
         inkscape:connector-curvature="0" />
    </marker>
    <marker
       inkscape:stockid="Arrow2Lstart"
       orient="auto"
       refY="0"
       refX="0"
       id="marker3900"
       style="overflow:visible">
      <path
         inkscape:connector-curvature="0"
         id="path3902"
         style="font-size:12px;fill-rule:evenodd;stroke-width:0.625;stroke-linejoin:round"
         d="M 8.7185878,4.0337352 -2.2072895,0.01601326 8.7185884,-4.0017078 c -1.7454984,2.3720609 -1.7354408,5.6174519 -6e-7,8.035443 z"
         transform="matrix(1.1,0,0,1.1,1.1,0)" />
    </marker>
  </defs>
  <g
     inkscape:label="Layer 1"
     inkscape:groupmode="layer"
     id="layer1"
     transform="translate(-83.706079,-123.09069)">
    <g
       aria-label="sf1 &gt;&gt;&gt; sf2"
       id="text3003-5-3-1-1-4-3-9-1-9"
       style="font-size:3.175px;line-height:0%;font-family:'CMU Typewriter Text';-inkscape-font-specification:'CMU Typewriter Text';letter-spacing:0px;word-spacing:0;stroke-width:0.264583"
       inkscape:transform-center-y="-4.3164062">
      <path
         d="m 100.57956,141.52157 c 0,0.1016 0,0.26035 0.1905,0.26035 0.0571,0 0.15875,-0.006 0.23495,-0.2413 0.31115,0.2286 0.6477,0.2413 0.8255,0.2413 1.0033,0 1.2065,-0.52705 1.2065,-0.83185 0,-0.6604 -0.81915,-0.79375 -1.02235,-0.8255 -0.14605,-0.0254 -0.27305,-0.0445 -0.4318,-0.0762 -0.18415,-0.0254 -0.61595,-0.1016 -0.61595,-0.34925 0,-0.1651 0.2032,-0.36195 0.80645,-0.36195 0.52705,0 0.61595,0.1905 0.635,0.3556 0.006,0.10795 0.019,0.2159 0.2159,0.2159 0.22225,0 0.22225,-0.13335 0.22225,-0.26035 v -0.43815 c 0,-0.1016 0,-0.26035 -0.1905,-0.26035 -0.1524,0 -0.1778,0.0889 -0.1905,0.13335 -0.2794,-0.13335 -0.5588,-0.13335 -0.67945,-0.13335 -1.06045,0 -1.2065,0.5207 -1.2065,0.7493 0,0.5842 0.66675,0.69215 1.25095,0.78105 0.31115,0.0508 0.81915,0.13335 0.81915,0.4699 0,0.23495 -0.23495,0.4445 -0.8128,0.4445 -0.29845,0 -0.65405,-0.0698 -0.8128,-0.56515 -0.0318,-0.1143 -0.0572,-0.18415 -0.22225,-0.18415 -0.22225,0 -0.22225,0.13335 -0.22225,0.26035 z"
         style="font-size:6.35px"
         id="path91" />
      <path
         d="m 103.72281,141.54697 c 0,0.19685 0.1651,0.19685 0.26035,0.19685 h 1.72085 c 0.0953,0 0.26035,0 0.26035,-0.1905 0,-0.19685 -0.1651,-0.19685 -0.26035,-0.19685 h -0.64135 v -1.96215 h 0.7747 c 0.0952,0 0.254,0 0.254,-0.1905 0,-0.19685 -0.1524,-0.19685 -0.254,-0.19685 h -0.7747 v -0.29845 c 0,-0.4953 0.42545,-0.4953 0.61595,-0.4953 0,0.0254 0.0571,0.27305 0.2794,0.27305 0.127,0 0.27305,-0.1016 0.27305,-0.2794 0,-0.381 -0.508,-0.381 -0.6096,-0.381 -0.508,0 -0.99695,0.2921 -0.99695,0.84455 v 0.33655 h -0.635 c -0.1016,0 -0.26035,0 -0.26035,0.19685 0,0.1905 0.15875,0.1905 0.254,0.1905 h 0.64135 v 1.96215 h -0.64135 c -0.0952,0 -0.26035,0 -0.26035,0.1905 z"
         style="font-size:6.35px"
         id="path93" />
      <path
         d="m 107.45661,138.76567 c 0,0.15875 0.1143,0.1905 0.20955,0.1905 0.12065,0 0.381,-0.0381 0.6604,-0.2794 v 2.6797 h -0.57785 c -0.1016,0 -0.254,0 -0.254,0.19685 0,0.1905 0.15875,0.1905 0.254,0.1905 h 1.59385 c 0.0952,0 0.254,0 0.254,-0.1905 0,-0.19685 -0.1524,-0.19685 -0.254,-0.19685 h -0.57785 v -3.302 c 0,-0.1016 0,-0.26035 -0.1905,-0.26035 -0.12065,0 -0.15875,0.0762 -0.1905,0.1524 -0.2413,0.53975 -0.5715,0.6096 -0.69215,0.6223 -0.1016,0.006 -0.23495,0.0191 -0.23495,0.19685 z"
         style="font-size:6.35px"
         id="path95" />
      <path
         d="m 113.81295,141.17232 c 0,0.1143 0.1016,0.1905 0.19685,0.1905 0.0635,0 0.1016,-0.0254 0.14605,-0.0508 l 2.11455,-1.30175 c 0.0381,-0.0254 0.15875,-0.0889 0.15875,-0.20955 0,-0.127 -0.1143,-0.18415 -0.15875,-0.20955 l -2.11455,-1.2954 c -0.0444,-0.0254 -0.0825,-0.0508 -0.14605,-0.0508 -0.10795,0 -0.19685,0.0952 -0.19685,0.1905 0,0.12065 0.1016,0.17145 0.1397,0.19685 l 1.75895,1.0795 c 0.0508,0.0318 0.0952,0.0635 0.14605,0.0889 l -1.905,1.17475 c -0.0635,0.0445 -0.1397,0.0889 -0.1397,0.19685 z"
         style="font-size:6.35px"
         id="path97" />
      <path
         d="m 117.1467,141.17232 c 0,0.1143 0.1016,0.1905 0.19685,0.1905 0.0635,0 0.1016,-0.0254 0.14605,-0.0508 l 2.11455,-1.30175 c 0.0381,-0.0254 0.15875,-0.0889 0.15875,-0.20955 0,-0.127 -0.1143,-0.18415 -0.15875,-0.20955 l -2.11455,-1.2954 c -0.0444,-0.0254 -0.0825,-0.0508 -0.14605,-0.0508 -0.10795,0 -0.19685,0.0952 -0.19685,0.1905 0,0.12065 0.1016,0.17145 0.1397,0.19685 l 1.75895,1.0795 c 0.0508,0.0318 0.0953,0.0635 0.14605,0.0889 l -1.905,1.17475 c -0.0635,0.0445 -0.1397,0.0889 -0.1397,0.19685 z"
         style="font-size:6.35px"
         id="path99" />
      <path
         d="m 120.48045,141.17232 c 0,0.1143 0.1016,0.1905 0.19685,0.1905 0.0635,0 0.1016,-0.0254 0.14605,-0.0508 l 2.11455,-1.30175 c 0.0381,-0.0254 0.15875,-0.0889 0.15875,-0.20955 0,-0.127 -0.1143,-0.18415 -0.15875,-0.20955 l -2.11455,-1.2954 c -0.0445,-0.0254 -0.0826,-0.0508 -0.14605,-0.0508 -0.10795,0 -0.19685,0.0952 -0.19685,0.1905 0,0.12065 0.1016,0.17145 0.1397,0.19685 l 1.75895,1.0795 c 0.0508,0.0318 0.0953,0.0635 0.14605,0.0889 l -1.905,1.17475 c -0.0635,0.0445 -0.1397,0.0889 -0.1397,0.19685 z"
         style="font-size:6.35px"
         id="path101" />
      <path
         d="m 127.24954,141.52157 c 0,0.1016 0,0.26035 0.1905,0.26035 0.0572,0 0.15875,-0.006 0.23495,-0.2413 0.31115,0.2286 0.6477,0.2413 0.8255,0.2413 1.0033,0 1.2065,-0.52705 1.2065,-0.83185 0,-0.6604 -0.81915,-0.79375 -1.02235,-0.8255 -0.14605,-0.0254 -0.27305,-0.0445 -0.4318,-0.0762 -0.18415,-0.0254 -0.61595,-0.1016 -0.61595,-0.34925 0,-0.1651 0.2032,-0.36195 0.80645,-0.36195 0.52705,0 0.61595,0.1905 0.635,0.3556 0.006,0.10795 0.019,0.2159 0.2159,0.2159 0.22225,0 0.22225,-0.13335 0.22225,-0.26035 v -0.43815 c 0,-0.1016 0,-0.26035 -0.1905,-0.26035 -0.1524,0 -0.1778,0.0889 -0.1905,0.13335 -0.2794,-0.13335 -0.5588,-0.13335 -0.67945,-0.13335 -1.06045,0 -1.2065,0.5207 -1.2065,0.7493 0,0.5842 0.66675,0.69215 1.25095,0.78105 0.31115,0.0508 0.81915,0.13335 0.81915,0.4699 0,0.23495 -0.23495,0.4445 -0.8128,0.4445 -0.29845,0 -0.65405,-0.0698 -0.8128,-0.56515 -0.0318,-0.1143 -0.0572,-0.18415 -0.22225,-0.18415 -0.22225,0 -0.22225,0.13335 -0.22225,0.26035 z"
         style="font-size:6.35px"
         id="path103" />
      <path
         d="m 130.39279,141.54697 c 0,0.19685 0.1651,0.19685 0.26035,0.19685 h 1.72085 c 0.0953,0 0.26035,0 0.26035,-0.1905 0,-0.19685 -0.1651,-0.19685 -0.26035,-0.19685 h -0.64135 v -1.96215 h 0.7747 c 0.0952,0 0.254,0 0.254,-0.1905 0,-0.19685 -0.1524,-0.19685 -0.254,-0.19685 h -0.7747 v -0.29845 c 0,-0.4953 0.42545,-0.4953 0.61595,-0.4953 0,0.0254 0.0572,0.27305 0.2794,0.27305 0.127,0 0.27305,-0.1016 0.27305,-0.2794 0,-0.381 -0.508,-0.381 -0.6096,-0.381 -0.508,0 -0.99695,0.2921 -0.99695,0.84455 v 0.33655 h -0.635 c -0.1016,0 -0.26035,0 -0.26035,0.19685 0,0.1905 0.15875,0.1905 0.254,0.1905 h 0.64135 v 1.96215 h -0.64135 c -0.0953,0 -0.26035,0 -0.26035,0.1905 z"
         style="font-size:6.35px"
         id="path105" />
      <path
         d="m 133.79004,141.54697 c 0,0.19685 0.15875,0.19685 0.26035,0.19685 h 2.15265 c 0.20955,0 0.254,-0.0572 0.254,-0.26035 v -0.1651 c 0,-0.12065 0,-0.26035 -0.2159,-0.26035 -0.22225,0 -0.22225,0.12065 -0.22225,0.29845 h -1.5113 c 0.37465,-0.32385 0.98425,-0.8001 1.2573,-1.0541 0.40005,-0.3556 0.69215,-0.762 0.69215,-1.27 0,-0.762 -0.64135,-1.23825 -1.41605,-1.23825 -0.7493,0 -1.25095,0.5207 -1.25095,1.06045 0,0.23495 0.1778,0.3048 0.28575,0.3048 0.13335,0 0.2794,-0.10795 0.2794,-0.28575 0,-0.0762 -0.0317,-0.15875 -0.0889,-0.2032 0.0952,-0.2921 0.3937,-0.48895 0.74295,-0.48895 0.5207,0 1.00965,0.2921 1.00965,0.8509 0,0.4445 -0.31115,0.8128 -0.73025,1.16205 l -1.40335,1.1811 c -0.0572,0.0508 -0.0952,0.0825 -0.0952,0.17145 z"
         style="font-size:6.35px"
         id="path107" />
    </g>
    <rect
       y="123.22298"
       x="94.05658"
       height="13.229151"
       width="44.979176"
       id="rect2995-2"
       style="fill:none;stroke:#000000;stroke-width:0.264583" />
    <path
       sodipodi:nodetypes="cc"
       inkscape:connector-curvature="0"
       id="path6906-6"
       d="m 90.087829,129.83756 9.260417,0.0229"
       style="fill:none;stroke:#000000;stroke-width:0.264583px;stroke-linecap:butt;stroke-linejoin:miter;stroke-opacity:1;marker-start:url(#Arrow2Lend);marker-end:none" />
    <path
       sodipodi:nodetypes="cc"
       inkscape:connector-curvature="0"
       id="path6908-7"
       d="m 145.65033,129.83756 c -5.4563,0 -6.27671,0 -11.90625,0"
       style="fill:none;stroke:#000000;stroke-width:0.264583px;stroke-linecap:butt;stroke-linejoin:miter;stroke-opacity:1;marker-start:url(#Arrow2Lstart)" />
    <path
       sodipodi:nodetypes="csc"
       inkscape:connector-curvature="0"
       id="path6908-7-6"
       d="m 120.51491,129.83756 c -2.72815,0 -2.04718,1e-5 -2.64583,1e-5 -0.59864,0 -2.4769,-1e-5 -5.29167,-1e-5"
       style="fill:none;stroke:#000000;stroke-width:0.264583px;stroke-linecap:butt;stroke-linejoin:miter;stroke-opacity:1;marker-start:none;marker-mid:url(#marker3900)" />
    <g
       aria-label="sf2"
       id="text3003-5-3-1-1-4-5-3-2"
       style="font-style:italic;font-weight:500;font-size:3.175px;line-height:0%;font-family:'CMU Serif';-inkscape-font-specification:'CMU Serif Medium Italic';letter-spacing:0px;word-spacing:0;stroke-width:0.264583"
       inkscape:transform-center-y="-4.3164062">
      <path
         d="m 122.87749,130.61438 c 0,0.38735 0.3683,0.61595 0.81915,0.61595 0.9525,0 1.1938,-0.7747 1.1938,-1.0668 0,-0.55245 -0.4953,-0.66675 -0.75565,-0.7239 -0.1778,-0.0381 -0.4064,-0.0889 -0.4064,-0.36195 0,-0.1524 0.13335,-0.5842 0.64135,-0.5842 0.17145,0 0.4064,0.0635 0.47625,0.31115 -0.2032,0.0254 -0.254,0.19685 -0.254,0.26035 0,0.0699 0.0381,0.1778 0.1905,0.1778 0.10795,0 0.27305,-0.0762 0.27305,-0.34925 0,-0.2921 -0.26035,-0.53975 -0.67945,-0.53975 -0.74295,0 -1.0033,0.6096 -1.0033,0.9398 0,0.48895 0.41275,0.57785 0.59055,0.61595 0.2794,0.0635 0.56515,0.127 0.56515,0.4699 0,0.2032 -0.17145,0.7112 -0.8255,0.7112 -0.1397,0 -0.508,-0.0318 -0.6096,-0.3556 0.32385,-0.0317 0.32385,-0.29845 0.32385,-0.31115 0,-0.12065 -0.0826,-0.2032 -0.2159,-0.2032 -0.14605,0 -0.32385,0.10795 -0.32385,0.3937 z"
         style="font-size:6.35px"
         id="path81" />
      <path
         d="m 124.82693,132.04313 c 0,0.28575 0.27305,0.4191 0.508,0.4191 0.6604,0 0.92075,-1.3335 0.9652,-1.5621 l 0.4445,-2.27965 h 0.5207 c 0.10795,0 0.17145,0 0.17145,-0.1143 0,-0.0825 -0.0508,-0.0825 -0.15875,-0.0825 h -0.4953 c 0.0889,-0.4699 0.10795,-0.5842 0.2032,-1.0287 0.0508,-0.23495 0.12065,-0.5715 0.34925,-0.5715 0.0508,0 0.18415,0.0127 0.2667,0.1143 -0.1905,0.0318 -0.2794,0.18415 -0.2794,0.31115 0,0.1397 0.1143,0.2032 0.2159,0.2032 0.15875,0 0.3175,-0.127 0.3175,-0.34925 0,-0.27305 -0.26035,-0.4191 -0.5207,-0.4191 -0.6223,0 -0.78105,0.8255 -0.8255,1.0414 l -0.13335,0.6985 h -0.4191 c -0.1016,0 -0.17145,0 -0.17145,0.127 0,0.0698 0.0635,0.0698 0.15875,0.0698 h 0.3937 l -0.46355,2.36855 c -0.0762,0.3937 -0.1397,0.65405 -0.1778,0.7874 -0.0508,0.2159 -0.13335,0.5461 -0.36195,0.5461 -0.0635,0 -0.18415,-0.019 -0.254,-0.1143 0.1905,-0.0317 0.2794,-0.18415 0.2794,-0.31115 0,-0.1397 -0.1143,-0.2032 -0.2159,-0.2032 -0.15875,0 -0.3175,0.127 -0.3175,0.34925 z"
         style="font-size:6.35px"
         id="path83" />
      <path
         d="m 127.46218,131.23668 c 0,0.0635 0.0635,0.0635 0.0952,0.0635 0.0762,0 0.0889,-0.0127 0.10795,-0.0825 0.0508,-0.1778 0.1651,-0.4064 0.3556,-0.4064 0.2032,0 0.381,0.127 0.53975,0.23495 0.1651,0.1143 0.36195,0.254 0.61595,0.254 0.73025,0 1.02235,-1.1049 1.02235,-1.17475 0,-0.0635 -0.0508,-0.0635 -0.0952,-0.0635 -0.0762,0 -0.0825,0.006 -0.10795,0.10795 -0.0889,0.26035 -0.33655,0.6858 -0.762,0.6858 -0.1778,0 -0.42545,-0.0508 -0.52705,-0.0762 -0.2286,-0.0508 -0.47625,-0.10795 -0.6731,-0.10795 -0.0699,0 -0.127,0.0127 -0.1397,0.0191 0.3175,-0.5461 0.78105,-0.80645 0.9779,-0.92075 0.9779,-0.55245 1.55575,-0.94615 1.55575,-1.7653 0,-0.73025 -0.4953,-1.07315 -0.9906,-1.07315 -0.9398,0 -1.4605,1.2827 -1.4605,1.69545 0,0.127 0.0381,0.40005 0.32385,0.40005 0.50165,0 0.76835,-0.762 0.76835,-1.0033 0,-0.1143 -0.0571,-0.33655 -0.1397,-0.33655 -0.0381,0 -0.0699,0.0318 -0.0699,0.0699 0,0.0127 0,0.0254 0.006,0.0381 0.0381,0.0762 0.0635,0.15875 0.0635,0.23495 0,0.18415 -0.23495,0.85725 -0.6223,0.85725 -0.0762,0 -0.1397,-0.0317 -0.1397,-0.20955 0,-0.41275 0.47625,-1.60655 1.25095,-1.60655 0.26035,0 0.5588,0.17145 0.5588,0.6985 0,0.92075 -0.55245,1.45415 -1.1811,1.8288 -0.28575,0.17145 -0.55245,0.32385 -0.81915,0.65405 -0.4445,0.5334 -0.51435,0.9779 -0.51435,0.98425 z"
         style="font-size:6.35px"
         id="path85" />
    </g>
    <rect
       style="fill:none;stroke:#000000;stroke-width:0.264583;stroke-linecap:butt;stroke-linejoin:miter;stroke-miterlimit:4;stroke-dasharray:none"
       id="rect6126-0-6-0-1-8-4-9"
       width="13.229185"
       height="7.9375029"
       x="-133.74408"
       y="125.86881"
       transform="scale(-1,1)" />
    <g
       aria-label="sf1"
       id="text3003-5-3-1-1-4-5-3-6-3"
       style="font-style:italic;font-weight:500;font-size:3.175px;line-height:0%;font-family:'CMU Serif';-inkscape-font-specification:'CMU Serif Medium Italic';letter-spacing:0px;word-spacing:0;stroke-width:0.264583"
       inkscape:transform-center-y="-4.3164062">
      <path
         d="m 102.00305,130.61438 c 0,0.38735 0.3683,0.61595 0.81915,0.61595 0.9525,0 1.1938,-0.7747 1.1938,-1.0668 0,-0.55245 -0.4953,-0.66675 -0.75565,-0.7239 -0.1778,-0.0381 -0.4064,-0.0889 -0.4064,-0.36195 0,-0.1524 0.13335,-0.5842 0.64135,-0.5842 0.17145,0 0.4064,0.0635 0.47625,0.31115 -0.2032,0.0254 -0.254,0.19685 -0.254,0.26035 0,0.0699 0.0381,0.1778 0.1905,0.1778 0.10795,0 0.27305,-0.0762 0.27305,-0.34925 0,-0.2921 -0.26035,-0.53975 -0.67945,-0.53975 -0.74295,0 -1.0033,0.6096 -1.0033,0.9398 0,0.48895 0.41275,0.57785 0.59055,0.61595 0.2794,0.0635 0.56515,0.127 0.56515,0.4699 0,0.2032 -0.17145,0.7112 -0.8255,0.7112 -0.1397,0 -0.508,-0.0318 -0.6096,-0.3556 0.32385,-0.0317 0.32385,-0.29845 0.32385,-0.31115 0,-0.12065 -0.0825,-0.2032 -0.2159,-0.2032 -0.14605,0 -0.32385,0.10795 -0.32385,0.3937 z"
         style="font-size:6.35px"
         id="path74" />
      <path
         d="m 103.95249,132.04313 c 0,0.28575 0.27305,0.4191 0.508,0.4191 0.6604,0 0.92075,-1.3335 0.9652,-1.5621 l 0.4445,-2.27965 h 0.5207 c 0.10795,0 0.17145,0 0.17145,-0.1143 0,-0.0825 -0.0508,-0.0825 -0.15875,-0.0825 h -0.4953 c 0.0889,-0.4699 0.10795,-0.5842 0.2032,-1.0287 0.0508,-0.23495 0.12065,-0.5715 0.34925,-0.5715 0.0508,0 0.18415,0.0127 0.2667,0.1143 -0.1905,0.0318 -0.2794,0.18415 -0.2794,0.31115 0,0.1397 0.1143,0.2032 0.2159,0.2032 0.15875,0 0.3175,-0.127 0.3175,-0.34925 0,-0.27305 -0.26035,-0.4191 -0.5207,-0.4191 -0.6223,0 -0.78105,0.8255 -0.8255,1.0414 l -0.13335,0.6985 h -0.4191 c -0.1016,0 -0.17145,0 -0.17145,0.127 0,0.0698 0.0635,0.0698 0.15875,0.0698 h 0.3937 l -0.46355,2.36855 c -0.0762,0.3937 -0.1397,0.65405 -0.1778,0.7874 -0.0508,0.2159 -0.13335,0.5461 -0.36195,0.5461 -0.0635,0 -0.18415,-0.019 -0.254,-0.1143 0.1905,-0.0317 0.2794,-0.18415 0.2794,-0.31115 0,-0.1397 -0.1143,-0.2032 -0.2159,-0.2032 -0.15875,0 -0.3175,0.127 -0.3175,0.34925 z"
         style="font-size:6.35px"
         id="path76" />
      <path
         d="m 106.79729,131.08428 c 0,0.0762 0.0699,0.0762 0.0952,0.0762 0.27305,0 0.5588,-0.019 0.83185,-0.019 0.2794,0 0.5715,0.019 0.8509,0.019 0.0444,0 0.127,0 0.127,-0.12065 0,-0.0762 -0.0635,-0.0762 -0.1651,-0.0762 h -0.0508 c -0.0825,0 -0.1905,-0.006 -0.27305,-0.0127 -0.1397,-0.019 -0.1778,-0.0254 -0.1778,-0.1143 0,-0.0381 0.0127,-0.0953 0.0191,-0.12065 l 0.90805,-3.62585 c 0.006,-0.0191 0.0191,-0.0699 0.0191,-0.0825 0,-0.0508 -0.0381,-0.0762 -0.0762,-0.0762 -0.0381,0 -0.0444,0.006 -0.12065,0.1016 -0.48895,0.65405 -0.93345,0.6985 -1.1176,0.71755 -0.0318,0.006 -0.1016,0.0127 -0.1016,0.12065 0,0.0762 0.0762,0.0762 0.1016,0.0762 0.0952,0 0.4064,-0.0381 0.70485,-0.26035 l -0.7493,3.0099 c -0.0508,0.2032 -0.1016,0.2667 -0.5969,0.2667 h -0.0508 c -0.10795,0 -0.1778,0 -0.1778,0.12065 z"
         style="font-size:6.35px"
         id="path78" />
    </g>
    <rect
       style="fill:none;stroke:#000000;stroke-width:0.264583;stroke-linecap:butt;stroke-linejoin:miter;stroke-miterlimit:4;stroke-dasharray:none"
       id="rect6126-0-6-0-1-8-4-8-5"
       width="13.229185"
       height="7.9375029"
       x="-112.57742"
       y="125.86881"
       transform="scale(-1,1)" />
    <g
       aria-label="a"
       id="text7722-0-8"
       style="font-size:3.175px;line-height:0%;font-family:'CMU Typewriter Text';-inkscape-font-specification:'CMU Typewriter Text';letter-spacing:0px;word-spacing:0;stroke-width:0.264583">
      <path
         d="m 83.706077,130.61861 c 0,0.2921 0.2667,0.56727 0.698499,0.56727 0.156633,0 0.4191,-0.0296 0.618066,-0.16087 0.09313,0.13123 0.296333,0.13547 0.4572,0.13547 0.118533,0 0.211667,0 0.211667,-0.13124 0,-0.127 -0.105834,-0.127 -0.169334,-0.127 -0.1778,0 -0.220133,-0.0212 -0.253999,-0.0339 v -0.9144 c 0,-0.30057 -0.2286,-0.65617 -0.8382,-0.65617 -0.182033,0 -0.613833,0 -0.613833,0.30903 0,0.127 0.0889,0.19474 0.1905,0.19474 0.0635,0 0.182033,-0.0381 0.186267,-0.19474 0,-0.0339 0.0042,-0.0381 0.0889,-0.0466 0.05927,-0.004 0.1143,-0.004 0.1524,-0.004 0.321733,0 0.541866,0.13124 0.541866,0.4318 -0.7493,0.0127 -1.269999,0.22437 -1.269999,0.63077 z m 0.2921,0 c 0,-0.20743 0.364066,-0.36407 0.977899,-0.381 v 0.3556 c 0,0.0974 0,0.18627 -0.1651,0.26247 -0.1524,0.072 -0.3429,0.072 -0.376766,0.072 -0.262467,0 -0.436033,-0.14393 -0.436033,-0.30903 z"
         style="font-size:4.23333px"
         id="path71" />
    </g>
    <g
       aria-label="b"
       id="text7722-5-8"
       style="font-size:3.175px;line-height:0%;font-family:'CMU Typewriter Text';-inkscape-font-specification:'CMU Typewriter Text';letter-spacing:0px;word-spacing:0;stroke-width:0.264583">
      <path
         d="m 147.02405,128.70515 c 0,0.127 0.11007,0.127 0.16933,0.127 h 0.1905 v 2.15476 c 0,0.0847 0,0.17357 0.14817,0.17357 0.14393,0 0.14393,-0.0847 0.14393,-0.1905 0.17357,0.1778 0.3556,0.2159 0.49107,0.2159 0.46143,0 0.87207,-0.40217 0.87207,-0.9398 0,-0.5207 -0.37677,-0.93557 -0.8255,-0.93557 -0.2032,0 -0.3937,0.0762 -0.53764,0.20743 v -0.77046 c 0,-0.13123 -0.0254,-0.17357 -0.16933,-0.17357 h -0.30903 c -0.0677,0 -0.17357,0 -0.17357,0.13124 z m 0.65193,1.64676 v -0.30903 c 0,-0.24977 0.24554,-0.47414 0.51224,-0.47414 0.31326,0 0.5588,0.30904 0.5588,0.67734 0,0.4064 -0.29634,0.68156 -0.59267,0.68156 -0.3302,0 -0.47837,-0.37253 -0.47837,-0.57573 z"
         style="font-size:4.23333px"
         id="path88" />
    </g>
  </g>
</svg>
