<?xml version="1.0" encoding="UTF-8" standalone="no"?>
<svg
   viewBox="0 0 450.21296 151"
   version="1.1"
   id="svg123"
   sodipodi:docname="yampa_pSwitch.svg"
   width="450.21295"
   height="151"
   inkscape:version="1.1.1 (3bf5ae0d25, 2021-09-20)"
   xmlns:inkscape="http://www.inkscape.org/namespaces/inkscape"
   xmlns:sodipodi="http://sodipodi.sourceforge.net/DTD/sodipodi-0.dtd"
   xmlns:xlink="http://www.w3.org/1999/xlink"
   xmlns="http://www.w3.org/2000/svg"
   xmlns:svg="http://www.w3.org/2000/svg">
  <sodipodi:namedview
     id="namedview125"
     pagecolor="#ffffff"
     bordercolor="#666666"
     borderopacity="1.0"
     inkscape:pageshadow="2"
     inkscape:pageopacity="0.0"
     inkscape:pagecheckerboard="0"
     showgrid="false"
     inkscape:zoom="3.1622956"
     inkscape:cx="245.86569"
     inkscape:cy="68.462922"
     inkscape:window-width="1920"
     inkscape:window-height="1017"
     inkscape:window-x="1192"
     inkscape:window-y="595"
     inkscape:window-maximized="1"
     inkscape:current-layer="svg123" />
  <defs
     id="defs5">
    <path
       id="a"
       fill-rule="evenodd"
       stroke="#000000"
       stroke-width="0.8"
       d="m 2.8,0 a 3,3 0 0 1 -3,3 v -6 a 3,3 0 0 1 3,3 z" />
    <path
       id="b"
       fill-rule="evenodd"
       stroke-linejoin="round"
       stroke-width="0.6"
       d="m 8.7,4 -11,-4 11,-4 a 6.8,6.8 0 0 0 0,8 z"
       font-size="12px" />
    <path
       id="f"
       fill="none"
       stroke="#000000"
       stroke-width="1.5"
       d="m 150,55 a 15,15 0 1 1 -30,0 15,15 0 0 1 30,0 z" />
  </defs>
  <defs
     id="defs25">
    <marker
       id="h"
       orient="auto"
       overflow="visible"
       refX="0"
       refY="0">
      <use
         xlink:href="#a"
         fill-rule="evenodd"
         stroke-width="0.8"
         id="use7"
         x="0"
         y="0"
         width="100%"
         height="100%" />
    </marker>
    <marker
       id="c"
       orient="auto"
       overflow="visible"
       refX="0"
       refY="0">
      <use
         xlink:href="#b"
         fill-rule="evenodd"
         stroke-linejoin="round"
         stroke-width="0.6"
         font-size="12px"
         transform="scale(-0.6)"
         id="use10"
         x="0"
         y="0"
         width="100%"
         height="100%" />
    </marker>
    <marker
       id="e"
       orient="auto"
       overflow="visible"
       refX="0"
       refY="0">
      <path
         fill="#ffffff"
         fill-rule="evenodd"
         stroke="#000000"
         stroke-width="0.5"
         d="M 0,-2.8 -2.8,0 0,2.8 2.8,0 Z"
         id="path13" />
    </marker>
    <marker
       id="g"
       orient="auto"
       overflow="visible"
       refX="0"
       refY="0">
      <use
         xlink:href="#b"
         fill-rule="evenodd"
         stroke-linejoin="round"
         stroke-width="0.6"
         font-size="12px"
         transform="scale(-0.6)"
         id="use16"
         x="0"
         y="0"
         width="100%"
         height="100%" />
    </marker>
    <marker
       id="i"
       orient="auto"
       overflow="visible"
       refX="0"
       refY="0">
      <use
         xlink:href="#a"
         fill-rule="evenodd"
         stroke-width="0.8"
         id="use19"
         x="0"
         y="0"
         width="100%"
         height="100%" />
    </marker>
    <marker
       id="d"
       orient="auto"
       overflow="visible"
       refX="0"
       refY="0">
      <use
         xlink:href="#b"
         fill-rule="evenodd"
         stroke-linejoin="round"
         stroke-width="0.6"
         font-size="12px"
         transform="scale(-0.6)"
         id="use22"
         x="0"
         y="0"
         width="100%"
         height="100%" />
    </marker>
  </defs>
  <path
     fill="none"
     stroke="#000000"
     marker-start="url(#c)"
     d="m 73.986,105.5 h 10 l 25,25 h 160"
     id="path31" />
  <text
     xml:space="preserve"
     x="187.68599"
     y="53.700012"
     font-family="'CMU Classical Serif'"
     font-size="13px"
     font-style="oblique"
     font-weight="700"
     letter-spacing="0"
     style="line-height:125%;-inkscape-font-specification:'CMU Serif Italic';font-size:12px;font-family:'CMU Serif';font-weight:normal;font-style:italic;font-stretch:normal;font-variant:normal"
     word-spacing="0"
     id="text35"><tspan
       x="187.68599"
       y="53.700012"
       font-size="10px"
       style="-inkscape-font-specification:'CMU Serif Italic';font-size:12px;font-family:'CMU Serif';font-weight:normal;font-style:italic;font-stretch:normal;font-variant:normal"
       id="tspan33">sfs</tspan></text>
  <text
     xml:space="preserve"
     y="100.5"
     font-family="'CMU Typewriter Text'"
     font-size="13px"
     font-weight="400"
     letter-spacing="0"
     style="line-height:125%;-inkscape-font-specification:'CMU Typewriter Text';font-size:12px"
     word-spacing="0"
     id="text39"
     x="-1.0140001"><tspan
       x="-1.0140001"
       y="100.5"
       id="tspan37"
       style="font-size:12px">in</tspan></text>
  <text
     xml:space="preserve"
     x="418.98599"
     y="100.5"
     font-family="'CMU Typewriter Text'"
     font-size="13px"
     font-weight="400"
     letter-spacing="0"
     style="line-height:125%;-inkscape-font-specification:'CMU Typewriter Text';font-size:12px"
     word-spacing="0"
     id="text43"><tspan
       x="418.98599"
       y="100.5"
       id="tspan41"
       style="font-size:12px">[out]</tspan></text>
  <text
     xml:space="preserve"
     x="244.68599"
     y="23.5"
     font-family="'CMU Classical Serif'"
     font-size="13px"
     font-style="oblique"
     font-weight="700"
     letter-spacing="0"
     style="font-style:italic;font-variant:normal;font-weight:normal;font-stretch:normal;font-size:12px;line-height:125%;font-family:'CMU Serif';-inkscape-font-specification:'CMU Serif Italic'"
     word-spacing="0"
     id="text47"><tspan
       x="244.68599"
       y="23.5"
       style="font-style:italic;font-variant:normal;font-weight:normal;font-stretch:normal;font-size:12px;font-family:'CMU Serif';-inkscape-font-specification:'CMU Serif Italic'"
       id="tspan45">test</tspan></text>
  <path
     fill="none"
     stroke="#000000"
     d="m 268.986,10.5 h -30 v 20 h 30 z"
     id="path49" />
  <path
     fill="none"
     stroke="#000000"
     stroke-width="2"
     marker-end="url(#c)"
     d="m 218.986,50.5 h 80 l 35,35 h 25"
     id="path51" />
  <path
     fill="none"
     stroke="#000000"
     marker-end="url(#d)"
     d="m 268.986,20.5 h 20 v 25 c 0,0 5,2.6 5,5 0,2.4 -5,5 -5,5 v 30"
     id="path53" />
  <path
     fill="none"
     stroke="#000000"
     stroke-width="2"
     d="m 383.986,95.5 h -5 l -10,-10 h -5"
     id="path55" />
  <path
     fill="none"
     stroke="#000000"
     stroke-dasharray="3, 3"
     marker-end="url(#e)"
     d="m 293.986,95.5 h 85"
     id="path57" />
  <use
     xlink:href="#f"
     stroke-width="1.5"
     transform="matrix(0.66667,0,0,0.66667,193.986,58.8)"
     id="use59"
     x="0"
     y="0"
     width="100%"
     height="100%" />
  <text
     xml:space="preserve"
     x="280.28598"
     y="98.5"
     font-family="'CMU Classical Serif'"
     font-size="13px"
     font-style="oblique"
     font-weight="700"
     letter-spacing="0"
     style="font-style:italic;font-variant:normal;font-weight:normal;font-stretch:normal;font-size:12px;line-height:125%;font-family:'CMU Serif';-inkscape-font-specification:'CMU Serif Italic'"
     word-spacing="0"
     id="text63"><tspan
       x="280.28598"
       y="98.5"
       style="font-style:italic;font-variant:normal;font-weight:normal;font-stretch:normal;font-size:12px;font-family:'CMU Serif';-inkscape-font-specification:'CMU Serif Italic'"
       id="tspan61">k</tspan></text>
  <text
     xml:space="preserve"
     x="293.98599"
     y="85.5"
     font-family="'CMU Typewriter Text'"
     font-size="13px"
     font-weight="400"
     letter-spacing="0"
     style="line-height:125%;-inkscape-font-specification:'CMU Typewriter Text';font-size:12px"
     word-spacing="0"
     id="text67"><tspan
       x="293.98599"
       y="85.5"
       id="tspan65"
       style="font-size:12px">?mng</tspan></text>
  <path
     fill="none"
     stroke="#000000"
     marker-end="url(#g)"
     marker-start="url(#h)"
     d="m 203.986,67.5 v 8 h 75 v 10"
     id="path69" />
  <path
     fill="none"
     stroke="#000000"
     d="m 63.986,85.5 h -5 l -10,10 h -5"
     id="path71" />
  <path
     fill="none"
     stroke="#000000"
     marker-start="url(#c)"
     d="m 73.986,85.5 h 10 l 35,-35 h 10"
     id="path73" />
  <path
     fill="none"
     stroke="#000000"
     stroke-dasharray="3, 3"
     marker-end="url(#e)"
     d="m 273.986,95.5 h -225"
     id="path75" />
  <path
     fill="none"
     stroke="#000000"
     stroke-width="2"
     d="m 228.986,50.5 v -25 h 10"
     id="path77" />
  <path
     fill="none"
     stroke="#000000"
     d="m 118.986,50.5 35,-35 h 85"
     id="path79" />
  <path
     fill="none"
     stroke="#000000"
     stroke-width="2"
     marker-end="url(#c)"
     d="m 298.986,130.5 h 10 l 25,-25 h 25"
     id="path81" />
  <path
     fill="none"
     stroke="#000000"
     marker-start="url(#c)"
     d="m 18.986,95.5 h 20"
     id="path83" />
  <path
     fill="none"
     stroke="#000000"
     stroke-width="2"
     marker-end="url(#c)"
     d="m 388.986,95.5 h 25"
     id="path85" />
  <path
     fill="none"
     stroke="#000000"
     d="m 208.986,46.5 h -30 v 8 h 30 z m 0,-10 h -30 v 8 h 30 z m 0,20 h -30 v 8 h 30 z m 0,-16 10,10 m -10,10 10,-10 m -10,0 h 10"
     id="path87" />
  <path
     fill="none"
     stroke="#000000"
     d="m 28.986,0.5 h 370 v 150 h -370 z"
     id="path89" />
  <path
     fill="none"
     stroke="#000000"
     marker-end="url(#i)"
     d="m 283.986,105.5 v 10"
     id="path91" />
  <path
     stroke="#000000"
     d="m 298.986,120.5 h -30 v 20 h 30 z"
     id="path93" />
  <text
     xml:space="preserve"
     x="272.38599"
     y="133.5"
     fill="#ffffff"
     font-family="'CMU Classical Serif'"
     font-size="13px"
     font-style="oblique"
     font-weight="700"
     letter-spacing="0"
     style="font-style:italic;font-variant:normal;font-weight:normal;font-stretch:normal;font-size:12px;line-height:125%;font-family:'CMU Serif';-inkscape-font-specification:'CMU Serif Italic'"
     word-spacing="0"
     id="text97"><tspan
       x="272.38599"
       y="133.5"
       style="font-style:italic;font-variant:normal;font-weight:normal;font-stretch:normal;font-size:12px;font-family:'CMU Serif';-inkscape-font-specification:'CMU Serif Italic'"
       id="tspan95">cont</tspan></text>
  <use
     xlink:href="#f"
     stroke-width="1.5"
     transform="matrix(0.66667,0,0,0.66667,48.986,13.8)"
     id="use99"
     x="0"
     y="0"
     width="100%"
     height="100%" />
  <text
     xml:space="preserve"
     x="134.98599"
     y="53.5"
     font-family="'CMU Classical Serif'"
     font-size="13px"
     font-style="oblique"
     font-weight="700"
     letter-spacing="0"
     style="font-style:italic;font-variant:normal;font-weight:normal;font-stretch:normal;font-size:12px;line-height:125%;font-family:'CMU Serif';-inkscape-font-specification:'CMU Serif Italic'"
     word-spacing="0"
     id="text103"><tspan
       x="134.98599"
       y="53.5"
       style="font-style:italic;font-variant:normal;font-weight:normal;font-stretch:normal;font-size:12px;font-family:'CMU Serif';-inkscape-font-specification:'CMU Serif Italic'"
       id="tspan101">r</tspan></text>
  <path
     fill="none"
     stroke="#000000"
     marker-end="url(#g)"
     marker-start="url(#h)"
     d="m 183.986,67.5 v 8 h -45 v -15"
     id="path105" />
  <text
     xml:space="preserve"
     x="-150.87271"
     y="72.977051"
     font-family="'CMU Typewriter Text'"
     font-size="13px"
     font-weight="400"
     letter-spacing="0"
     style="line-height:125%;-inkscape-font-specification:'CMU Typewriter Text';font-size:12px"
     transform="scale(-1,1)"
     word-spacing="0"
     id="text109"><tspan
       x="-150.87271"
       y="72.977051"
       id="tspan107"
       style="font-size:12px">∀</tspan></text>
  <path
     fill="none"
     stroke="#000000"
     marker-mid="url(#d)"
     d="m 158.986,40.5 h 10 10"
     id="path111" />
  <text
     xml:space="preserve"
     x="153.98599"
     y="35.5"
     font-family="'CMU Typewriter Text'"
     font-size="13px"
     font-weight="400"
     letter-spacing="0"
     style="font-size:12px;line-height:125%;-inkscape-font-specification:'CMU Typewriter Text'"
     word-spacing="0"
     id="text115"><tspan
       x="153.98599"
       y="35.5"
       id="tspan113"
       style="font-size:12px">ext</tspan></text>
  <path
     fill="none"
     stroke="#000000"
     d="m 148.986,55.5 10,5 m -10,-15 10,-5"
     id="path117" />
  <path
     fill="none"
     stroke="#000000"
     marker-mid="url(#d)"
     d="m 148.986,50.5 h 20 10"
     id="path119" />
  <path
     fill="none"
     stroke="#000000"
     marker-mid="url(#d)"
     d="m 158.986,60.5 h 10 10"
     id="path121" />
</svg>
