<?xml version="1.0" encoding="UTF-8" standalone="no"?>
<svg
   viewBox="0 0 241.5 141"
   version="1.1"
   id="svg7762"
   sodipodi:docname="arrows_example_.svg"
   inkscape:version="1.1.1 (3bf5ae0d25, 2021-09-20)"
   xmlns:inkscape="http://www.inkscape.org/namespaces/inkscape"
   xmlns:sodipodi="http://sodipodi.sourceforge.net/DTD/sodipodi-0.dtd"
   xmlns="http://www.w3.org/2000/svg"
   xmlns:svg="http://www.w3.org/2000/svg">
  <sodipodi:namedview
     id="namedview7764"
     pagecolor="#ffffff"
     bordercolor="#666666"
     borderopacity="1.0"
     inkscape:pageshadow="2"
     inkscape:pageopacity="0.0"
     inkscape:pagecheckerboard="0"
     showgrid="false"
     inkscape:zoom="3.8444356"
     inkscape:cx="132.26909"
     inkscape:cy="80.766081"
     inkscape:window-width="1920"
     inkscape:window-height="1017"
     inkscape:window-x="1192"
     inkscape:window-y="595"
     inkscape:window-maximized="1"
     inkscape:current-layer="svg7762" />
  <defs
     id="defs7674">
    <marker
       id="a"
       orient="auto"
       overflow="visible"
       refX="0"
       refY="0">
      <path
         fill-rule="evenodd"
         stroke-linejoin="round"
         stroke-width=".6"
         d="m8.7 4-11-4 11-4a6.8 6.8 0 0 0 0 8z"
         font-size="12"
         transform="scale(-.6)"
         id="path7671" />
    </marker>
  </defs>
  <path
     fill="none"
     stroke="#000"
     marker-mid="url(#a)"
     d="M130-525h35 35"
     transform="translate(-65.2 545.5)"
     id="path7676" />
  <g
     aria-label="3"
     transform="translate(-65.2 545.5)"
     id="text7680"
     style="font-style:italic;line-height:0%;font-family:'CMU Serif';-inkscape-font-specification:'CMU Serif Italic';letter-spacing:0;word-spacing:0">
    <path
       d="m 156.935,-482.17799 c 0,0.884 0.624,1.664 1.729,1.664 1.638,0 3.276,-1.365 3.276,-2.925 0,-0.247 -0.052,-1.196 -1.04,-1.651 1.352,-0.455 2.106,-1.638 2.106,-2.626 0,-1.105 -0.845,-1.742 -1.859,-1.742 -1.547,0 -2.86,1.365 -2.86,2.47 0,0.455 0.247,0.832 0.728,0.832 0.481,0 1.079,-0.455 1.079,-1.105 0,-0.247 -0.143,-0.65 -0.299,-0.65 -0.078,0 -0.143,0.065 -0.143,0.143 0,0.039 0.013,0.065 0.052,0.143 0.013,0.013 0.104,0.182 0.104,0.377 0,0.442 -0.416,0.806 -0.793,0.806 -0.26,0 -0.338,-0.247 -0.338,-0.481 0,-1.027 1.183,-2.249 2.444,-2.249 0.481,0 1.105,0.234 1.105,1.17 0,0.208 -0.13,2.652 -2.275,2.652 h -0.299 c -0.221,0 -0.338,0 -0.338,0.273 0,0.13 0.104,0.13 0.325,0.13 h 0.364 c 0.247,0 1.001,0.026 1.001,1.079 0,0.234 -0.117,1.521 -0.793,2.301 -0.364,0.442 -0.962,0.767 -1.547,0.767 -0.65,0 -1.3,-0.39 -1.326,-1.352 0.559,0.052 0.728,-0.429 0.728,-0.624 0,-0.208 -0.143,-0.416 -0.442,-0.416 -0.663,0 -0.689,0.78 -0.689,1.014 z"
       style="font-size:13px;line-height:1.25"
       id="path7864" />
  </g>
  <path
     fill="none"
     stroke="#000"
     d="M24.8.5h190v140h-190z"
     id="path7682" />
  <path
     fill="none"
     stroke="#000"
     marker-start="url(#a)"
     d="M80-485h30"
     transform="translate(-65.2 545.5)"
     id="path7684" />
  <path
     fill="none"
     stroke="#000"
     marker-end="url(#a)"
     d="M100-485v30h140"
     transform="translate(-65.2 545.5)"
     id="path7686" />
  <path
     fill="none"
     stroke="#000"
     marker-start="url(#a)"
     d="M80-525h30"
     transform="translate(-65.2 545.5)"
     id="path7688" />
  <path
     fill="none"
     stroke="#000"
     marker-end="url(#a)"
     d="M220-500h75"
     transform="translate(-65.2 545.5)"
     id="path7690" />
  <g
     aria-label="2"
     transform="translate(-65.2 545.5)"
     id="text7694"
     style="font-style:italic;line-height:0%;font-family:'CMU Serif';-inkscape-font-specification:'CMU Serif Italic';letter-spacing:0;word-spacing:0">
    <path
       d="m 116.992,-480.64399 c 0,0.13 0.13,0.13 0.195,0.13 0.156,0 0.182,-0.026 0.221,-0.169 0.104,-0.364 0.338,-0.832 0.728,-0.832 0.416,0 0.78,0.26 1.105,0.481 0.338,0.234 0.741,0.52 1.261,0.52 1.495,0 2.093,-2.262 2.093,-2.405 0,-0.13 -0.104,-0.13 -0.195,-0.13 -0.156,0 -0.169,0.013 -0.221,0.221 -0.182,0.533 -0.689,1.404 -1.56,1.404 -0.364,0 -0.871,-0.104 -1.079,-0.156 -0.468,-0.104 -0.975,-0.221 -1.378,-0.221 -0.143,0 -0.26,0.026 -0.286,0.039 0.65,-1.118 1.599,-1.651 2.002,-1.885 2.002,-1.131 3.185,-1.937 3.185,-3.614 0,-1.495 -1.014,-2.197 -2.028,-2.197 -1.924,0 -2.99,2.626 -2.99,3.471 0,0.26 0.078,0.819 0.663,0.819 1.027,0 1.573,-1.56 1.573,-2.054 0,-0.234 -0.117,-0.689 -0.286,-0.689 -0.078,0 -0.143,0.065 -0.143,0.143 0,0.026 0,0.052 0.013,0.078 0.078,0.156 0.13,0.325 0.13,0.481 0,0.377 -0.481,1.755 -1.274,1.755 -0.156,0 -0.286,-0.065 -0.286,-0.429 0,-0.845 0.975,-3.289 2.561,-3.289 0.533,0 1.144,0.351 1.144,1.43 0,1.885 -1.131,2.977 -2.418,3.744 -0.585,0.351 -1.131,0.663 -1.677,1.339 -0.91,1.092 -1.053,2.002 -1.053,2.015 z"
       style="font-size:13px;line-height:1.25"
       id="path7861" />
  </g>
  <path
     fill="none"
     stroke="#000"
     d="M64.8 50.5h-20v20h20z"
     id="path7696" />
  <g
     aria-label="1"
     transform="translate(-65.2 545.5)"
     id="text7700"
     style="font-style:italic;line-height:0%;font-family:'CMU Serif';-inkscape-font-specification:'CMU Serif Italic';letter-spacing:0;word-spacing:0">
    <path
       d="m 117.721,-520.85601 c 0,0.156 0.143,0.156 0.195,0.156 0.559,0 1.144,-0.039 1.703,-0.039 0.572,0 1.17,0.039 1.742,0.039 0.091,0 0.26,0 0.26,-0.247 0,-0.156 -0.13,-0.156 -0.338,-0.156 h -0.104 c -0.169,0 -0.39,-0.013 -0.559,-0.026 -0.286,-0.039 -0.364,-0.052 -0.364,-0.234 0,-0.078 0.026,-0.195 0.039,-0.247 l 1.859,-7.423 c 0.013,-0.039 0.039,-0.143 0.039,-0.169 0,-0.104 -0.078,-0.156 -0.156,-0.156 -0.078,0 -0.091,0.013 -0.247,0.208 -1.001,1.339 -1.911,1.43 -2.288,1.469 -0.065,0.013 -0.208,0.026 -0.208,0.247 0,0.156 0.156,0.156 0.208,0.156 0.195,0 0.832,-0.078 1.443,-0.533 l -1.534,6.162 c -0.104,0.416 -0.208,0.546 -1.222,0.546 h -0.104 c -0.221,0 -0.364,0 -0.364,0.247 z"
       style="font-size:13px;line-height:1.25"
       id="path7858" />
  </g>
  <path
     fill="none"
     stroke="#000"
     d="M64.8 10.5h-20v20h20z"
     id="path7702" />
  <g
     aria-label="a"
     transform="translate(-65.2 545.5)"
     id="text7706"
     style="line-height:0%;font-family:'CMU Typewriter Text';-inkscape-font-specification:'CMU Typewriter Text';letter-spacing:0;word-spacing:0">
    <path
       d="m 65.715,-523.86401 c 0,0.897 0.819,1.742 2.145,1.742 0.481,0 1.287,-0.091 1.898,-0.494 0.286,0.403 0.91,0.416 1.404,0.416 0.364,0 0.65,0 0.65,-0.403 0,-0.39 -0.325,-0.39 -0.52,-0.39 -0.546,0 -0.676,-0.065 -0.78,-0.104 v -2.808 c 0,-0.923 -0.702,-2.015 -2.574,-2.015 -0.559,0 -1.885,0 -1.885,0.949 0,0.39 0.273,0.598 0.585,0.598 0.195,0 0.559,-0.117 0.572,-0.598 0,-0.104 0.013,-0.117 0.273,-0.143 0.182,-0.013 0.351,-0.013 0.468,-0.013 0.988,0 1.664,0.403 1.664,1.326 -2.301,0.039 -3.9,0.689 -3.9,1.937 z m 0.897,0 c 0,-0.637 1.118,-1.118 3.003,-1.17 v 1.092 c 0,0.299 0,0.572 -0.507,0.806 -0.468,0.221 -1.053,0.221 -1.157,0.221 -0.806,0 -1.339,-0.442 -1.339,-0.949 z"
       style="font-size:13px;line-height:1.25"
       id="path7852" />
  </g>
  <g
     aria-label="b"
     transform="translate(-65.2 545.5)"
     id="text7710"
     style="line-height:0%;font-family:'CMU Typewriter Text';-inkscape-font-specification:'CMU Typewriter Text';letter-spacing:0;word-spacing:0">
    <path
       d="m 65.156,-488.64001 c 0,0.39 0.338,0.39 0.52,0.39 h 0.585 v 6.617 c 0,0.26 0,0.533 0.455,0.533 0.442,0 0.442,-0.26 0.442,-0.585 0.533,0.546 1.092,0.663 1.508,0.663 1.417,0 2.678,-1.235 2.678,-2.886 0,-1.599 -1.157,-2.873 -2.535,-2.873 -0.624,0 -1.209,0.234 -1.651,0.637 v -2.366 c 0,-0.403 -0.078,-0.533 -0.52,-0.533 h -0.949 c -0.208,0 -0.533,0 -0.533,0.403 z m 2.002,5.057 v -0.949 c 0,-0.767 0.754,-1.456 1.573,-1.456 0.962,0 1.716,0.949 1.716,2.08 0,1.248 -0.91,2.093 -1.82,2.093 -1.014,0 -1.469,-1.144 -1.469,-1.768 z"
       style="font-size:13px;line-height:1.25"
       id="path7855" />
  </g>
  <g
     aria-label="c"
     transform="translate(-65.2 545.5)"
     id="text7714"
     style="line-height:0%;font-family:'CMU Typewriter Text';-inkscape-font-specification:'CMU Typewriter Text';letter-spacing:0;word-spacing:0">
    <path
       d="m 300.949,-500.00801 c 0,1.56 1.222,2.886 2.86,2.886 1.807,0 2.249,-1.274 2.249,-1.495 0,-0.364 -0.377,-0.364 -0.455,-0.364 -0.208,0 -0.338,0.026 -0.429,0.286 -0.078,0.169 -0.325,0.78 -1.287,0.78 -1.105,0 -2.041,-0.91 -2.041,-2.093 0,-0.624 0.364,-2.119 2.119,-2.119 0.273,0 0.78,0 0.78,0.117 0.013,0.455 0.26,0.637 0.572,0.637 0.312,0 0.585,-0.221 0.585,-0.598 0,-0.949 -1.352,-0.949 -1.937,-0.949 -2.236,0 -3.016,1.768 -3.016,2.912 z"
       style="font-size:13px;line-height:1.25"
       id="path7889" />
  </g>
  <path
     fill="none"
     stroke="#000"
     d="M154.8 10.5h-20v70h20z"
     id="path7716" />
  <path
     fill="none"
     stroke="#000"
     marker-mid="url(#a)"
     d="M130-485h15 5"
     transform="translate(-65.2 545.5)"
     id="path7718" />
  <path
     fill="none"
     stroke="#000"
     d="M194.8 70.5h-20v40h20z"
     id="path7720" />
  <path
     fill="none"
     stroke="#000"
     marker-end="url(#a)"
     d="M230-500v35h10"
     transform="translate(-65.2 545.5)"
     id="path7722" />
  <path
     fill="none"
     stroke="#000"
     d="M204.8 100.5v30"
     id="path7724" />
  <path
     fill="none"
     stroke="#000"
     marker-mid="url(#a)"
     d="M270-415h-20-20"
     transform="translate(-65.2 545.5)"
     id="path7726" />
  <path
     fill="none"
     stroke="#000"
     d="M164.8 130.5v-30h10"
     id="path7728" />
  <path
     fill="none"
     stroke="#000"
     marker-end="url(#a)"
     d="M260-445h35"
     transform="translate(-65.2 545.5)"
     id="path7730" />
  <g
     aria-label="d"
     transform="translate(-65.2 545.5)"
     id="text7734"
     style="line-height:0%;font-family:'CMU Typewriter Text';-inkscape-font-specification:'CMU Typewriter Text';letter-spacing:0;word-spacing:0">
    <path
       d="m 300.468,-443.89501 c 0,1.612 1.17,2.873 2.548,2.873 0.728,0 1.274,-0.351 1.638,-0.728 0,0.468 0,0.65 0.52,0.65 h 0.949 c 0.208,0 0.533,0 0.533,-0.403 0,-0.39 -0.338,-0.39 -0.52,-0.39 h -0.585 v -6.617 c 0,-0.403 -0.078,-0.533 -0.52,-0.533 h -0.949 c -0.208,0 -0.533,0 -0.533,0.403 0,0.39 0.338,0.39 0.52,0.39 h 0.585 v 2.054 c -0.429,-0.377 -0.962,-0.585 -1.521,-0.585 -1.417,0 -2.665,1.235 -2.665,2.886 z m 0.897,0 c 0,-1.248 0.91,-2.093 1.82,-2.093 0.832,0 1.469,0.728 1.469,1.443 v 0.923 c 0,0.728 -0.585,1.807 -1.586,1.807 -0.923,0 -1.703,-0.923 -1.703,-2.08 z"
       style="font-size:13px;line-height:1.25"
       id="path7886" />
  </g>
  <g
     aria-label="5"
     transform="translate(-65.2 545.5)"
     id="text7738"
     style="font-style:italic;line-height:0%;font-family:'CMU Serif';-inkscape-font-specification:'CMU Serif Italic';letter-spacing:0;word-spacing:0">
    <path
       d="m 246.99101,-452.32099 c 0,0.949 0.559,1.807 1.677,1.807 1.664,0 3.406,-1.755 3.406,-3.731 0,-1.027 -0.572,-2.015 -1.703,-2.015 -0.598,0 -1.131,0.221 -1.612,0.598 l 0.598,-2.392 c 0.039,-0.143 0.052,-0.156 0.065,-0.156 0.013,0 0.039,0 0.169,0.039 0.247,0.091 0.546,0.117 0.806,0.117 1.43,0 2.574,-1.079 2.574,-1.274 0,-0.091 -0.078,-0.117 -0.117,-0.117 -0.039,0 -0.091,0.013 -0.156,0.039 -0.585,0.26 -1.17,0.364 -1.677,0.364 -0.572,0 -1.079,-0.13 -1.456,-0.338 -0.078,-0.039 -0.13,-0.065 -0.182,-0.065 -0.091,0 -0.117,0.078 -0.156,0.221 l -0.988,3.952 c -0.013,0.039 -0.026,0.143 -0.026,0.169 0,0.13 0.091,0.156 0.169,0.156 0.091,0 0.117,-0.039 0.208,-0.13 0.663,-0.78 1.378,-0.897 1.755,-0.897 0.533,0 0.793,0.455 0.793,1.157 0,0.715 -0.377,2.08 -0.65,2.6 -0.572,1.053 -1.339,1.339 -1.82,1.339 -0.468,0 -1.261,-0.26 -1.274,-1.521 0.039,0.013 0.065,0.013 0.13,0.013 0.442,0 0.689,-0.377 0.689,-0.676 0,-0.26 -0.169,-0.442 -0.468,-0.442 -0.676,0 -0.754,0.767 -0.754,1.183 z"
       style="font-size:13px;line-height:1.25"
       id="path7880" />
  </g>
  <g
     aria-label="d"
     transform="translate(-65.2 545.5)"
     id="text7742"
     style="line-height:0%;font-family:'CMU Typewriter Text';-inkscape-font-specification:'CMU Typewriter Text';letter-spacing:0;word-spacing:0">
    <path
       d="m 246.86799,-422.795 c 0,1.612 1.17,2.873 2.548,2.873 0.728,0 1.274,-0.351 1.638,-0.728 0,0.468 0,0.65 0.52,0.65 h 0.949 c 0.208,0 0.533,0 0.533,-0.403 0,-0.39 -0.338,-0.39 -0.52,-0.39 h -0.585 v -6.617 c 0,-0.403 -0.078,-0.533 -0.52,-0.533 h -0.949 c -0.208,0 -0.533,0 -0.533,0.403 0,0.39 0.338,0.39 0.52,0.39 h 0.585 v 2.054 c -0.429,-0.377 -0.962,-0.585 -1.521,-0.585 -1.417,0 -2.665,1.235 -2.665,2.886 z m 0.897,0 c 0,-1.248 0.91,-2.093 1.82,-2.093 0.832,0 1.469,0.728 1.469,1.443 v 0.923 c 0,0.728 -0.585,1.807 -1.586,1.807 -0.923,0 -1.703,-0.923 -1.703,-2.08 z"
       style="font-size:13px;line-height:1.25"
       id="path7883" />
  </g>
  <g
     aria-label="c1"
     transform="translate(-65.2 545.5)"
     id="text7746"
     style="line-height:0%;font-family:'CMU Typewriter Text';-inkscape-font-specification:'CMU Typewriter Text';letter-spacing:0;word-spacing:0">
    <path
       d="m 155.949,-532.808 c 0,1.56 1.222,2.886 2.86,2.886 1.807,0 2.249,-1.274 2.249,-1.495 0,-0.364 -0.377,-0.364 -0.455,-0.364 -0.208,0 -0.338,0.026 -0.429,0.286 -0.078,0.169 -0.325,0.78 -1.287,0.78 -1.105,0 -2.041,-0.91 -2.041,-2.093 0,-0.624 0.364,-2.119 2.119,-2.119 0.273,0 0.78,0 0.78,0.117 0.013,0.455 0.26,0.637 0.572,0.637 0.312,0 0.585,-0.221 0.585,-0.598 0,-0.949 -1.352,-0.949 -1.937,-0.949 -2.236,0 -3.016,1.768 -3.016,2.912 z"
       style="font-size:13px;line-height:1.25"
       id="path7867" />
    <path
       d="m 163.19,-536.097 c 0,0.325 0.234,0.39 0.429,0.39 0.247,0 0.78,-0.078 1.352,-0.572 v 5.486 h -1.183 c -0.208,0 -0.52,0 -0.52,0.403 0,0.39 0.325,0.39 0.52,0.39 h 3.263 c 0.195,0 0.52,0 0.52,-0.39 0,-0.403 -0.312,-0.403 -0.52,-0.403 h -1.183 v -6.76 c 0,-0.208 0,-0.533 -0.39,-0.533 -0.247,0 -0.325,0.156 -0.39,0.312 -0.494,1.105 -1.17,1.248 -1.417,1.274 -0.208,0.013 -0.481,0.039 -0.481,0.403 z"
       style="font-size:13px;line-height:1.25"
       id="path7869" />
  </g>
  <path
     fill="none"
     stroke="#000"
     marker-mid="url(#a)"
     d="M170-485h20 10"
     transform="translate(-65.2 545.5)"
     id="path7748" />
  <path
     fill="none"
     stroke="#000"
     d="M109.8 45.5h-70v30h70z"
     id="path7750" />
  <g
     aria-label="c2"
     transform="translate(-65.2 545.5)"
     id="text7754"
     style="line-height:0%;font-family:'CMU Typewriter Text';-inkscape-font-specification:'CMU Typewriter Text';letter-spacing:0;word-spacing:0">
    <path
       d="m 183.949,-492.808 c 0,1.56 1.222,2.886 2.86,2.886 1.807,0 2.249,-1.274 2.249,-1.495 0,-0.364 -0.377,-0.364 -0.455,-0.364 -0.208,0 -0.338,0.026 -0.429,0.286 -0.078,0.169 -0.325,0.78 -1.287,0.78 -1.105,0 -2.041,-0.91 -2.041,-2.093 0,-0.624 0.364,-2.119 2.119,-2.119 0.273,0 0.78,0 0.78,0.117 0.013,0.455 0.26,0.637 0.572,0.637 0.312,0 0.585,-0.221 0.585,-0.598 0,-0.949 -1.352,-0.949 -1.937,-0.949 -2.236,0 -3.016,1.768 -3.016,2.912 z"
       style="font-size:13px;line-height:1.25"
       id="path7872" />
    <path
       d="m 190.501,-490.403 c 0,0.403 0.325,0.403 0.533,0.403 h 4.407 c 0.429,0 0.52,-0.117 0.52,-0.533 v -0.338 c 0,-0.247 0,-0.533 -0.442,-0.533 -0.455,0 -0.455,0.247 -0.455,0.611 h -3.094 c 0.767,-0.663 2.015,-1.638 2.574,-2.158 0.819,-0.728 1.417,-1.56 1.417,-2.6 0,-1.56 -1.313,-2.535 -2.899,-2.535 -1.534,0 -2.561,1.066 -2.561,2.171 0,0.481 0.364,0.624 0.585,0.624 0.273,0 0.572,-0.221 0.572,-0.585 0,-0.156 -0.065,-0.325 -0.182,-0.416 0.195,-0.598 0.806,-1.001 1.521,-1.001 1.066,0 2.067,0.598 2.067,1.742 0,0.91 -0.637,1.664 -1.495,2.379 l -2.873,2.418 c -0.117,0.104 -0.195,0.169 -0.195,0.351 z"
       style="font-size:13px;line-height:1.25"
       id="path7874" />
  </g>
  <g
     aria-label="4"
     transform="translate(-65.2 545.5)"
     id="text7758"
     style="font-style:italic;line-height:0%;font-family:'CMU Serif';-inkscape-font-specification:'CMU Serif Italic';letter-spacing:0;word-spacing:0">
    <path
       d="m 207.17201,-497.13399 c 0,0.052 0.091,0.221 0.195,0.221 0.078,0 0.273,-0.156 0.416,-0.26 0.117,-0.104 0.234,-0.195 1.001,-0.195 0.234,0 0.494,0 0.949,0.143 0.169,0.065 0.481,0.195 0.767,0.299 l -0.481,1.937 c -0.052,0.195 -0.052,0.221 -0.052,0.273 0,0.273 0.221,0.338 0.351,0.338 0.247,0 0.416,-0.143 0.494,-0.442 l 0.481,-1.898 c 0.078,0.013 0.182,0.013 0.26,0.013 0.364,0 1.209,-0.169 1.209,-0.377 0,-0.065 -0.078,-0.221 -0.195,-0.221 -0.026,0 -0.052,0 -0.182,0.052 -0.234,0.091 -0.559,0.143 -0.78,0.143 -0.091,0 -0.143,0 -0.208,-0.013 l 0.572,-2.314 c 0.052,-0.195 0.052,-0.221 0.052,-0.26 0,-0.338 -0.312,-0.351 -0.351,-0.351 -0.39,0 -0.468,0.338 -0.52,0.559 -0.039,0.13 -0.533,2.08 -0.546,2.158 -0.949,-0.338 -0.416,-0.169 -0.793,-0.299 -0.481,-0.143 -0.702,-0.143 -0.988,-0.143 -0.156,0 -0.182,0 -0.351,0.013 3.51,-3.25 4.264,-7.449 4.264,-7.462 0,-0.273 -0.221,-0.338 -0.351,-0.338 -0.377,0 -0.455,0.299 -0.546,0.65 -0.429,1.625 -1.001,3.185 -1.924,4.693 -1.027,1.664 -2.184,2.574 -2.236,2.613 -0.091,0.039 -0.507,0.26 -0.507,0.468 z"
       style="font-size:13px;line-height:1.25"
       id="path7877" />
  </g>
  <path
     fill="none"
     stroke="#000"
     d="M104.8 50.5h-20v20h20z"
     id="path7760" />
</svg>
