<?xml version="1.0" encoding="UTF-8" standalone="no"?>
<!-- Created with Inkscape (http://www.inkscape.org/) -->

<svg
   width="38.874699mm"
   height="18.691225mm"
   viewBox="0 0 38.874699 18.691225"
   version="1.1"
   id="svg72828"
   inkscape:version="1.1.1 (3bf5ae0d25, 2021-09-20)"
   sodipodi:docname="arrow_arr.svg"
   xmlns:inkscape="http://www.inkscape.org/namespaces/inkscape"
   xmlns:sodipodi="http://sodipodi.sourceforge.net/DTD/sodipodi-0.dtd"
   xmlns="http://www.w3.org/2000/svg"
   xmlns:svg="http://www.w3.org/2000/svg">
  <sodipodi:namedview
     id="namedview72830"
     pagecolor="#ffffff"
     bordercolor="#666666"
     borderopacity="1.0"
     inkscape:pageshadow="2"
     inkscape:pageopacity="0.0"
     inkscape:pagecheckerboard="0"
     inkscape:document-units="mm"
     showgrid="false"
     inkscape:zoom="4.192802"
     inkscape:cx="103.15298"
     inkscape:cy="31.840283"
     inkscape:window-width="1920"
     inkscape:window-height="1017"
     inkscape:window-x="1192"
     inkscape:window-y="595"
     inkscape:window-maximized="1"
     inkscape:current-layer="g71170" />
  <defs
     id="defs72825">
    <marker
       inkscape:stockid="Arrow2Lend"
       orient="auto"
       refY="0"
       refX="0"
       id="Arrow2Lend"
       style="overflow:visible">
      <path
         id="path3789"
         style="font-size:12px;fill-rule:evenodd;stroke-width:0.625;stroke-linejoin:round"
         d="M 8.7185878,4.0337352 -2.2072895,0.01601326 8.7185884,-4.0017078 c -1.7454984,2.3720609 -1.7354408,5.6174519 -6e-7,8.035443 z"
         transform="matrix(-1.1,0,0,-1.1,-1.1,0)"
         inkscape:connector-curvature="0" />
    </marker>
    <marker
       inkscape:stockid="Arrow2Lstart"
       orient="auto"
       refY="0"
       refX="0"
       id="Arrow2Lstart"
       style="overflow:visible">
      <path
         id="path3786"
         style="font-size:12px;fill-rule:evenodd;stroke-width:0.625;stroke-linejoin:round"
         d="M 8.7185878,4.0337352 -2.2072895,0.01601326 8.7185884,-4.0017078 c -1.7454984,2.3720609 -1.7354408,5.6174519 -6e-7,8.035443 z"
         transform="matrix(1.1,0,0,1.1,1.1,0)"
         inkscape:connector-curvature="0" />
    </marker>
  </defs>
  <g
     inkscape:label="Layer 1"
     inkscape:groupmode="layer"
     id="layer1"
     transform="translate(-6.2331231,-5.7930261)">
    <g
       id="g71170"
       transform="matrix(0.26458333,0,0,0.26458333,6.0002898,-9.949682)">
      <rect
         y="60"
         x="40"
         height="50"
         width="70"
         id="rect2995"
         style="fill:none;stroke:#000000" />
      <path
         sodipodi:nodetypes="cc"
         inkscape:connector-curvature="0"
         id="path6906"
         d="m 25,85 35,0.08661"
         style="fill:none;stroke:#000000;stroke-width:1;stroke-linecap:butt;stroke-linejoin:miter;stroke-miterlimit:4;stroke-dasharray:none;stroke-opacity:1;marker-start:url(#Arrow2Lend);marker-end:none" />
      <path
         sodipodi:nodetypes="ccc"
         inkscape:connector-curvature="0"
         id="path6908"
         d="M 135,85 H 90 v 0"
         style="fill:none;stroke:#000000;stroke-width:1px;stroke-linecap:butt;stroke-linejoin:miter;stroke-opacity:1;marker-start:url(#Arrow2Lstart)" />
      <circle
         id="path8946"
         style="fill:none;stroke:#000000;stroke-width:1;stroke-linecap:butt;stroke-linejoin:miter;stroke-miterlimit:4;stroke-dasharray:none"
         cx="75"
         cy="85"
         r="15" />
      <g
         aria-label="f"
         id="text8948"
         style="font-style:italic;font-weight:500;line-height:0%;font-family:'CMU Serif';-inkscape-font-specification:'CMU Serif Medium Italic';letter-spacing:0px;word-spacing:0">
        <path
           d="m 68.437354,93.336 c 0,1.08 1.032,1.584 1.92,1.584 2.496,0 3.48,-5.04 3.648,-5.904 l 1.68,-8.616 h 1.968 c 0.408,0 0.648,0 0.648,-0.432 0,-0.312 -0.192,-0.312 -0.6,-0.312 h -1.872 c 0.336,-1.776 0.408,-2.208 0.768,-3.888 0.192,-0.888 0.456,-2.16 1.32,-2.16 0.192,0 0.696,0.048 1.008,0.432 -0.72,0.12 -1.056,0.696 -1.056,1.176 0,0.528 0.432,0.768 0.816,0.768 0.6,0 1.2,-0.48 1.2,-1.32 0,-1.032 -0.984,-1.584 -1.968,-1.584 -2.352,0 -2.952,3.12 -3.12,3.936 l -0.504,2.64 h -1.584 c -0.384,0 -0.648,0 -0.648,0.48 0,0.264 0.24,0.264 0.6,0.264 h 1.488 l -1.752,8.952 c -0.288,1.488 -0.528,2.472 -0.672,2.976 -0.192,0.816 -0.504,2.064 -1.368,2.064 -0.24,0 -0.696,-0.072 -0.96,-0.432 0.72,-0.12 1.056,-0.696 1.056,-1.176 0,-0.528 -0.432,-0.768 -0.816,-0.768 -0.6,0 -1.2,0.48 -1.2,1.32 z"
           style="font-size:24px"
           id="path73136" />
      </g>
      <g
         aria-label="arr f"
         id="text3003-5-3-1-1-4-3-9-1"
         style="line-height:0%;font-family:'CMU Typewriter Text';-inkscape-font-specification:'CMU Typewriter Text';letter-spacing:0px;word-spacing:0"
         inkscape:transform-center-y="-4.3164062">
        <path
           d="m 45.218437,126.928 c 0,1.656 1.512,3.216 3.96,3.216 0.888,0 2.376,-0.168 3.504,-0.912 0.528,0.744 1.68,0.768 2.592001,0.768 0.672,0 1.199999,0 1.199999,-0.744 0,-0.72 -0.6,-0.72 -0.96,-0.72 -1.007999,0 -1.247999,-0.12 -1.439999,-0.192 v -5.184 c 0,-1.704 -1.296001,-3.72 -4.752001,-3.72 -1.032,0 -3.479999,0 -3.479999,1.752 0,0.72 0.503999,1.104 1.079999,1.104 0.36,0 1.032,-0.216 1.056,-1.104 0,-0.192 0.024,-0.216 0.504001,-0.264 0.336,-0.024 0.647999,-0.024 0.863999,-0.024 1.824,0 3.072,0.744 3.072,2.448 -4.248,0.072 -7.2,1.272 -7.2,3.576 z m 1.656,0 c 0,-1.176 2.064,-2.064 5.544,-2.16 v 2.016 c 0,0.552 0,1.056 -0.935999,1.488 -0.864001,0.408 -1.944001,0.408 -2.136001,0.408 -1.488,0 -2.472,-0.816 -2.472,-1.752 z"
           style="font-size:24px"
           id="path73142" />
        <path
           d="m 57.266428,129.256 c 0,0.744 0.576,0.744 0.96,0.744 h 6.264 c 0.36,0 0.984,0 0.984,-0.72 0,-0.744 -0.624,-0.744 -0.984,-0.744 h -2.664 v -3 c 0,-2.256 1.416,-4.56 4.32,-4.56 0.024,0.576 0.432,1.056 1.032,1.056 0.528,0 1.008,-0.384 1.008,-1.032 0,-0.48 -0.288,-1.488 -2.28,-1.488 -1.224,0 -2.76,0.432 -4.08,1.944 v -0.816 c 0,-0.744 -0.144,-0.984 -0.96,-0.984 h -2.64 c -0.36,0 -0.96,0 -0.96,0.72 0,0.744 0.576,0.744 0.96,0.744 h 1.944 v 7.416 h -1.944 c -0.36,0 -0.96,0 -0.96,0.72 z"
           style="font-size:24px"
           id="path73144" />
        <path
           d="m 69.866419,129.256 c 0,0.744 0.576,0.744 0.96,0.744 h 6.264 c 0.36,0 0.984,0 0.984,-0.72 0,-0.744 -0.624,-0.744 -0.984,-0.744 h -2.664 v -3 c 0,-2.256 1.416,-4.56 4.32,-4.56 0.024,0.576 0.432,1.056 1.032,1.056 0.528,0 1.008,-0.384 1.008,-1.032 0,-0.48 -0.288,-1.488 -2.28,-1.488 -1.224,0 -2.76,0.432 -4.08,1.944 v -0.816 c 0,-0.744 -0.144,-0.984 -0.96,-0.984 h -2.64 c -0.36,0 -0.96,0 -0.96,0.72 0,0.744 0.576,0.744 0.96,0.744 h 1.944 v 7.416 h -1.944 c -0.36,0 -0.96,0 -0.96,0.72 z"
           style="font-size:24px"
           id="path73146" />
        <path
           d="m 95.306401,129.256 c 0,0.744 0.624,0.744 0.984,0.744 h 6.503999 c 0.36,0 0.984,0 0.984,-0.72 0,-0.744 -0.624,-0.744 -0.984,-0.744 h -2.424 v -7.416 h 2.928 c 0.36,0 0.96,0 0.96,-0.72 0,-0.744 -0.576,-0.744 -0.96,-0.744 h -2.928 v -1.128 c 0,-1.872 1.608,-1.872 2.328,-1.872 0,0.096 0.216,1.032 1.056,1.032 0.48,0 1.032,-0.384 1.032,-1.056 0,-1.44 -1.92,-1.44 -2.304,-1.44 -1.92,0 -3.767999,1.104 -3.767999,3.192 v 1.272 h -2.4 c -0.384,0 -0.984,0 -0.984,0.744 0,0.72 0.6,0.72 0.96,0.72 h 2.424 v 7.416 h -2.424 c -0.36,0 -0.984,0 -0.984,0.72 z"
           style="font-size:24px"
           id="path73148" />
      </g>
      <g
         aria-label="a"
         id="text7722"
         style="line-height:0%;font-family:'CMU Typewriter Text';-inkscape-font-specification:'CMU Typewriter Text';letter-spacing:0px;word-spacing:0">
        <path
           d="m 0.88,87.952 c 0,1.104 1.008,2.144 2.64,2.144 0.592,0 1.584,-0.112 2.336,-0.608 0.352,0.496 1.12,0.512 1.728,0.512 0.448,0 0.8,0 0.8,-0.496 0,-0.48 -0.4,-0.48 -0.64,-0.48 -0.672,0 -0.832,-0.08 -0.96,-0.128 V 85.44 c 0,-1.136 -0.864,-2.48 -3.168,-2.48 -0.688,0 -2.32,0 -2.32,1.168 0,0.48 0.336,0.736 0.72,0.736 0.24,0 0.688,-0.144 0.704,-0.736 0,-0.128 0.016,-0.144 0.336,-0.176 0.224,-0.016 0.432,-0.016 0.576,-0.016 1.216,0 2.048,0.496 2.048,1.632 -2.832,0.048 -4.8,0.848 -4.8,2.384 z m 1.104,0 c 0,-0.784 1.376,-1.376 3.696,-1.44 v 1.344 c 0,0.368 0,0.704 -0.624,0.992 C 4.48,89.12 3.76,89.12 3.632,89.12 2.64,89.12 1.984,88.576 1.984,87.952 Z"
           style="font-size:16px"
           id="path73016" />
      </g>
      <g
         aria-label="b"
         id="text7722-5"
         style="line-height:0%;font-family:'CMU Typewriter Text';-inkscape-font-specification:'CMU Typewriter Text';letter-spacing:0px;word-spacing:0">
        <path
           d="m 140.192,80.72 c 0,0.48 0.416,0.48 0.64,0.48 h 0.72 v 8.144 c 0,0.32 0,0.656 0.56,0.656 0.544,0 0.544,-0.32 0.544,-0.72 0.656,0.672 1.344,0.816 1.856,0.816 1.744,0 3.296,-1.52 3.296,-3.552 0,-1.968 -1.424,-3.536 -3.12,-3.536 -0.768,0 -1.488,0.288 -2.032,0.784 V 80.88 c 0,-0.496 -0.096,-0.656 -0.64,-0.656 h -1.168 c -0.256,0 -0.656,0 -0.656,0.496 z m 2.464,6.224 v -1.168 c 0,-0.944 0.928,-1.792 1.936,-1.792 1.184,0 2.112,1.168 2.112,2.56 0,1.536 -1.12,2.576 -2.24,2.576 -1.248,0 -1.808,-1.408 -1.808,-2.176 z"
           style="font-size:16px"
           id="path73139" />
      </g>
    </g>
  </g>
</svg>
