<?xml version="1.0" encoding="UTF-8" standalone="no"?>
<!-- Created with Inkscape (http://www.inkscape.org/) -->

<svg
   width="38.874699mm"
   height="18.691225mm"
   viewBox="0 0 38.874699 18.691225"
   version="1.1"
   id="svg72828"
   inkscape:version="1.1.1 (3bf5ae0d25, 2021-09-20)"
   sodipodi:docname="arrow_returnA_.svg"
   xmlns:inkscape="http://www.inkscape.org/namespaces/inkscape"
   xmlns:sodipodi="http://sodipodi.sourceforge.net/DTD/sodipodi-0.dtd"
   xmlns="http://www.w3.org/2000/svg"
   xmlns:svg="http://www.w3.org/2000/svg">
  <sodipodi:namedview
     id="namedview72830"
     pagecolor="#ffffff"
     bordercolor="#666666"
     borderopacity="1.0"
     inkscape:pageshadow="2"
     inkscape:pageopacity="0.0"
     inkscape:pagecheckerboard="0"
     inkscape:document-units="mm"
     showgrid="false"
     inkscape:zoom="5.9295174"
     inkscape:cx="45.787875"
     inkscape:cy="19.310172"
     inkscape:window-width="1920"
     inkscape:window-height="1017"
     inkscape:window-x="1192"
     inkscape:window-y="595"
     inkscape:window-maximized="1"
     inkscape:current-layer="g71170" />
  <defs
     id="defs72825">
    <marker
       style="overflow:visible;"
       id="marker3860"
       refX="0.0"
       refY="0.0"
       orient="auto"
       inkscape:stockid="Arrow2Lend"
       inkscape:isstock="true">
      <path
         transform="scale(1.1) rotate(180) translate(1,0)"
         d="M 8.7185878,4.0337352 L -2.2072895,0.016013256 L 8.7185884,-4.0017078 C 6.9730900,-1.6296469 6.9831476,1.6157441 8.7185878,4.0337352 z "
         style="stroke:context-stroke;fill-rule:evenodd;fill:context-stroke;stroke-width:0.62500000;stroke-linejoin:round;"
         id="path3620" />
    </marker>
    <marker
       inkscape:stockid="Arrow2Lend"
       orient="auto"
       refY="0"
       refX="0"
       id="Arrow2Lend"
       style="overflow:visible">
      <path
         id="path3789"
         style="font-size:12px;fill-rule:evenodd;stroke-width:0.625;stroke-linejoin:round"
         d="M 8.7185878,4.0337352 -2.2072895,0.01601326 8.7185884,-4.0017078 c -1.7454984,2.3720609 -1.7354408,5.6174519 -6e-7,8.035443 z"
         transform="matrix(-1.1,0,0,-1.1,-1.1,0)"
         inkscape:connector-curvature="0" />
    </marker>
    <marker
       inkscape:stockid="Arrow2Lstart"
       orient="auto"
       refY="0"
       refX="0"
       id="Arrow2Lstart"
       style="overflow:visible">
      <path
         id="path3786"
         style="font-size:12px;fill-rule:evenodd;stroke-width:0.625;stroke-linejoin:round"
         d="M 8.7185878,4.0337352 -2.2072895,0.01601326 8.7185884,-4.0017078 c -1.7454984,2.3720609 -1.7354408,5.6174519 -6e-7,8.035443 z"
         transform="matrix(1.1,0,0,1.1,1.1,0)"
         inkscape:connector-curvature="0" />
    </marker>
  </defs>
  <g
     inkscape:label="Layer 1"
     inkscape:groupmode="layer"
     id="layer1"
     transform="translate(-6.2331231,-5.7930261)">
    <g
       id="g71170"
       transform="matrix(0.26458333,0,0,0.26458333,6.0002898,-9.949682)">
      <g
         aria-label="a"
         id="text7722"
         style="line-height:0%;font-family:'CMU Typewriter Text';-inkscape-font-specification:'CMU Typewriter Text';letter-spacing:0px;word-spacing:0">
        <path
           d="m 0.88,87.952 c 0,1.104 1.008,2.144 2.64,2.144 0.592,0 1.584,-0.112 2.336,-0.608 0.352,0.496 1.12,0.512 1.728,0.512 0.448,0 0.8,0 0.8,-0.496 0,-0.48 -0.4,-0.48 -0.64,-0.48 -0.672,0 -0.832,-0.08 -0.96,-0.128 V 85.44 c 0,-1.136 -0.864,-2.48 -3.168,-2.48 -0.688,0 -2.32,0 -2.32,1.168 0,0.48 0.336,0.736 0.72,0.736 0.24,0 0.688,-0.144 0.704,-0.736 0,-0.128 0.016,-0.144 0.336,-0.176 0.224,-0.016 0.432,-0.016 0.576,-0.016 1.216,0 2.048,0.496 2.048,1.632 -2.832,0.048 -4.8,0.848 -4.8,2.384 z m 1.104,0 c 0,-0.784 1.376,-1.376 3.696,-1.44 v 1.344 c 0,0.368 0,0.704 -0.624,0.992 C 4.48,89.12 3.76,89.12 3.632,89.12 2.64,89.12 1.984,88.576 1.984,87.952 Z"
           style="font-size:16px"
           id="path3887" />
      </g>
      <rect
         y="60"
         x="40"
         height="50"
         width="70"
         id="rect2995"
         style="fill:none;stroke:#000000" />
      <path
         sodipodi:nodetypes="cc"
         inkscape:connector-curvature="0"
         id="path6906"
         d="M 25,85 H 135"
         style="fill:none;stroke:#000000;stroke-width:1;stroke-linecap:butt;stroke-linejoin:miter;stroke-miterlimit:4;stroke-dasharray:none;stroke-opacity:1;marker-start:url(#Arrow2Lend);marker-end:url(#marker3860)" />
      <g
         aria-label="returnA"
         id="text3003-5-3-1-1-4-3-9-1"
         style="line-height:0%;font-family:'CMU Typewriter Text';-inkscape-font-specification:'CMU Typewriter Text';letter-spacing:0px;word-spacing:0"
         inkscape:transform-center-y="-4.3164062">
        <path
           d="m 32.666437,129.256 c 0,0.744 0.576,0.744 0.960001,0.744 h 6.264 c 0.36,0 0.983999,0 0.983999,-0.72 0,-0.744 -0.623999,-0.744 -0.983999,-0.744 h -2.664 v -3 c 0,-2.256 1.415999,-4.56 4.319999,-4.56 0.024,0.576 0.432,1.056 1.032,1.056 0.528,0 1.008001,-0.384 1.008001,-1.032 0,-0.48 -0.288001,-1.488 -2.280001,-1.488 -1.224,0 -2.759999,0.432 -4.079999,1.944 v -0.816 c 0,-0.744 -0.144001,-0.984 -0.96,-0.984 h -2.64 c -0.36,0 -0.960001,0 -0.960001,0.72 0,0.744 0.576,0.744 0.960001,0.744 h 1.943999 v 7.416 h -1.943999 c -0.36,0 -0.960001,0 -0.960001,0.72 z"
           style="font-size:24px"
           id="path3890" />
        <path
           d="m 45.818428,124.792 c 0,2.928 2.424,5.352 5.52,5.352 3.168,0 4.296,-2.16 4.296,-2.76 0,-0.672 -0.696,-0.672 -0.84,-0.672 -0.432,0 -0.624,0.072 -0.792,0.528 -0.528,1.224 -1.824,1.44 -2.496,1.44 -1.8,0 -3.6,-1.2 -3.984,-3.264 h 7.152 c 0.504,0 0.96,0 0.96,-0.888 0,-2.736 -1.536,-5.088 -4.656,-5.088 -2.856,0 -5.16,2.4 -5.16,5.352 z m 1.728,-0.816 c 0.336,-1.752 1.752,-3.072 3.432,-3.072 1.248,0 2.736,0.6 2.952,3.072 z"
           style="font-size:24px"
           id="path3892" />
        <path
           d="m 57.698419,120.4 c 0,0.72 0.6,0.72 0.96,0.72 h 2.112 v 5.856 c 0,2.304 1.632,3.168 3.384,3.168 1.776,0 3.72,-1.032 3.72,-3.168 0,-0.432 0,-0.936 -0.84,-0.936 -0.792,0 -0.816,0.504 -0.816,0.912 -0.024,1.488 -1.392,1.728 -1.944,1.728 -1.848,0 -1.848,-1.248 -1.848,-1.848 v -5.712 h 3.936 c 0.36,0 0.96,0 0.96,-0.72 0,-0.744 -0.576,-0.744 -0.96,-0.744 h -3.936 v -1.968 c 0,-0.456 0,-0.984 -0.816,-0.984 -0.84,0 -0.84,0.504 -0.84,0.984 v 1.968 h -2.088 c -0.384,0 -0.984,0 -0.984,0.744 z"
           style="font-size:24px"
           id="path3894" />
        <path
           d="m 69.98641,120.4 c 0,0.72 0.624,0.72 0.96,0.72 h 1.08 v 6.144 c 0,2.304 1.656,2.88 3.408,2.88 0.984,0 1.968,-0.24 2.856,-0.912 0.024,0.768 0.528,0.768 0.96,0.768 h 1.752 c 0.384,0 0.984,0 0.984,-0.744 0,-0.72 -0.624,-0.72 -0.96,-0.72 h -1.08 v -7.896 c 0,-0.744 -0.144,-0.984 -0.96,-0.984 h -1.752 c -0.384,0 -0.984,0 -0.984,0.744 0,0.72 0.624,0.72 0.96,0.72 h 1.08 v 5.112 c 0,2.16 -1.944,2.448 -2.712,2.448 -1.896,0 -1.896,-0.792 -1.896,-1.56 v -6.48 c 0,-0.744 -0.144,-0.984 -0.96,-0.984 h -1.752 c -0.384,0 -0.984,0 -0.984,0.744 z"
           style="font-size:24px"
           id="path3896" />
        <path
           d="m 83.066401,129.256 c 0,0.744 0.576,0.744 0.96,0.744 h 6.264 c 0.36,0 0.984,0 0.984,-0.72 0,-0.744 -0.624,-0.744 -0.984,-0.744 h -2.664 v -3 c 0,-2.256 1.416,-4.56 4.32,-4.56 0.024,0.576 0.432,1.056 1.032,1.056 0.528,0 1.008,-0.384 1.008,-1.032 0,-0.48 -0.288,-1.488 -2.28,-1.488 -1.224,0 -2.76,0.432 -4.08,1.944 v -0.816 c 0,-0.744 -0.144,-0.984 -0.96,-0.984 h -2.64 c -0.36,0 -0.96,0 -0.96,0.72 0,0.744 0.576,0.744 0.96,0.744 h 1.944 v 7.416 h -1.944 c -0.36,0 -0.96,0 -0.96,0.72 z"
           style="font-size:24px"
           id="path3898" />
        <path
           d="m 95.186392,129.28 c 0,0.72 0.624,0.72 0.96,0.72 h 3.816 c 0.335998,0 0.959998,0 0.959998,-0.72 0,-0.744 -0.6,-0.744 -0.983998,-0.744 h -1.056 v -4.248 c 0,-2.4 1.775998,-3.312 2.999998,-3.312 1.272,0 1.608,0.672 1.608,2.112 v 5.448 h -0.936 c -0.384,0 -0.984,0 -0.984,0.744 0,0.72 0.648,0.72 0.984,0.72 h 3.672 c 0.336,0 0.96,0 0.96,-0.72 0,-0.744 -0.6,-0.744 -0.984,-0.744 h -1.056 v -5.568 c 0,-2.424 -1.224,-3.456 -3.12,-3.456 -1.608,0 -2.687998,0.816 -3.143998,1.272 0,-0.768 0,-1.128 -0.96,-1.128 h -1.752 c -0.384,0 -0.984,0 -0.984,0.744 0,0.72 0.624,0.72 0.96,0.72 h 1.08 v 7.416 h -1.056 c -0.384,0 -0.984,0 -0.984,0.744 z"
           style="font-size:24px"
           id="path3900" />
        <path
           d="m 108.14638,129.28 c 0,0.72 0.624,0.72 1.032,0.72 h 2.448 c 0.432,0 1.008,0 1.008,-0.72 0,-0.744 -0.48,-0.744 -1.344,-0.744 l 0.552,-2.496 h 3.888 l 0.552,2.496 c -0.864,0 -1.344,0 -1.344,0.744 0,0.72 0.576,0.72 1.008,0.72 h 2.448 c 0.408,0 1.032,0 1.032,-0.72 0,-0.312 -0.12,-0.552 -0.408,-0.672 -0.144,-0.072 -0.672,-0.072 -1.032,-0.072 l -2.904,-12.552 c -0.216,-0.912 -0.552,-0.936 -1.296,-0.936 -0.696,0 -1.08,0 -1.296,0.912 l -2.904,12.576 c -0.336,0 -0.888,0 -1.032,0.048 -0.264,0.144 -0.408,0.384 -0.408,0.696 z m 4.056,-4.704 1.584,-7.536 1.584,7.536 z"
           style="font-size:24px"
           id="path3902" />
      </g>
      <g
         aria-label="a"
         id="text7722-5"
         style="line-height:0%;font-family:'CMU Typewriter Text';-inkscape-font-specification:'CMU Typewriter Text';letter-spacing:0px;word-spacing:0">
        <path
           d="m 140.88,87.952 c 0,1.104 1.008,2.144 2.64,2.144 0.592,0 1.584,-0.112 2.336,-0.608 0.352,0.496 1.12,0.512 1.728,0.512 0.448,0 0.8,0 0.8,-0.496 0,-0.48 -0.4,-0.48 -0.64,-0.48 -0.672,0 -0.832,-0.08 -0.96,-0.128 V 85.44 c 0,-1.136 -0.864,-2.48 -3.168,-2.48 -0.688,0 -2.32,0 -2.32,1.168 0,0.48 0.336,0.736 0.72,0.736 0.24,0 0.688,-0.144 0.704,-0.736 0,-0.128 0.016,-0.144 0.336,-0.176 0.224,-0.016 0.432,-0.016 0.576,-0.016 1.216,0 2.048,0.496 2.048,1.632 -2.832,0.048 -4.8,0.848 -4.8,2.384 z m 1.104,0 c 0,-0.784 1.376,-1.376 3.696,-1.44 v 1.344 c 0,0.368 0,0.704 -0.624,0.992 -0.576,0.272 -1.296,0.272 -1.424,0.272 -0.992,0 -1.648,-0.544 -1.648,-1.168 z"
           style="font-size:16px"
           id="path3905" />
      </g>
    </g>
  </g>
</svg>
