<?xml version="1.0" encoding="UTF-8" standalone="no"?>
<svg
   viewBox="0 0 147.22629 203.0738"
   version="1.1"
   id="svg16137"
   sodipodi:docname="communication_messages_.svg"
   width="147.22629"
   height="203.07381"
   inkscape:version="1.1.1 (3bf5ae0d25, 2021-09-20)"
   xmlns:inkscape="http://www.inkscape.org/namespaces/inkscape"
   xmlns:sodipodi="http://sodipodi.sourceforge.net/DTD/sodipodi-0.dtd"
   xmlns="http://www.w3.org/2000/svg"
   xmlns:svg="http://www.w3.org/2000/svg">
  <sodipodi:namedview
     id="namedview16139"
     pagecolor="#ffffff"
     bordercolor="#666666"
     borderopacity="1.0"
     inkscape:pageshadow="2"
     inkscape:pageopacity="0.0"
     inkscape:pagecheckerboard="0"
     showgrid="false"
     inkscape:zoom="3.0748765"
     inkscape:cx="134.80216"
     inkscape:cy="105.53269"
     inkscape:window-width="1920"
     inkscape:window-height="1017"
     inkscape:window-x="-8"
     inkscape:window-y="-8"
     inkscape:window-maximized="1"
     inkscape:current-layer="svg16137" />
  <defs
     id="defs16089">
    <marker
       id="a"
       orient="auto"
       overflow="visible"
       refX="0"
       refY="0">
      <path
         fill-rule="evenodd"
         stroke-linejoin="round"
         stroke-width="0.6"
         d="m 8.7,4 -11,-4 11,-4 a 6.8,6.8 0 0 0 0,8 z"
         font-size="12px"
         transform="scale(-0.6)"
         id="path16086" />
    </marker>
  </defs>
  <g
     aria-label="Position"
     id="text16093"
     style="font-size:13px;line-height:125%;font-family:'CMU Serif';-inkscape-font-specification:'CMU Serif';letter-spacing:0;word-spacing:0">
    <path
       d="m 50.932272,108.59273 c 0.455,-0.039 1.417,-0.039 1.911,-0.039 0.494,0 1.469,0 1.924,0.039 v -0.403 h -0.312 c -1.001,0 -1.027,-0.143 -1.027,-0.611 v -3.094 h 2.197 c 1.56,0 2.964,-1.053 2.964,-2.353 0,-1.274 -1.287,-2.418002 -3.068,-2.418002 h -4.589 v 0.403002 h 0.312 c 1.001,0 1.027,0.143 1.027,0.611 v 6.851 c 0,0.468 -0.026,0.611 -1.027,0.611 h -0.312 z m 2.457,-4.446 v -3.51 c 0,-0.429 0.026,-0.52 0.637,-0.52 h 1.157 c 2.067,0 2.067,1.378 2.067,2.015 0,0.611 0,2.015 -2.067,2.015 z"
       id="path19367" />
    <path
       d="m 59.317228,105.81073 c 0,1.677 1.352,2.925 2.873,2.925 1.573,0 2.886,-1.274 2.886,-2.925 0,-1.664 -1.3,-3.042 -2.873,-3.042 -1.625,0 -2.886,1.417 -2.886,3.042 z m 1.079,-0.104 c 0,-0.507 0,-1.209 0.312,-1.781 0.351,-0.598 0.962,-0.871 1.482,-0.871 0.572,0 1.131,0.286 1.469,0.845 0.338,0.559 0.338,1.313 0.338,1.807 0,0.468 0,1.17 -0.286,1.742 -0.286,0.585 -0.858,0.962 -1.508,0.962 -0.559,0 -1.131,-0.273 -1.482,-0.871 -0.325,-0.572 -0.325,-1.365 -0.325,-1.833 z"
       id="path19369" />
    <path
       d="m 65.882203,108.42373 c 0,0.221 0,0.312 0.143,0.312 0.065,0 0.078,-0.013 0.325,-0.26 0.026,-0.026 0.026,-0.052 0.26,-0.299 0.572,0.546 1.157,0.559 1.43,0.559 1.495,0 2.093,-0.871 2.093,-1.807 0,-0.689 -0.39,-1.079 -0.546,-1.235 -0.429,-0.416 -0.936,-0.52 -1.482,-0.624 -0.728,-0.143 -1.599,-0.312 -1.599,-1.066 0,-0.455 0.338,-0.988 1.456,-0.988 1.43,0 1.495,1.17 1.521,1.573 0.013,0.117 0.13,0.117 0.156,0.117 0.169,0 0.169,-0.065 0.169,-0.312 v -1.313 c 0,-0.221 0,-0.312 -0.143,-0.312 -0.065,0 -0.091,0 -0.26,0.156 -0.039,0.052 -0.169,0.169 -0.221,0.208 -0.494,-0.364 -1.027,-0.364 -1.222,-0.364 -1.586,0 -2.08,0.871 -2.08,1.599 0,0.455 0.208,0.819 0.559,1.105 0.416,0.338 0.78,0.416 1.716,0.598 0.286,0.052 1.352,0.26 1.352,1.196 0,0.663 -0.455,1.183 -1.469,1.183 -1.092,0 -1.56,-0.741 -1.807,-1.846 -0.039,-0.169 -0.052,-0.221 -0.182,-0.221 -0.169,0 -0.169,0.091 -0.169,0.325 z"
       id="path19371" />
    <path
       d="m 71.550191,100.58473 c 0,0.351 0.286,0.689 0.689,0.689 0.364,0 0.689,-0.273 0.689,-0.689 0,-0.416 -0.325,-0.689002 -0.689,-0.689002 -0.403,0 -0.689,0.351002 -0.689,0.689002 z m -0.546,8.008 c 0.416,-0.013 1.118,-0.039 1.43,-0.039 0.455,0 0.91,0.026 1.352,0.039 v -0.403 c -0.858,0 -0.91,-0.065 -0.91,-0.572 v -4.771 l -1.82,0.143 v 0.403 c 0.845,0 0.962,0.078 0.962,0.715 v 3.497 c 0,0.585 -0.143,0.585 -1.014,0.585 z"
       id="path19373" />
    <path
       d="m 74.423172,103.39273 h 1.105 v 3.588 c 0,1.599 1.209,1.755 1.677,1.755 0.923,0 1.287,-0.923 1.287,-1.755 v -0.741 h -0.325 v 0.715 c 0,0.962 -0.39,1.456 -0.871,1.456 -0.871,0 -0.871,-1.183 -0.871,-1.404 v -3.614 h 1.859 v -0.403 h -1.859 v -2.392 h -0.325 c -0.013,1.066 -0.403,2.457 -1.677,2.509 z"
       id="path19375" />
    <path
       d="m 80.195154,100.58473 c 0,0.351 0.286,0.689 0.689,0.689 0.364,0 0.689,-0.273 0.689,-0.689 0,-0.416 -0.325,-0.689002 -0.689,-0.689002 -0.403,0 -0.689,0.351002 -0.689,0.689002 z m -0.546,8.008 c 0.416,-0.013 1.118,-0.039 1.43,-0.039 0.455,0 0.91,0.026 1.352,0.039 v -0.403 c -0.858,0 -0.91,-0.065 -0.91,-0.572 v -4.771 l -1.82,0.143 v 0.403 c 0.845,0 0.962,0.078 0.962,0.715 v 3.497 c 0,0.585 -0.143,0.585 -1.014,0.585 z"
       id="path19377" />
    <path
       d="m 83.185136,105.81073 c 0,1.677 1.352,2.925 2.873,2.925 1.573,0 2.886,-1.274 2.886,-2.925 0,-1.664 -1.3,-3.042 -2.873,-3.042 -1.625,0 -2.886,1.417 -2.886,3.042 z m 1.079,-0.104 c 0,-0.507 0,-1.209 0.312,-1.781 0.351,-0.598 0.962,-0.871 1.482,-0.871 0.572,0 1.131,0.286 1.469,0.845 0.338,0.559 0.338,1.313 0.338,1.807 0,0.468 0,1.17 -0.286,1.742 -0.286,0.585 -0.858,0.962 -1.508,0.962 -0.559,0 -1.131,-0.273 -1.482,-0.871 -0.325,-0.572 -0.325,-1.365 -0.325,-1.833 z"
       id="path19379" />
    <path
       d="m 89.73711,108.59273 c 0.455,-0.013 1.118,-0.039 1.469,-0.039 0.338,0 1.014,0.026 1.456,0.039 v -0.403 c -0.871,0 -1.014,0 -1.014,-0.585 v -2.392 c 0,-1.352 0.923,-2.08 1.755,-2.08 0.819,0 0.962,0.702 0.962,1.443 v 3.029 c 0,0.585 -0.143,0.585 -1.014,0.585 v 0.403 c 0.455,-0.013 1.118,-0.039 1.469,-0.039 0.338,0 1.014,0.026 1.456,0.039 v -0.403 c -0.676,0 -1.001,0 -1.014,-0.39 v -2.483 c 0,-1.118 0,-1.521 -0.403,-1.989 -0.182,-0.221 -0.611,-0.481 -1.365,-0.481 -0.949,0 -1.56,0.559 -1.924,1.365 v -1.365 l -1.833,0.143 v 0.403 c 0.91,0 1.014,0.091 1.014,0.728 v 3.484 c 0,0.585 -0.143,0.585 -1.014,0.585 z"
       id="path19381" />
  </g>
  <path
     fill="none"
     stroke="#000000"
     d="M 46.277274,93.292742 H 101.37727 V 113.59274 H 46.277274 Z"
     id="path16095" />
  <g
     aria-label="Input"
     id="text16099"
     style="font-size:13px;line-height:125%;font-family:'CMU Serif';-inkscape-font-specification:'CMU Serif';letter-spacing:0;word-spacing:0">
    <path
       d="m 58.741274,133.29274 c 0.455,-0.039 1.482,-0.039 1.976,-0.039 0.507,0 1.534,0 1.989,0.039 v -0.403 h -0.338 c -1.027,0 -1.066,-0.143 -1.066,-0.611 v -6.851 c 0,-0.468 0.039,-0.611 1.066,-0.611 h 0.338 v -0.403 c -0.455,0.039 -1.482,0.039 -1.976,0.039 -0.507,0 -1.534,0 -1.989,-0.039 v 0.403 h 0.338 c 1.027,0 1.066,0.143 1.066,0.611 v 6.851 c 0,0.468 -0.039,0.611 -1.066,0.611 h -0.338 z"
       id="path19384" />
    <path
       d="m 63.48625,133.29274 c 0.455,-0.013 1.118,-0.039 1.469,-0.039 0.338,0 1.014,0.026 1.456,0.039 v -0.403 c -0.871,0 -1.014,0 -1.014,-0.585 v -2.392 c 0,-1.352 0.923,-2.08 1.755,-2.08 0.819,0 0.962,0.702 0.962,1.443 v 3.029 c 0,0.585 -0.143,0.585 -1.014,0.585 v 0.403 c 0.455,-0.013 1.118,-0.039 1.469,-0.039 0.338,0 1.014,0.026 1.456,0.039 v -0.403 c -0.676,0 -1.001,0 -1.014,-0.39 v -2.483 c 0,-1.118 0,-1.521 -0.403,-1.989 -0.182,-0.221 -0.611,-0.481 -1.365,-0.481 -0.949,0 -1.56,0.559 -1.924,1.365 v -1.365 l -1.833,0.143 v 0.403 c 0.91,0 1.014,0.091 1.014,0.728 v 3.484 c 0,0.585 -0.143,0.585 -1.014,0.585 z"
       id="path19386" />
    <path
       d="m 70.649229,135.41174 v 0.403 c 0.442,-0.013 1.118,-0.039 1.456,-0.039 0.351,0 1.014,0.026 1.469,0.039 v -0.403 c -0.871,0 -1.014,0 -1.014,-0.585 v -2.184 -0.117 c 0.065,0.208 0.611,0.91 1.599,0.91 1.547,0 2.899,-1.274 2.899,-2.951 0,-1.651 -1.261,-2.938 -2.717,-2.938 -1.014,0 -1.56,0.572 -1.82,0.858 v -0.858 l -1.872,0.143 v 0.403 c 0.923,0 1.014,0.078 1.014,0.65 v 6.084 c 0,0.585 -0.143,0.585 -1.014,0.585 z m 1.911,-3.601 v -2.899 c 0.377,-0.663 1.014,-1.04 1.677,-1.04 0.949,0 1.742,1.144 1.742,2.613 0,1.573 -0.91,2.665 -1.872,2.665 -0.52,0 -1.014,-0.26 -1.365,-0.793 -0.182,-0.273 -0.182,-0.286 -0.182,-0.546 z"
       id="path19388" />
    <path
       d="m 77.916208,128.09274 c 1.014,0 1.014,0.039 1.014,1.196 v 1.95 c 0,1.014 0,2.197 1.976,2.197 0.728,0 1.3,-0.364 1.677,-1.17 v 1.17 l 1.872,-0.143 v -0.403 c -0.91,0 -1.014,-0.091 -1.014,-0.728 v -4.615 l -1.911,0.143 v 0.403 c 0.91,0 1.014,0.091 1.014,0.728 v 2.314 c 0,1.131 -0.624,2.015 -1.573,2.015 -1.092,0 -1.144,-0.611 -1.144,-1.287 v -4.316 l -1.911,0.143 z"
       id="path19390" />
    <path
       d="m 84.962187,128.09274 h 1.105 v 3.588 c 0,1.599 1.209,1.755 1.677,1.755 0.923,0 1.287,-0.923 1.287,-1.755 v -0.741 h -0.325 v 0.715 c 0,0.962 -0.39,1.456 -0.871,1.456 -0.871,0 -0.871,-1.183 -0.871,-1.404 v -3.614 h 1.859 v -0.403 h -1.859 v -2.392 h -0.325 c -0.013,1.066 -0.403,2.457 -1.677,2.509 z"
       id="path19392" />
  </g>
  <g
     aria-label="Logic"
     id="text16103"
     style="font-size:13px;line-height:125%;font-family:'CMU Serif';-inkscape-font-specification:'CMU Serif';letter-spacing:0;word-spacing:0">
    <path
       d="m 59.006278,158.29274 h 6.773 l 0.364,-3.354 h -0.325 c -0.143,1.326 -0.325,2.951 -2.613,2.951 h -1.066 c -0.611,0 -0.637,-0.091 -0.637,-0.52 v -6.929 c 0,-0.442 0,-0.624 1.235,-0.624 h 0.429 v -0.403 c -0.468,0.039 -1.651,0.039 -2.184,0.039 -0.507,0 -1.521,0 -1.976,-0.039 v 0.403 h 0.312 c 1.001,0 1.027,0.143 1.027,0.611 v 6.851 c 0,0.468 -0.026,0.611 -1.027,0.611 h -0.312 z"
       id="path19395" />
    <path
       d="m 67.066253,155.51074 c 0,1.677 1.352,2.925 2.873,2.925 1.573,0 2.886,-1.274 2.886,-2.925 0,-1.664 -1.3,-3.042 -2.873,-3.042 -1.625,0 -2.886,1.417 -2.886,3.042 z m 1.079,-0.104 c 0,-0.507 0,-1.209 0.312,-1.781 0.351,-0.598 0.962,-0.871 1.482,-0.871 0.572,0 1.131,0.286 1.469,0.845 0.338,0.559 0.338,1.313 0.338,1.807 0,0.468 0,1.17 -0.286,1.742 -0.286,0.585 -0.858,0.962 -1.508,0.962 -0.559,0 -1.131,-0.273 -1.482,-0.871 -0.325,-0.572 -0.325,-1.365 -0.325,-1.833 z"
       id="path19397" />
    <path
       d="m 73.566229,159.31974 c 0,0.936 1.287,1.651 2.873,1.651 1.534,0 2.886,-0.663 2.886,-1.677 0,-0.455 -0.182,-1.118 -0.845,-1.482 -0.689,-0.364 -1.443,-0.364 -2.236,-0.364 -0.325,0 -0.884,0 -0.975,-0.013 -0.416,-0.052 -0.689,-0.455 -0.689,-0.871 0,-0.052 0,-0.351 0.221,-0.611 0.507,0.364 1.04,0.403 1.287,0.403 1.209,0 2.106,-0.897 2.106,-1.898 0,-0.481 -0.208,-0.962 -0.533,-1.261 0.468,-0.442 0.936,-0.507 1.17,-0.507 0.026,0 0.091,0 0.13,0.013 -0.143,0.052 -0.208,0.195 -0.208,0.351 0,0.221 0.169,0.377 0.377,0.377 0.13,0 0.377,-0.091 0.377,-0.39 0,-0.221 -0.156,-0.637 -0.663,-0.637 -0.26,0 -0.832,0.078 -1.378,0.611 -0.546,-0.429 -1.092,-0.468 -1.378,-0.468 -1.209,0 -2.106,0.897 -2.106,1.898 0,0.572 0.286,1.066 0.611,1.339 -0.169,0.195 -0.403,0.624 -0.403,1.079 0,0.403 0.169,0.897 0.572,1.157 -0.78,0.221 -1.196,0.78 -1.196,1.3 z m 0.676,0 c 0,-0.598 0.494,-1.079 1.066,-1.118 h 0.767 c 1.118,0 2.574,0 2.574,1.118 0,0.702 -0.923,1.352 -2.197,1.352 -1.313,0 -2.21,-0.663 -2.21,-1.352 z m 0.715,-4.862 c 0,-0.351 0.013,-0.767 0.208,-1.092 0.104,-0.156 0.403,-0.52 0.923,-0.52 1.131,0 1.131,1.3 1.131,1.599 0,0.351 -0.013,0.767 -0.208,1.092 -0.104,0.156 -0.403,0.52 -0.923,0.52 -1.131,0 -1.131,-1.3 -1.131,-1.599 z"
       id="path19399" />
    <path
       d="m 80.677204,150.28474 c 0,0.351 0.286,0.689 0.689,0.689 0.364,0 0.689,-0.273 0.689,-0.689 0,-0.416 -0.325,-0.689 -0.689,-0.689 -0.403,0 -0.689,0.351 -0.689,0.689 z m -0.546,8.008 c 0.416,-0.013 1.118,-0.039 1.43,-0.039 0.455,0 0.91,0.026 1.352,0.039 v -0.403 c -0.858,0 -0.91,-0.065 -0.91,-0.572 v -4.771 l -1.82,0.143 v 0.403 c 0.845,0 0.962,0.078 0.962,0.715 v 3.497 c 0,0.585 -0.143,0.585 -1.014,0.585 z"
       id="path19401" />
    <path
       d="m 83.745185,155.48474 c 0,1.664 1.287,2.951 2.795,2.951 1.742,0 2.158,-1.56 2.158,-1.69 0,-0.13 -0.13,-0.13 -0.169,-0.13 -0.117,0 -0.143,0.052 -0.169,0.13 -0.377,1.209 -1.222,1.365 -1.703,1.365 -0.689,0 -1.833,-0.559 -1.833,-2.652 0,-2.119 1.066,-2.665 1.755,-2.665 0.117,0 0.936,0.013 1.391,0.481 -0.533,0.039 -0.611,0.429 -0.611,0.598 0,0.338 0.234,0.598 0.598,0.598 0.338,0 0.598,-0.221 0.598,-0.611 0,-0.884 -0.988,-1.391 -1.989,-1.391 -1.625,0 -2.821,1.404 -2.821,3.016 z"
       id="path19403" />
  </g>
  <g
     aria-label="Output"
     id="text16107"
     style="font-size:13px;line-height:125%;font-family:'CMU Serif';-inkscape-font-specification:'CMU Serif';letter-spacing:0;word-spacing:0">
    <path
       d="m 53.605274,178.88574 c 0,2.665 2.002,4.693 4.316,4.693 2.366,0 4.329,-2.067 4.329,-4.693 0,-2.652 -1.963,-4.758 -4.329,-4.758 -2.327,0 -4.316,2.08 -4.316,4.758 z m 1.339,-0.182 c 0,-3.367 1.898,-4.251 2.977,-4.251 1.131,0 2.99,0.923 2.99,4.251 0,3.445 -1.781,4.537 -2.977,4.537 -1.248,0 -2.99,-1.144 -2.99,-4.537 z"
       id="path19406" />
    <path
       d="m 63.394254,178.09274 c 1.014,0 1.014,0.039 1.014,1.196 v 1.95 c 0,1.014 0,2.197 1.976,2.197 0.728,0 1.3,-0.364 1.677,-1.17 v 1.17 l 1.872,-0.143 v -0.403 c -0.91,0 -1.014,-0.091 -1.014,-0.728 v -4.615 l -1.911,0.143 v 0.403 c 0.91,0 1.014,0.091 1.014,0.728 v 2.314 c 0,1.131 -0.624,2.015 -1.573,2.015 -1.092,0 -1.144,-0.611 -1.144,-1.287 v -4.316 l -1.911,0.143 z"
       id="path19408" />
    <path
       d="m 70.440233,178.09274 h 1.105 v 3.588 c 0,1.599 1.209,1.755 1.677,1.755 0.923,0 1.287,-0.923 1.287,-1.755 v -0.741 h -0.325 v 0.715 c 0,0.962 -0.39,1.456 -0.871,1.456 -0.871,0 -0.871,-1.183 -0.871,-1.404 v -3.614 h 1.859 v -0.403 h -1.859 v -2.392 h -0.325 c -0.013,1.066 -0.403,2.457 -1.677,2.509 z"
       id="path19410" />
    <path
       d="m 75.601215,185.41174 v 0.403 c 0.442,-0.013 1.118,-0.039 1.456,-0.039 0.351,0 1.014,0.026 1.469,0.039 v -0.403 c -0.871,0 -1.014,0 -1.014,-0.585 v -2.184 -0.117 c 0.065,0.208 0.611,0.91 1.599,0.91 1.547,0 2.899,-1.274 2.899,-2.951 0,-1.651 -1.261,-2.938 -2.717,-2.938 -1.014,0 -1.56,0.572 -1.82,0.858 v -0.858 l -1.872,0.143 v 0.403 c 0.923,0 1.014,0.078 1.014,0.65 v 6.084 c 0,0.585 -0.143,0.585 -1.014,0.585 z m 1.911,-3.601 v -2.899 c 0.377,-0.663 1.014,-1.04 1.677,-1.04 0.949,0 1.742,1.144 1.742,2.613 0,1.573 -0.91,2.665 -1.872,2.665 -0.52,0 -1.014,-0.26 -1.365,-0.793 -0.182,-0.273 -0.182,-0.286 -0.182,-0.546 z"
       id="path19412" />
    <path
       d="m 82.868194,178.09274 c 1.014,0 1.014,0.039 1.014,1.196 v 1.95 c 0,1.014 0,2.197 1.976,2.197 0.728,0 1.3,-0.364 1.677,-1.17 v 1.17 l 1.872,-0.143 v -0.403 c -0.91,0 -1.014,-0.091 -1.014,-0.728 v -4.615 l -1.911,0.143 v 0.403 c 0.91,0 1.014,0.091 1.014,0.728 v 2.314 c 0,1.131 -0.624,2.015 -1.573,2.015 -1.092,0 -1.144,-0.611 -1.144,-1.287 v -4.316 l -1.911,0.143 z"
       id="path19414" />
    <path
       d="m 89.914175,178.09274 h 1.105 v 3.588 c 0,1.599 1.209,1.755 1.677,1.755 0.923,0 1.287,-0.923 1.287,-1.755 v -0.741 h -0.325 v 0.715 c 0,0.962 -0.39,1.456 -0.871,1.456 -0.871,0 -0.871,-1.183 -0.871,-1.404 v -3.614 h 1.859 v -0.403 h -1.859 v -2.392 h -0.325 c -0.013,1.066 -0.403,2.457 -1.677,2.509 z"
       id="path19416" />
  </g>
  <path
     fill="none"
     stroke="#000000"
     d="M 36.277274,83.292742 H 111.27727 V 198.29274 H 36.277274 Z"
     id="path16109" />
  <g
     aria-label="Player"
     id="text16113"
     style="font-weight:bold;font-size:13px;line-height:125%;font-family:'CMU Serif';-inkscape-font-specification:'CMU Serif Bold';letter-spacing:0;word-spacing:0">
    <path
       d="m 51.584278,78.29274 c 0.494,-0.039 1.768,-0.039 2.327,-0.039 0.559,0 1.833,0 2.327,0.039 v -0.611 h -1.404 v -3.315 h 2.301 c 1.807,0 3.315,-0.936 3.315,-2.457 0,-1.43 -1.287,-2.535 -3.445,-2.535 h -5.421 v 0.611 h 1.404 v 7.696 h -1.404 z m 3.172,-4.459 v -3.848 h 1.755 c 1.95,0 1.95,0.988 1.95,1.924 0,0.923 0,1.924 -1.963,1.924 z"
       id="path19354" />
    <path
       d="m 61.906269,78.29274 c 0.416,-0.013 1.04,-0.039 1.599,-0.039 0.559,0 1.157,0.026 1.599,0.039 v -0.611 h -0.897 v -8.411 l -2.301,0.104 v 0.611 c 0.806,0 0.897,0 0.897,0.507 v 7.189 h -0.897 z"
       id="path19356" />
    <path
       d="m 65.858247,76.88874 c 0,1.248 1.612,1.482 2.509,1.482 1.04,0 1.651,-0.533 1.937,-1.079 0,0.403 0,1.001 1.352,1.001 h 0.624 c 0.26,0 0.416,0 0.416,-0.312 0,-0.299 -0.169,-0.299 -0.338,-0.299 -0.793,-0.013 -0.793,-0.182 -0.793,-0.481 v -2.795 c 0,-1.157 -0.923,-2.002 -2.86,-2.002 -0.741,0 -2.327,0.052 -2.327,1.196 0,0.572 0.455,0.819 0.806,0.819 0.403,0 0.819,-0.273 0.819,-0.819 0,-0.39 -0.247,-0.611 -0.286,-0.637 0.364,-0.078 0.78,-0.091 0.936,-0.091 0.975,0 1.43,0.546 1.43,1.534 v 0.442 c -0.923,0.039 -4.225,0.156 -4.225,2.041 z m 1.521,-0.013 c 0,-1.404 2.054,-1.586 2.704,-1.625 v 1.235 c 0,1.248 -1.196,1.417 -1.521,1.417 -0.663,0 -1.183,-0.455 -1.183,-1.027 z"
       id="path19358" />
    <path
       d="m 72.579203,79.69674 c 0,0.663 0.611,1.196 1.391,1.196 1.001,0 1.755,-0.806 2.106,-1.547 l 2.795,-5.941 c 0.091,-0.182 0.13,-0.273 0.962,-0.273 v -0.611 c -0.312,0.026 -0.702,0.039 -1.027,0.039 -0.325,0 -0.91,-0.026 -1.183,-0.039 v 0.611 c 0.026,0 0.611,0 0.611,0.156 0,0.013 -0.052,0.143 -0.065,0.156 l -1.495,3.198 -1.651,-3.51 h 0.702 v -0.611 c -0.429,0.026 -1.599,0.039 -1.612,0.039 -0.364,0 -0.949,-0.026 -1.482,-0.039 v 0.611 h 0.832 l 2.431,5.161 -0.299,0.624 c -0.286,0.624 -0.702,1.508 -1.625,1.508 -0.182,0 -0.208,-0.013 -0.312,-0.052 0.117,-0.052 0.416,-0.234 0.416,-0.689 0,-0.429 -0.312,-0.741 -0.754,-0.741 -0.364,0 -0.741,0.247 -0.741,0.754 z"
       id="path19360" />
    <path
       d="m 80.171171,75.36774 c 0,1.742 1.3,3.003 3.393,3.003 2.054,0 2.613,-1.378 2.613,-1.599 0,-0.234 -0.247,-0.234 -0.312,-0.234 -0.221,0 -0.247,0.065 -0.325,0.273 -0.273,0.624 -1.014,1.04 -1.859,1.04 -1.833,0 -1.846,-1.729 -1.846,-2.392 h 3.926 c 0.286,0 0.416,0 0.416,-0.351 0,-0.403 -0.078,-1.352 -0.728,-2.002 -0.481,-0.468 -1.17,-0.702 -2.067,-0.702 -2.08,0 -3.211,1.339 -3.211,2.964 z m 1.664,-0.338 c 0.026,-0.507 0.039,-1.053 0.312,-1.482 0.338,-0.52 0.858,-0.676 1.235,-0.676 1.521,0 1.547,1.703 1.56,2.158 z"
       id="path19362" />
    <path
       d="m 87.087152,78.29274 c 0.455,-0.013 1.04,-0.039 1.638,-0.039 0.494,0 1.326,0 1.794,0.039 v -0.611 h -1.131 v -2.275 c 0,-0.91 0.325,-2.496 1.625,-2.496 -0.013,0.013 -0.247,0.221 -0.247,0.598 0,0.533 0.416,0.793 0.793,0.793 0.377,0 0.793,-0.273 0.793,-0.793 0,-0.689 -0.702,-1.066 -1.378,-1.066 -0.91,0 -1.43,0.65 -1.729,1.469 v -1.469 l -2.158,0.104 v 0.611 c 0.806,0 0.897,0 0.897,0.507 v 4.017 h -0.897 z"
       id="path19364" />
  </g>
  <path
     fill="none"
     stroke="#000000"
     d="m 36.277274,63.292742 h 74.999996 v 20 H 36.277274 Z"
     id="path16115" />
  <path
     fill="none"
     stroke="#000000"
     marker-end="url(#a)"
     d="m 46.277274,128.29274 h -30 l -0.1,-84.999998 h 60.1 v 20"
     id="path16117" />
  <g
     aria-label="sendMessage(inputMsg)"
     transform="rotate(-90.5)"
     id="text16121"
     style="font-size:13px;line-height:125%;font-family:cmtt10;-inkscape-font-specification:cmtt10;letter-spacing:0;word-spacing:0">
    <path
       d="m -151.28951,2.9634733 v 1.1044922 q -0.49511,-0.2539062 -1.02832,-0.3808594 -0.5332,-0.1269531 -1.10449,-0.1269531 -0.86963,0 -1.30761,0.2666016 -0.43165,0.2666015 -0.43165,0.7998047 0,0.40625 0.31104,0.6411132 0.31103,0.2285157 1.25049,0.4379883 l 0.3999,0.088867 q 1.24414,0.2666016 1.76465,0.7553711 0.52685,0.4824219 0.52685,1.3520508 0,0.9902344 -0.78711,1.5678711 -0.78076,0.577637 -2.15185,0.577637 -0.57129,0 -1.19336,-0.1142581 -0.61572,-0.1079102 -1.30127,-0.3300781 V 8.3970671 q 0.64746,0.3364258 1.27588,0.5078125 0.62842,0.165039 1.24414,0.165039 0.8252,0 1.26953,-0.2792968 0.44434,-0.2856446 0.44434,-0.7998047 0,-0.4760742 -0.32373,-0.7299805 -0.31739,-0.2539062 -1.40284,-0.4887695 l -0.40625,-0.095215 q -1.08544,-0.2285156 -1.56787,-0.6982422 -0.48242,-0.4760742 -0.48242,-1.3012695 0,-1.0029297 0.71094,-1.5488281 0.71094,-0.5458985 2.01855,-0.5458985 0.64746,0 1.21875,0.095215 0.57129,0.095215 1.05371,0.2856445 z"
       id="path19311" />
    <path
       d="m -142.96773,6.016696 v 0.571289 h -5.37011 q 0.0762,1.2060547 0.72363,1.8408204 0.65381,0.6284179 1.81543,0.6284179 0.67285,0 1.30127,-0.165039 0.63476,-0.1650391 1.25683,-0.4951172 v 1.1044922 q -0.62841,0.2666015 -1.28857,0.40625 -0.66016,0.1396487 -1.33936,0.1396487 -1.70117,0 -2.69775,-0.9902347 -0.99023,-0.9902344 -0.99023,-2.6787109 0,-1.7456055 0.93945,-2.7675781 0.9458,-1.0283204 2.54541,-1.0283204 1.43457,0 2.26611,0.9267579 0.83789,0.9204101 0.83789,2.5073242 z m -1.16797,-0.3427735 q -0.0127,-0.9584961 -0.53955,-1.5297851 -0.52051,-0.5712891 -1.38379,-0.5712891 -0.97754,0 -1.56787,0.5522461 -0.58398,0.5522461 -0.67285,1.5551758 z"
       id="path19313" />
    <path
       d="m -135.14107,5.57236 v 4.2910157 h -1.16797 V 5.610446 q 0,-1.0092774 -0.39355,-1.5107422 -0.39356,-0.5014649 -1.18067,-0.5014649 -0.9458,0 -1.49169,0.6030274 -0.5459,0.6030273 -0.5459,1.644043 v 4.0180664 h -1.17432 v -7.109375 h 1.17432 v 1.1044922 q 0.41894,-0.6411133 0.98388,-0.9584961 0.57129,-0.3173829 1.31397,-0.3173829 1.2251,0 1.85351,0.7617188 0.62842,0.7553711 0.62842,2.2280273 z"
       id="path19315" />
    <path
       d="m -128.13326,3.8331022 v -3.84667966 h 1.16797 V 9.8633757 h -1.16797 V 8.7969694 q -0.36816,0.6347656 -0.9331,0.9458008 -0.55859,0.3046878 -1.3457,0.3046878 -1.28858,0 -2.10108,-1.0283206 -0.80615,-1.0283203 -0.80615,-2.7041016 0,-1.6757812 0.80615,-2.7041015 0.8125,-1.0283204 2.10108,-1.0283204 0.78711,0 1.3457,0.3110352 0.56494,0.3046875 0.9331,0.9394531 z m -3.97998,2.4819336 q 0,1.2885742 0.52686,2.0249024 0.5332,0.7299804 1.45996,0.7299804 0.92676,0 1.45996,-0.7299804 0.5332,-0.7363282 0.5332,-2.0249024 0,-1.2885742 -0.5332,-2.0185547 -0.5332,-0.7363281 -1.45996,-0.7363281 -0.92676,0 -1.45996,0.7363281 -0.52686,0.7299805 -0.52686,2.0185547 z"
       id="path19317" />
    <path
       d="m -124.50874,0.38632488 h 1.91064 l 2.41846,6.44921872 2.43115,-6.44921872 h 1.91065 V 9.8633757 h -1.25049 V 1.5415983 l -2.44385,6.5 h -1.28858 l -2.44384,-6.5 v 8.3217774 h -1.24414 z"
       id="path19319" />
    <path
       d="m -107.26216,6.016696 v 0.571289 h -5.37012 q 0.0762,1.2060547 0.72363,1.8408204 0.65381,0.6284179 1.81543,0.6284179 0.67286,0 1.30127,-0.165039 0.63477,-0.1650391 1.25684,-0.4951172 v 1.1044922 q -0.62842,0.2666015 -1.28857,0.40625 -0.66016,0.1396487 -1.33936,0.1396487 -1.70117,0 -2.69775,-0.9902347 -0.99024,-0.9902344 -0.99024,-2.6787109 0,-1.7456055 0.93945,-2.7675781 0.94581,-1.0283204 2.54541,-1.0283204 1.43458,0 2.26612,0.9267579 0.83789,0.9204101 0.83789,2.5073242 z m -1.16797,-0.3427735 q -0.0127,-0.9584961 -0.53955,-1.5297851 -0.52051,-0.5712891 -1.38379,-0.5712891 -0.97754,0 -1.56787,0.5522461 -0.58399,0.5522461 -0.67285,1.5551758 z"
       id="path19321" />
    <path
       d="m -100.81294,2.9634733 v 1.1044922 q -0.49512,-0.2539062 -1.02832,-0.3808594 -0.53321,-0.1269531 -1.1045,-0.1269531 -0.86962,0 -1.30761,0.2666016 -0.43164,0.2666015 -0.43164,0.7998047 0,0.40625 0.31103,0.6411132 0.31104,0.2285157 1.25049,0.4379883 l 0.3999,0.088867 q 1.24414,0.2666016 1.76465,0.7553711 0.52686,0.4824219 0.52686,1.3520508 0,0.9902344 -0.78711,1.5678711 -0.78076,0.577637 -2.15186,0.577637 -0.57129,0 -1.19336,-0.1142581 -0.61572,-0.1079102 -1.30127,-0.3300781 V 8.3970671 q 0.64746,0.3364258 1.27588,0.5078125 0.62842,0.165039 1.24414,0.165039 0.8252,0 1.26953,-0.2792968 0.44434,-0.2856446 0.44434,-0.7998047 0,-0.4760742 -0.32373,-0.7299805 -0.31738,-0.2539062 -1.40283,-0.4887695 l -0.40625,-0.095215 q -1.08545,-0.2285156 -1.56787,-0.6982422 -0.48243,-0.4760742 -0.48243,-1.3012695 0,-1.0029297 0.71094,-1.5488281 0.71094,-0.5458985 2.01856,-0.5458985 0.64746,0 1.21875,0.095215 0.57129,0.095215 1.05371,0.2856445 z"
       id="path19323" />
    <path
       d="M -94.039993,2.9634733 V 4.0679655 Q -94.53511,3.8140593 -95.068314,3.6871061 -95.601517,3.560153 -96.172806,3.560153 q -0.869629,0 -1.307617,0.2666016 -0.431641,0.2666015 -0.431641,0.7998047 0,0.40625 0.311036,0.6411132 0.311035,0.2285157 1.250488,0.4379883 l 0.399902,0.088867 q 1.244141,0.2666016 1.764649,0.7553711 0.526855,0.4824219 0.526855,1.3520508 0,0.9902344 -0.787109,1.5678711 -0.780762,0.577637 -2.151856,0.577637 -0.571289,0 -1.193359,-0.1142581 -0.615723,-0.1079102 -1.30127,-0.3300781 V 8.3970671 q 0.647461,0.3364258 1.275879,0.5078125 0.628418,0.165039 1.244141,0.165039 0.825195,0 1.269531,-0.2792968 0.444336,-0.2856446 0.444336,-0.7998047 0,-0.4760742 -0.32373,-0.7299805 -0.317383,-0.2539062 -1.402832,-0.4887695 l -0.40625,-0.095215 q -1.08545,-0.2285156 -1.567872,-0.6982422 -0.482421,-0.4760742 -0.482421,-1.3012695 0,-1.0029297 0.710937,-1.5488281 0.710938,-0.5458985 2.018555,-0.5458985 0.647461,0 1.21875,0.095215 0.571289,0.095215 1.053711,0.2856445 z"
       id="path19325" />
    <path
       d="m -88.568314,6.2896452 q -1.415527,0 -1.961425,0.3237305 -0.545899,0.3237304 -0.545899,1.1044922 0,0.6220703 0.40625,0.9902343 0.412598,0.3618164 1.117188,0.3618164 0.971191,0 1.555175,-0.6855468 0.590332,-0.6918946 0.590332,-1.8344727 V 6.2896452 Z m 2.32959,-0.4824219 v 4.0561524 h -1.167969 V 8.7842741 q -0.399902,0.6474609 -0.996582,0.9584961 -0.596679,0.3046878 -1.45996,0.3046878 -1.091797,0 -1.739258,-0.6093753 -0.641114,-0.6157227 -0.641114,-1.644043 0,-1.199707 0.799805,-1.809082 0.806152,-0.609375 2.399414,-0.609375 h 1.637695 V 5.2613249 q 0,-0.8061524 -0.533203,-1.2441406 -0.526855,-0.444336 -1.485351,-0.444336 -0.609375,0 -1.187012,0.1459961 -0.577637,0.1459961 -1.11084,0.4379883 V 3.0777311 q 0.641114,-0.2475586 1.244141,-0.368164 0.603027,-0.1269532 1.174316,-0.1269532 1.542481,0 2.304199,0.7998047 0.761719,0.7998047 0.761719,2.4248047 z"
       id="path19327" />
    <path
       d="m -79.154739,6.2261686 q 0,-1.2695312 -0.526856,-1.9677734 -0.520508,-0.6982422 -1.466308,-0.6982422 -0.939454,0 -1.466309,0.6982422 -0.520508,0.6982422 -0.520508,1.9677734 0,1.2631836 0.520508,1.9614258 0.526855,0.6982422 1.466309,0.6982422 0.9458,0 1.466308,-0.6982422 0.526856,-0.6982422 0.526856,-1.9614258 z m 1.167968,2.7548828 q 0,1.8154296 -0.806152,2.6977536 -0.806152,0.888672 -2.469238,0.888672 -0.615723,0 -1.161621,-0.09521 -0.545899,-0.08887 -1.060059,-0.279296 v -1.136231 q 0.51416,0.279297 1.015625,0.412598 0.501465,0.1333 1.021973,0.1333 1.148925,0 1.720215,-0.603027 0.571289,-0.59668 0.571289,-1.8090819 V 8.6128874 q -0.361817,0.628418 -0.926758,0.9394531 -0.564942,0.3110352 -1.352051,0.3110352 -1.307617,0 -2.107422,-0.9965821 -0.799805,-0.996582 -0.799805,-2.640625 0,-1.6503906 0.799805,-2.6469726 0.799805,-0.9965821 2.107422,-0.9965821 0.787109,0 1.352051,0.3110352 0.564941,0.3110352 0.926758,0.9394531 V 2.7540007 h 1.167968 z"
       id="path19329" />
    <path
       d="m -69.499954,6.016696 v 0.571289 h -5.370117 q 0.07617,1.2060547 0.723632,1.8408204 0.653809,0.6284179 1.81543,0.6284179 0.672852,0 1.30127,-0.165039 0.634765,-0.1650391 1.256836,-0.4951172 v 1.1044922 q -0.628418,0.2666015 -1.288575,0.40625 -0.660156,0.1396487 -1.339355,0.1396487 -1.701172,0 -2.697754,-0.9902347 -0.990234,-0.9902344 -0.990234,-2.6787109 0,-1.7456055 0.939453,-2.7675781 0.9458,-1.0283204 2.54541,-1.0283204 1.43457,0 2.266113,0.9267579 0.837891,0.9204101 0.837891,2.5073242 z m -1.167969,-0.3427735 q -0.01269,-0.9584961 -0.539551,-1.5297851 -0.520508,-0.5712891 -1.383789,-0.5712891 -0.977539,0 -1.567871,0.5522461 -0.583984,0.5522461 -0.672851,1.5551758 z"
       id="path19331" />
    <path
       d="M -64.777298,-8.8214874e-4 Q -65.627884,1.4590788 -66.040482,2.8873014 q -0.412597,1.4282227 -0.412597,2.8945313 0,1.4663086 0.412597,2.9072266 0.418946,1.4345707 1.263184,2.8881837 h -1.015625 q -0.952148,-1.491699 -1.428223,-2.9326173 -0.469726,-1.440918 -0.469726,-2.862793 0,-1.4155273 0.469726,-2.8500977 0.469727,-1.4345703 1.428223,-2.93261714874 z"
       id="path19333" />
    <path
       d="m -62.511185,2.7540007 h 1.167969 v 7.109375 h -1.167969 z m 0,-2.76757816 h 1.167969 V 1.4654264 h -1.167969 z"
       id="path19335" />
    <path
       d="m -52.9897,5.57236 v 4.2910157 h -1.167969 V 5.610446 q 0,-1.0092774 -0.393555,-1.5107422 -0.393554,-0.5014649 -1.180664,-0.5014649 -0.945801,0 -1.491699,0.6030274 -0.545898,0.6030273 -0.545898,1.644043 v 4.0180664 h -1.174317 v -7.109375 h 1.174317 v 1.1044922 q 0.418945,-0.6411133 0.983886,-0.9584961 0.571289,-0.3173829 1.313965,-0.3173829 1.225098,0 1.853516,0.7617188 0.628418,0.7553711 0.628418,2.2280273 z"
       id="path19337" />
    <path
       d="m -49.530228,8.7969694 v 3.7705076 h -1.174316 V 2.7540007 h 1.174316 v 1.0791015 q 0.368164,-0.6347656 0.926758,-0.9394531 0.564942,-0.3110352 1.345703,-0.3110352 1.294922,0 2.101074,1.0283204 0.8125,1.0283203 0.8125,2.7041015 0,1.6757813 -0.8125,2.7041016 -0.806152,1.0283206 -2.101074,1.0283206 -0.780761,0 -1.345703,-0.3046878 -0.558594,-0.3110352 -0.926758,-0.9458008 z m 3.973633,-2.4819336 q 0,-1.2885742 -0.533203,-2.0185547 -0.526855,-0.7363281 -1.453613,-0.7363281 -0.926758,0 -1.459961,0.7363281 -0.526856,0.7299805 -0.526856,2.0185547 0,1.2885742 0.526856,2.0249024 0.533203,0.7299804 1.459961,0.7299804 0.926758,0 1.453613,-0.7299804 0.533203,-0.7363282 0.533203,-2.0249024 z"
       id="path19339" />
    <path
       d="M -42.528763,7.0577116 V 2.7540007 h 1.167969 V 7.013278 q 0,1.0092774 0.393555,1.5170899 0.393554,0.5014648 1.180664,0.5014648 0.9458,0 1.491699,-0.6030273 0.552246,-0.6030274 0.552246,-1.644043 V 2.7540007 h 1.167969 v 7.109375 H -37.74263 V 8.7715788 q -0.425293,0.6474609 -0.990234,0.9648437 -0.558594,0.3110355 -1.30127,0.3110355 -1.225098,0 -1.859863,-0.7617191 -0.634766,-0.7617187 -0.634766,-2.2280273 z m 2.938965,-4.4750977 z"
       id="path19341" />
    <path
       d="M -33.013626,0.73544598 V 2.7540007 h 2.405762 v 0.9077148 h -2.405762 v 3.859375 q 0,0.8696289 0.234863,1.1171875 0.241211,0.2475586 0.971192,0.2475586 h 1.199707 v 0.9775391 h -1.199707 q -1.352051,0 -1.866211,-0.5014649 -0.514161,-0.5078125 -0.514161,-1.8408203 v -3.859375 h -0.856933 V 2.7540007 h 0.856933 V 0.73544598 Z"
       id="path19343" />
    <path
       d="m -29.02095,0.38632488 h 1.910644 l 2.418457,6.44921872 2.431153,-6.44921872 h 1.910644 V 9.8633757 H -21.60054 V 1.5415983 l -2.443848,6.5 h -1.288574 l -2.443848,-6.5 v 8.3217774 h -1.24414 z"
       id="path19345" />
    <path
       d="M -13.323196,2.9634733 V 4.0679655 Q -13.818314,3.8140593 -14.351517,3.6871061 -14.88472,3.560153 -15.456009,3.560153 q -0.869629,0 -1.307617,0.2666016 -0.431641,0.2666015 -0.431641,0.7998047 0,0.40625 0.311035,0.6411132 0.311036,0.2285157 1.250489,0.4379883 l 0.399902,0.088867 q 1.244141,0.2666016 1.764648,0.7553711 0.526856,0.4824219 0.526856,1.3520508 0,0.9902344 -0.787109,1.5678711 -0.780762,0.577637 -2.151856,0.577637 -0.571289,0 -1.193359,-0.1142581 -0.615723,-0.1079102 -1.30127,-0.3300781 V 8.3970671 q 0.647461,0.3364258 1.275879,0.5078125 0.628418,0.165039 1.244141,0.165039 0.825195,0 1.269531,-0.2792968 0.444336,-0.2856446 0.444336,-0.7998047 0,-0.4760742 -0.323731,-0.7299805 -0.317382,-0.2539062 -1.402832,-0.4887695 l -0.40625,-0.095215 Q -17.360306,6.4483366 -17.842728,5.97861 -18.32515,5.5025358 -18.32515,4.6773405 q 0,-1.0029297 0.710938,-1.5488281 0.710937,-0.5458985 2.018555,-0.5458985 0.647461,0 1.21875,0.095215 0.571289,0.095215 1.053711,0.2856445 z"
       id="path19347" />
    <path
       d="m -6.4042511,6.2261686 q 0,-1.2695312 -0.5268555,-1.9677734 -0.5205078,-0.6982422 -1.4663086,-0.6982422 -0.9394531,0 -1.4663086,0.6982422 -0.5205082,0.6982422 -0.5205082,1.9677734 0,1.2631836 0.5205082,1.9614258 0.5268555,0.6982422 1.4663086,0.6982422 0.9458008,0 1.4663086,-0.6982422 0.5268555,-0.6982422 0.5268555,-1.9614258 z m 1.1679688,2.7548828 q 0,1.8154296 -0.8061524,2.6977536 -0.8061523,0.888672 -2.4692383,0.888672 -0.6157226,0 -1.1616211,-0.09521 -0.5458989,-0.08887 -1.0600589,-0.279296 v -1.136231 q 0.51416,0.279297 1.0156253,0.412598 0.5014649,0.1333 1.0219727,0.1333 1.1489258,0 1.7202148,-0.603027 0.5712891,-0.59668 0.5712891,-1.8090819 V 8.6128874 q -0.3618164,0.628418 -0.9267578,0.9394531 -0.5649414,0.3110352 -1.3520508,0.3110352 -1.3076172,0 -2.1074223,-0.9965821 -0.799804,-0.996582 -0.799804,-2.640625 0,-1.6503906 0.799804,-2.6469726 0.7998051,-0.9965821 2.1074223,-0.9965821 0.7871094,0 1.3520508,0.3110352 0.5649414,0.3110352 0.9267578,0.9394531 V 2.7540007 h 1.1679688 z"
       id="path19349" />
    <path
       d="m -3.0146027,-8.8214874e-4 h 1.015625 Q -1.0468292,1.4971647 -0.57710266,2.931735 q 0.47607422,1.4345704 0.47607422,2.8500977 0,1.421875 -0.47607422,2.862793 -0.46972654,1.4409183 -1.42187504,2.9326173 h -1.015625 q 0.8442383,-1.453613 1.256836,-2.8881837 0.4189453,-1.440918 0.4189453,-2.9072266 0,-1.4663086 -0.4189453,-2.8945313 -0.4125977,-1.4282226 -1.256836,-2.88818354874 z"
       id="path19351" />
  </g>
  <path
     fill="none"
     stroke="#000000"
     marker-end="url(#a)"
     d="m 111.27727,73.292742 h 20 v 29.999998 h -29.9"
     id="path16123" />
  <path
     fill="none"
     stroke="#000000"
     marker-end="url(#a)"
     d="m 131.27727,103.29274 v 25 h -29.9"
     id="path16125" />
  <path
     fill="none"
     stroke="#000000"
     marker-end="url(#a)"
     d="m 131.27727,128.29274 v 25 h -29.9"
     id="path16127" />
  <path
     fill="none"
     stroke="#000000"
     marker-end="url(#a)"
     d="m 131.27727,153.29274 v 25 h -29.9"
     id="path16129" />
  <g
     aria-label="handleMessage(msg)"
     transform="rotate(89.5)"
     id="text16133"
     style="font-size:13px;line-height:125%;font-family:cmtex10;-inkscape-font-specification:cmtex10;letter-spacing:0;word-spacing:0">
    <path
       d="m 73.386536,-139.87619 v 4.29102 h -1.167969 v -4.25293 q 0,-1.00928 -0.393555,-1.51075 -0.393554,-0.50146 -1.180664,-0.50146 -0.945801,0 -1.491699,0.60303 -0.545899,0.60302 -0.545899,1.64404 v 4.01807 h -1.174316 v -9.87696 h 1.174316 v 3.87207 q 0.418946,-0.64111 0.983887,-0.95849 0.571289,-0.31739 1.313965,-0.31739 1.225098,0 1.853516,0.76172 0.628418,0.75537 0.628418,2.22803 z"
       id="path19419" />
    <path
       d="m 78.947083,-139.15891 q -1.415528,0 -1.961426,0.32374 -0.545899,0.32373 -0.545899,1.10449 0,0.62207 0.40625,0.99023 0.412598,0.36182 1.117188,0.36182 0.971191,0 1.555176,-0.68555 0.590332,-0.69189 0.590332,-1.83447 v -0.26026 z m 2.329589,-0.48242 v 4.05616 h -1.167968 v -1.07911 q -0.399903,0.64746 -0.996582,0.9585 -0.59668,0.30469 -1.459961,0.30469 -1.091797,0 -1.739258,-0.60938 -0.641113,-0.61572 -0.641113,-1.64404 0,-1.19971 0.799804,-1.80908 0.806153,-0.60938 2.399414,-0.60938 h 1.637696 v -0.11426 q 0,-0.80615 -0.533204,-1.24414 -0.526855,-0.44433 -1.485351,-0.44433 -0.609375,0 -1.187012,0.14599 -0.577637,0.146 -1.11084,0.43799 v -1.0791 q 0.641114,-0.24756 1.244141,-0.36816 0.603027,-0.12696 1.174316,-0.12696 1.542481,0 2.3042,0.79981 0.761718,0.7998 0.761718,2.4248 z"
       id="path19421" />
    <path
       d="m 89.592102,-139.87619 v 4.29102 h -1.167969 v -4.25293 q 0,-1.00928 -0.393554,-1.51075 -0.393555,-0.50146 -1.180664,-0.50146 -0.945801,0 -1.4917,0.60303 -0.545898,0.60302 -0.545898,1.64404 v 4.01807 H 83.638 v -7.10938 h 1.174317 v 1.10449 q 0.418945,-0.64111 0.983887,-0.95849 0.571289,-0.31739 1.313964,-0.31739 1.225098,0 1.853516,0.76172 0.628418,0.75537 0.628418,2.22803 z"
       id="path19423" />
    <path
       d="m 96.599915,-141.61545 v -3.84668 h 1.167968 v 9.87696 h -1.167968 v -1.06641 q -0.368165,0.63476 -0.933106,0.9458 -0.558594,0.30469 -1.345703,0.30469 -1.288574,0 -2.101074,-1.02832 -0.806153,-1.02832 -0.806153,-2.7041 0,-1.67579 0.806153,-2.70411 0.8125,-1.02832 2.101074,-1.02832 0.787109,0 1.345703,0.31104 0.564941,0.30469 0.933106,0.93945 z m -3.979981,2.48194 q 0,1.28857 0.526856,2.0249 0.533203,0.72998 1.45996,0.72998 0.926758,0 1.459961,-0.72998 0.533204,-0.73633 0.533204,-2.0249 0,-1.28858 -0.533204,-2.01856 -0.533203,-0.73633 -1.459961,-0.73633 -0.926757,0 -1.45996,0.73633 -0.526856,0.72998 -0.526856,2.01856 z"
       id="path19425" />
    <path
       d="m 100.17365,-145.46213 h 1.16796 v 9.87696 h -1.16796 z"
       id="path19427" />
    <path
       d="m 109.86652,-139.43185 v 0.57128 h -5.37012 q 0.0762,1.20606 0.72363,1.84083 0.65381,0.62841 1.81543,0.62841 0.67285,0 1.30127,-0.16504 0.63477,-0.16504 1.25684,-0.49511 v 1.10449 q -0.62842,0.2666 -1.28858,0.40625 -0.66015,0.13965 -1.33935,0.13965 -1.70117,0 -2.69776,-0.99024 -0.99023,-0.99023 -0.99023,-2.67871 0,-1.7456 0.93945,-2.76758 0.9458,-1.02832 2.54541,-1.02832 1.43457,0 2.26612,0.92676 0.83789,0.92041 0.83789,2.50733 z m -1.16797,-0.34278 q -0.0127,-0.95849 -0.53955,-1.52978 -0.52051,-0.57129 -1.38379,-0.57129 -0.97754,0 -1.56787,0.55224 -0.58399,0.55225 -0.67286,1.55518 z"
       id="path19429" />
    <path
       d="m 111.83429,-145.06223 h 1.91064 l 2.41846,6.44922 2.43115,-6.44922 h 1.91065 v 9.47706 h -1.25049 v -8.32178 l -2.44385,6.5 h -1.28857 l -2.44385,-6.5 v 8.32178 h -1.24414 z"
       id="path19431" />
    <path
       d="m 129.08087,-139.43185 v 0.57128 h -5.37012 q 0.0762,1.20606 0.72364,1.84083 0.65381,0.62841 1.81543,0.62841 0.67285,0 1.30127,-0.16504 0.63476,-0.16504 1.25683,-0.49511 v 1.10449 q -0.62842,0.2666 -1.28857,0.40625 -0.66016,0.13965 -1.33936,0.13965 -1.70117,0 -2.69775,-0.99024 -0.99024,-0.99023 -0.99024,-2.67871 0,-1.7456 0.93946,-2.76758 0.9458,-1.02832 2.54541,-1.02832 1.43457,0 2.26611,0.92676 0.83789,0.92041 0.83789,2.50733 z m -1.16797,-0.34278 q -0.0127,-0.95849 -0.53955,-1.52978 -0.52051,-0.57129 -1.38379,-0.57129 -0.97754,0 -1.56787,0.55224 -0.58398,0.55225 -0.67285,1.55518 z"
       id="path19433" />
    <path
       d="m 135.53009,-142.48508 v 1.1045 q -0.49512,-0.25391 -1.02832,-0.38086 -0.5332,-0.12696 -1.10449,-0.12696 -0.86963,0 -1.30762,0.2666 -0.43164,0.26661 -0.43164,0.79981 0,0.40625 0.31104,0.64111 0.31103,0.22852 1.25048,0.43799 l 0.39991,0.0889 q 1.24414,0.2666 1.76464,0.75537 0.52686,0.48242 0.52686,1.35205 0,0.99023 -0.78711,1.56787 -0.78076,0.57764 -2.15186,0.57764 -0.57128,0 -1.19335,-0.11426 -0.61573,-0.10791 -1.30127,-0.33008 v -1.20605 q 0.64746,0.33642 1.27587,0.50781 0.62842,0.16504 1.24415,0.16504 0.82519,0 1.26953,-0.2793 0.44433,-0.28564 0.44433,-0.7998 0,-0.47608 -0.32373,-0.72998 -0.31738,-0.25391 -1.40283,-0.48877 l -0.40625,-0.0952 q -1.08545,-0.22851 -1.56787,-0.69824 -0.48242,-0.47607 -0.48242,-1.30127 0,-1.00293 0.71093,-1.54883 0.71094,-0.5459 2.01856,-0.5459 0.64746,0 1.21875,0.0952 0.57129,0.0952 1.05371,0.28564 z"
       id="path19435" />
    <path
       d="m 142.30304,-142.48508 v 1.1045 q -0.49512,-0.25391 -1.02832,-0.38086 -0.5332,-0.12696 -1.10449,-0.12696 -0.86963,0 -1.30762,0.2666 -0.43164,0.26661 -0.43164,0.79981 0,0.40625 0.31103,0.64111 0.31104,0.22852 1.25049,0.43799 l 0.39991,0.0889 q 1.24414,0.2666 1.76464,0.75537 0.52686,0.48242 0.52686,1.35205 0,0.99023 -0.78711,1.56787 -0.78076,0.57764 -2.15186,0.57764 -0.57128,0 -1.19336,-0.11426 -0.61572,-0.10791 -1.30126,-0.33008 v -1.20605 q 0.64746,0.33642 1.27587,0.50781 0.62842,0.16504 1.24414,0.16504 0.8252,0 1.26954,-0.2793 0.44433,-0.28564 0.44433,-0.7998 0,-0.47608 -0.32373,-0.72998 -0.31738,-0.25391 -1.40283,-0.48877 l -0.40625,-0.0952 q -1.08545,-0.22851 -1.56787,-0.69824 -0.48242,-0.47607 -0.48242,-1.30127 0,-1.00293 0.71093,-1.54883 0.71094,-0.5459 2.01856,-0.5459 0.64746,0 1.21875,0.0952 0.57129,0.0952 1.05371,0.28564 z"
       id="path19437" />
    <path
       d="m 147.77472,-139.15891 q -1.41553,0 -1.96143,0.32374 -0.54589,0.32373 -0.54589,1.10449 0,0.62207 0.40625,0.99023 0.41259,0.36182 1.11718,0.36182 0.97119,0 1.55518,-0.68555 0.59033,-0.69189 0.59033,-1.83447 v -0.26026 z m 2.32959,-0.48242 v 4.05616 h -1.16797 v -1.07911 q -0.3999,0.64746 -0.99658,0.9585 -0.59668,0.30469 -1.45996,0.30469 -1.0918,0 -1.73926,-0.60938 -0.64111,-0.61572 -0.64111,-1.64404 0,-1.19971 0.7998,-1.80908 0.80615,-0.60938 2.39942,-0.60938 h 1.63769 v -0.11426 q 0,-0.80615 -0.5332,-1.24414 -0.52686,-0.44433 -1.48535,-0.44433 -0.60938,0 -1.18702,0.14599 -0.57763,0.146 -1.11084,0.43799 v -1.0791 q 0.64112,-0.24756 1.24414,-0.36816 0.60303,-0.12696 1.17432,-0.12696 1.54248,0 2.3042,0.79981 0.76172,0.7998 0.76172,2.4248 z"
       id="path19439" />
    <path
       d="m 157.18829,-139.22238 q 0,-1.26953 -0.52685,-1.96778 -0.52051,-0.69824 -1.46631,-0.69824 -0.93945,0 -1.46631,0.69824 -0.52051,0.69825 -0.52051,1.96778 0,1.26318 0.52051,1.96142 0.52686,0.69825 1.46631,0.69825 0.9458,0 1.46631,-0.69825 0.52685,-0.69824 0.52685,-1.96142 z m 1.16797,2.75488 q 0,1.81543 -0.80615,2.69776 -0.80615,0.88867 -2.46924,0.88867 -0.61572,0 -1.16162,-0.0952 -0.5459,-0.0889 -1.06006,-0.27929 v -1.13624 q 0.51416,0.2793 1.01563,0.4126 0.50146,0.1333 1.02197,0.1333 1.14893,0 1.72021,-0.60302 0.57129,-0.59668 0.57129,-1.80909 v -0.57763 q -0.36181,0.62842 -0.92675,0.93945 -0.56495,0.31104 -1.35206,0.31104 -1.30761,0 -2.10742,-0.99659 -0.7998,-0.99658 -0.7998,-2.64062 0,-1.65039 0.7998,-2.64697 0.79981,-0.99659 2.10742,-0.99659 0.78711,0 1.35206,0.31104 0.56494,0.31103 0.92675,0.93945 v -1.0791 h 1.16797 z"
       id="path19441" />
    <path
       d="m 166.84308,-139.43185 v 0.57128 h -5.37012 q 0.0762,1.20606 0.72363,1.84083 0.65381,0.62841 1.81543,0.62841 0.67286,0 1.30127,-0.16504 0.63477,-0.16504 1.25684,-0.49511 v 1.10449 q -0.62842,0.2666 -1.28857,0.40625 -0.66016,0.13965 -1.33936,0.13965 -1.70117,0 -2.69775,-0.99024 -0.99024,-0.99023 -0.99024,-2.67871 0,-1.7456 0.93945,-2.76758 0.94581,-1.02832 2.54541,-1.02832 1.43458,0 2.26612,0.92676 0.83789,0.92041 0.83789,2.50733 z m -1.16797,-0.34278 q -0.0127,-0.95849 -0.53955,-1.52978 -0.52051,-0.57129 -1.38379,-0.57129 -0.97754,0 -1.56787,0.55224 -0.58399,0.55225 -0.67285,1.55518 z"
       id="path19443" />
    <path
       d="m 171.56573,-145.44943 q -0.85058,1.45996 -1.26318,2.88818 -0.4126,1.42822 -0.4126,2.89453 0,1.46631 0.4126,2.90723 0.41895,1.43457 1.26318,2.88818 h -1.01562 q -0.95215,-1.4917 -1.42822,-2.93261 -0.46973,-1.44092 -0.46973,-2.8628 0,-1.41552 0.46973,-2.8501 0.46972,-1.43457 1.42822,-2.93261 z"
       id="path19445" />
    <path
       d="m 179.367,-141.3298 q 0.43799,-0.78711 1.04737,-1.16162 0.60937,-0.37452 1.43457,-0.37452 1.11084,0 1.71387,0.78077 0.60302,0.77441 0.60302,2.20898 v 4.29102 h -1.17431 v -4.25293 q 0,-1.02198 -0.36182,-1.51709 -0.36182,-0.49512 -1.10449,-0.49512 -0.90772,0 -1.43457,0.60303 -0.52686,0.60302 -0.52686,1.64404 v 4.01807 h -1.17431 v -4.25293 q 0,-1.02832 -0.36182,-1.51709 -0.36182,-0.49512 -1.11719,-0.49512 -0.89502,0 -1.42187,0.60937 -0.52686,0.60303 -0.52686,1.6377 v 4.01807 h -1.17432 v -7.10938 h 1.17432 v 1.10449 q 0.3999,-0.65381 0.9585,-0.96484 0.55859,-0.31104 1.32666,-0.31104 0.77441,0 1.31396,0.39356 0.5459,0.39355 0.80615,1.14258 z"
       id="path19447" />
    <path
       d="m 191.02765,-142.48508 v 1.1045 q -0.49512,-0.25391 -1.02832,-0.38086 -0.5332,-0.12696 -1.10449,-0.12696 -0.86963,0 -1.30762,0.2666 -0.43164,0.26661 -0.43164,0.79981 0,0.40625 0.31103,0.64111 0.31104,0.22852 1.25049,0.43799 l 0.3999,0.0889 q 1.24415,0.2666 1.76465,0.75537 0.52686,0.48242 0.52686,1.35205 0,0.99023 -0.78711,1.56787 -0.78076,0.57764 -2.15186,0.57764 -0.57129,0 -1.19336,-0.11426 -0.61572,-0.10791 -1.30127,-0.33008 v -1.20605 q 0.64747,0.33642 1.27588,0.50781 0.62842,0.16504 1.24414,0.16504 0.8252,0 1.26954,-0.2793 0.44433,-0.28564 0.44433,-0.7998 0,-0.47608 -0.32373,-0.72998 -0.31738,-0.25391 -1.40283,-0.48877 l -0.40625,-0.0952 q -1.08545,-0.22851 -1.56787,-0.69824 -0.48242,-0.47607 -0.48242,-1.30127 0,-1.00293 0.71093,-1.54883 0.71094,-0.5459 2.01856,-0.5459 0.64746,0 1.21875,0.0952 0.57129,0.0952 1.05371,0.28564 z"
       id="path19449" />
    <path
       d="m 197.94659,-139.22238 q 0,-1.26953 -0.52685,-1.96778 -0.52051,-0.69824 -1.46631,-0.69824 -0.93945,0 -1.46631,0.69824 -0.52051,0.69825 -0.52051,1.96778 0,1.26318 0.52051,1.96142 0.52686,0.69825 1.46631,0.69825 0.9458,0 1.46631,-0.69825 0.52685,-0.69824 0.52685,-1.96142 z m 1.16797,2.75488 q 0,1.81543 -0.80615,2.69776 -0.80615,0.88867 -2.46924,0.88867 -0.61572,0 -1.16162,-0.0952 -0.5459,-0.0889 -1.06006,-0.27929 v -1.13624 q 0.51416,0.2793 1.01563,0.4126 0.50146,0.1333 1.02197,0.1333 1.14893,0 1.72022,-0.60302 0.57128,-0.59668 0.57128,-1.80909 v -0.57763 q -0.36181,0.62842 -0.92675,0.93945 -0.56494,0.31104 -1.35205,0.31104 -1.30762,0 -2.10743,-0.99659 -0.7998,-0.99658 -0.7998,-2.64062 0,-1.65039 0.7998,-2.64697 0.79981,-0.99659 2.10743,-0.99659 0.78711,0 1.35205,0.31104 0.56494,0.31103 0.92675,0.93945 v -1.0791 h 1.16797 z"
       id="path19451" />
    <path
       d="m 201.33624,-145.44943 h 1.01563 q 0.95215,1.49804 1.42187,2.93261 0.47608,1.43458 0.47608,2.8501 0,1.42188 -0.47608,2.8628 -0.46972,1.44091 -1.42187,2.93261 h -1.01563 q 0.84424,-1.45361 1.25684,-2.88818 0.41894,-1.44092 0.41894,-2.90723 0,-1.46631 -0.41894,-2.89453 -0.4126,-1.42822 -1.25684,-2.88818 z"
       id="path19453" />
  </g>
  <path
     fill="none"
     stroke="#000000"
     d="m 46.277274,118.59274 h 55.099996 v 20.3 H 46.277274 Z m 0,24.7 h 55.099996 v 20.3 H 46.277274 Z m 0,25.3 h 55.099996 v 20.3 H 46.277274 Z"
     id="path16135" />
</svg>
