01
	456789A123
		// rectangle
		aa            ddddd      gggggggg  jjj
		bbbbbbb       e          hhhhhh    kkk
		cccccccccccc  fffffffff  iiii      lll

		// triangle top left
		aa       ddddd  gggggggg
		bbbbbbb  e
		cccccccccccc

		// triangle bottom left
		aa
		bbbbbbb       e
		cccccccccccc  fffffffff  iiii

		// triangle top right
		aa  ddddd  gggggggg
		    e      hhhhhh
		           iiii

		// triangle bottom right
		                         gggggggg
		              e          hhhhhh
		cccccccccccc  fffffffff  iiii

		// diagonal down
		aa            ddddd
		bbbbbbb         hhhhhh
		cccccccccccc      lll

		// diagonal up
		aa                jjj
		bbbbbbb         hhhhhh
		cccccccccccc  fffffffff
	45
0123456789A12
