[
	{ input: "aaa\tb"	, expected: 0 },
	{ input: "\taaa\tb"	, expected: 1 },
	{ input: "  aaa\tb"	, expected: 1 },
	{ input: "\t  aaa\tb"	, expected: 2 },
	{ input: "  \taaa\tb"	, expected: 2 },
	{ input: "   aaa\tb"	, expected: 1 },
	{ input: "    aaa\tb"	, expected: 2 },
	{ input: "     aaa\tb"	, expected: 2 },
	{ input: "\t  \t  aaa\tb"	, expected: 4 },
	{ input: "  \t  \taaa\tb"	, expected: 4 },
	{ input: "\t   \t  aaa\tb"	, expected: 2 },
	{ input: "   \t  \t  aaa\tb"	, expected: 1 },
]
