{
  "type": "minecraft:crafting_shaped",
  "pattern": [
    "   ",
    " ss",
    "ii "
  ],
  "key": {
    "i": {
      "item": "minecraft:diamond_block"
    },
    "s": {
      "item": "minecraft:stick"
    }
  },
  "result": {
    "item": "hammerme:putty_knife_large"
  }
}