{
  "profiles": {
    "http": {
      "commandName": "Project",
      "launchBrowser": true,
      "launchUrl": "swagger",
      "environmentVariables": {
        "ASPNETCORE_ENVIRONMENT": "Development",
        "DB_CONNECTION_STRING": "Server=laboratory-1.clsks7wnccpq.us-east-1.rds.amazonaws.com;User ID=zemoga_api;Password=;Database=zemoga_blog_engine",
        "DB_PASSCODE": "as123lkd57j3kafn6aojgasldkjui"
      },
      "dotnetRunMessages": true,
      "applicationUrl": "http://localhost:80"
    },
    "https": {
      "commandName": "Project",
      "launchBrowser": true,
      "launchUrl": "swagger",
      "environmentVariables": {
        "ASPNETCORE_ENVIRONMENT": "Development",
        "DB_CONNECTION_STRING": "Server=localhost;User ID=zemoga_api;Password=;Database=zemoga_blog_engine",
        "DB_PASSCODE": "as123lkd57j3kafn6aojgasldkjui"
      },
      "dotnetRunMessages": true,
      "applicationUrl": "https://localhost:443;http://localhost:80"
    },
    "IIS Express": {
      "commandName": "IISExpress",
      "launchBrowser": true,
      "launchUrl": "swagger",
      "environmentVariables": {
        "ASPNETCORE_ENVIRONMENT": "Development",
        "DB_CONNECTION_STRING": "Server=localhost;User ID=zemoga_api;Password=;Database=zemoga_blog_engine",
        "DB_PASSCODE": "as123lkd57j3kafn6aojgasldkjui"
      }
    },
    "Docker": {
      "commandName": "Docker",
      "launchBrowser": true,
      "launchUrl": "{Scheme}://{ServiceHost}:{ServicePort}/swagger",
      "publishAllPorts": true,
      "useSSL": true
    }
  },
  "$schema": "https://json.schemastore.org/launchsettings.json",
  "iisSettings": {
    "windowsAuthentication": false,
    "anonymousAuthentication": true,
    "iisExpress": {
      "applicationUrl": "http://localhost:61500",
      "sslPort": 44358
    }
  }
}