[{
    "relation": ["delegate_permission/common.handle_all_urls"],
    "target" : { "namespace": "android_app", "package_name": "ev.giftcard.com",
                 "sha256_cert_fingerprints": ["46:04:AE:F3:43:BF:E1:EA:91:92:03:B3:68:E2:85:00:95:C2:B3:1F:3C:1A:FD:D9:2D:DD:FB:13:03:CC:71:7D"] }
}]