1.158707384615384626e+03 1.545437692307692259e+03
1.696988333333333230e+03 1.404579999999999927e+03
2.093922500000000127e+03 6.594180000000000064e+02
1.274251666666666551e+03 1.333430833333333339e+03
8.887238571428571277e+02 1.997975714285714275e+03
1.773970000000000027e+03 2.086500000000000000e+03
1.730319999999999936e+03 1.705990000000000009e+03
1.346776000000000067e+03 1.030937999999999874e+03
5.157735000000000127e+02 1.470375000000000000e+03
1.169670000000000073e+03 5.487179999999999609e+02
