# Reset all previously set options
reset

# Set terminal up
set term pngcairo font "FreeSans, 10" size 1024, 768
set grid
set output "endDevices_2.png"

set xrange[-1000:11000]
set yrange[-1000:11000]

# Use a good looking palette
set palette defined ( 0 '#D53E4F',\
    1 '#F46D43',\
    2 '#FDAE61',\
    3 '#FEE08B',\
    4 '#E6F598',\
    5 '#ABDDA4',\
    6 '#66C2A5',\
    7 '#3288BD' )

# Set up style for buildings
set style rect fc lt -1 fs solid 0.15 noborder

# Filename of the data
filename='endDevices.dat'
#filename2='gw.dat'

# Load the building locations
    #load 'buildings.txt'

# Plot the data
plot filename using 1:2:3 notitle with points pt 7 palette
