%YAML 1.1
%TAG !u! tag:unity3d.com,2011:
--- !u!74 &7400000
AnimationClip:
  m_ObjectHideFlags: 0
  m_CorrespondingSourceObject: {fileID: 0}
  m_PrefabInstance: {fileID: 0}
  m_PrefabAsset: {fileID: 0}
  m_Name: Protagonist_1Attack2
  serializedVersion: 6
  m_Legacy: 0
  m_Compressed: 0
  m_UseHighQualityCurve: 1
  m_RotationCurves: []
  m_CompressedRotationCurves: []
  m_EulerCurves: []
  m_PositionCurves: []
  m_ScaleCurves: []
  m_FloatCurves: []
  m_PPtrCurves:
  - curve:
    - time: 0
      value: {fileID: 21300000, guid: f9de3caa55df31b4d868cd4034cf1b4b, type: 3}
    - time: 0.083333336
      value: {fileID: 21300000, guid: 0220c8f2baae21c46956a801286a1b11, type: 3}
    - time: 0.13333334
      value: {fileID: 21300000, guid: 52011f1a13c145d4f9b13d963912dcf7, type: 3}
    - time: 0.2
      value: {fileID: 21300000, guid: e85d6cfba74f45840b788014641c8b33, type: 3}
    - time: 0.25
      value: {fileID: 21300000, guid: 029c2dd586ebae54fb14952bdcfe2a41, type: 3}
    - time: 0.33333334
      value: {fileID: 21300000, guid: 0da12685d813ec548b81b6b4df908aec, type: 3}
    attribute: m_Sprite
    path: Body
    classID: 212
    script: {fileID: 0}
  m_SampleRate: 60
  m_WrapMode: 0
  m_Bounds:
    m_Center: {x: 0, y: 0, z: 0}
    m_Extent: {x: 0, y: 0, z: 0}
  m_ClipBindingConstant:
    genericBindings:
    - serializedVersion: 2
      path: 2073732236
      attribute: 0
      script: {fileID: 0}
      typeID: 212
      customType: 23
      isPPtrCurve: 1
    pptrCurveMapping:
    - {fileID: 21300000, guid: f9de3caa55df31b4d868cd4034cf1b4b, type: 3}
    - {fileID: 21300000, guid: 0220c8f2baae21c46956a801286a1b11, type: 3}
    - {fileID: 21300000, guid: 52011f1a13c145d4f9b13d963912dcf7, type: 3}
    - {fileID: 21300000, guid: e85d6cfba74f45840b788014641c8b33, type: 3}
    - {fileID: 21300000, guid: 029c2dd586ebae54fb14952bdcfe2a41, type: 3}
    - {fileID: 21300000, guid: 0da12685d813ec548b81b6b4df908aec, type: 3}
  m_AnimationClipSettings:
    serializedVersion: 2
    m_AdditiveReferencePoseClip: {fileID: 0}
    m_AdditiveReferencePoseTime: 0
    m_StartTime: 0
    m_StopTime: 0.35000002
    m_OrientationOffsetY: 0
    m_Level: 0
    m_CycleOffset: 0
    m_HasAdditiveReferencePose: 0
    m_LoopTime: 0
    m_LoopBlend: 0
    m_LoopBlendOrientation: 0
    m_LoopBlendPositionY: 0
    m_LoopBlendPositionXZ: 0
    m_KeepOriginalOrientation: 0
    m_KeepOriginalPositionY: 1
    m_KeepOriginalPositionXZ: 0
    m_HeightFromFeet: 0
    m_Mirror: 0
  m_EditorCurves: []
  m_EulerEditorCurves: []
  m_HasGenericRootTransform: 0
  m_HasMotionFloatCurves: 0
  m_Events: []
