{
    "name": "Tareas",
    "alias": "tareas",
    "description": "",
    "keywords": [],
    "active": 1,
    "order": 0,
    "providers": [
        "Modules\\Tareas\\Providers\\TareasServiceProvider"
    ],
    "aliases": {},
    "files": [],
    "requires": []
}
