%YAML 1.1
%TAG !u! tag:unity3d.com,2011:
--- !u!114 &11400000
MonoBehaviour:
  m_ObjectHideFlags: 0
  m_CorrespondingSourceObject: {fileID: 0}
  m_PrefabInstance: {fileID: 0}
  m_PrefabAsset: {fileID: 0}
  m_GameObject: {fileID: 0}
  m_Enabled: 1
  m_EditorHideFlags: 0
  m_Script: {fileID: 11500000, guid: 5b0e19ba70bd8214ea06330491680fdc, type: 3}
  m_Name: Enemy1
  m_EditorClassIdentifier: 
  enemyType: 0
  enemySprite: {fileID: 21300000, guid: 5a67e3e275cff30459ad46d052a0cb1b, type: 3}
