%YAML 1.1
%TAG !u! tag:unity3d.com,2011:
--- !u!1 &4186431574841959260
GameObject:
  m_ObjectHideFlags: 0
  m_CorrespondingSourceObject: {fileID: 0}
  m_PrefabInstance: {fileID: 0}
  m_PrefabAsset: {fileID: 0}
  serializedVersion: 6
  m_Component:
  - component: {fileID: 2804808485583269931}
  - component: {fileID: 8453575610788416015}
  m_Layer: 31
  m_Name: Palette
  m_TagString: Untagged
  m_Icon: {fileID: 0}
  m_NavMeshLayer: 0
  m_StaticEditorFlags: 0
  m_IsActive: 1
--- !u!4 &2804808485583269931
Transform:
  m_ObjectHideFlags: 0
  m_CorrespondingSourceObject: {fileID: 0}
  m_PrefabInstance: {fileID: 0}
  m_PrefabAsset: {fileID: 0}
  m_GameObject: {fileID: 4186431574841959260}
  m_LocalRotation: {x: 0, y: 0, z: 0, w: 1}
  m_LocalPosition: {x: 0, y: 0, z: 0}
  m_LocalScale: {x: 1, y: 1, z: 1}
  m_Children:
  - {fileID: 1345727803436646246}
  m_Father: {fileID: 0}
  m_RootOrder: 0
  m_LocalEulerAnglesHint: {x: 0, y: 0, z: 0}
--- !u!156049354 &8453575610788416015
Grid:
  m_ObjectHideFlags: 0
  m_CorrespondingSourceObject: {fileID: 0}
  m_PrefabInstance: {fileID: 0}
  m_PrefabAsset: {fileID: 0}
  m_GameObject: {fileID: 4186431574841959260}
  m_Enabled: 1
  m_CellSize: {x: 0.5, y: 0.5, z: 0}
  m_CellGap: {x: 0, y: 0, z: 0}
  m_CellLayout: 0
  m_CellSwizzle: 0
--- !u!1 &7038993326704448340
GameObject:
  m_ObjectHideFlags: 0
  m_CorrespondingSourceObject: {fileID: 0}
  m_PrefabInstance: {fileID: 0}
  m_PrefabAsset: {fileID: 0}
  serializedVersion: 6
  m_Component:
  - component: {fileID: 1345727803436646246}
  - component: {fileID: 3872580927068095685}
  - component: {fileID: 3198432304664730073}
  m_Layer: 31
  m_Name: Layer1
  m_TagString: Untagged
  m_Icon: {fileID: 0}
  m_NavMeshLayer: 0
  m_StaticEditorFlags: 0
  m_IsActive: 1
--- !u!4 &1345727803436646246
Transform:
  m_ObjectHideFlags: 0
  m_CorrespondingSourceObject: {fileID: 0}
  m_PrefabInstance: {fileID: 0}
  m_PrefabAsset: {fileID: 0}
  m_GameObject: {fileID: 7038993326704448340}
  m_LocalRotation: {x: -0, y: -0, z: -0, w: 1}
  m_LocalPosition: {x: 0, y: 0, z: 0}
  m_LocalScale: {x: 1, y: 1, z: 1}
  m_Children: []
  m_Father: {fileID: 2804808485583269931}
  m_RootOrder: 0
  m_LocalEulerAnglesHint: {x: 0, y: 0, z: 0}
--- !u!1839735485 &3872580927068095685
Tilemap:
  m_ObjectHideFlags: 0
  m_CorrespondingSourceObject: {fileID: 0}
  m_PrefabInstance: {fileID: 0}
  m_PrefabAsset: {fileID: 0}
  m_GameObject: {fileID: 7038993326704448340}
  m_Enabled: 1
  m_Tiles:
  - first: {x: -11, y: -5, z: 0}
    second:
      serializedVersion: 2
      m_TileIndex: 47
      m_TileSpriteIndex: 49
      m_TileMatrixIndex: 0
      m_TileColorIndex: 0
      m_TileObjectToInstantiateIndex: 65535
      dummyAlignment: 0
      m_AllTileFlags: 1073741825
  - first: {x: -10, y: -5, z: 0}
    second:
      serializedVersion: 2
      m_TileIndex: 48
      m_TileSpriteIndex: 47
      m_TileMatrixIndex: 0
      m_TileColorIndex: 0
      m_TileObjectToInstantiateIndex: 65535
      dummyAlignment: 0
      m_AllTileFlags: 1073741825
  - first: {x: -9, y: -5, z: 0}
    second:
      serializedVersion: 2
      m_TileIndex: 49
      m_TileSpriteIndex: 48
      m_TileMatrixIndex: 0
      m_TileColorIndex: 0
      m_TileObjectToInstantiateIndex: 65535
      dummyAlignment: 0
      m_AllTileFlags: 1073741825
  - first: {x: -8, y: -5, z: 0}
    second:
      serializedVersion: 2
      m_TileIndex: 36
      m_TileSpriteIndex: 46
      m_TileMatrixIndex: 0
      m_TileColorIndex: 0
      m_TileObjectToInstantiateIndex: 65535
      dummyAlignment: 0
      m_AllTileFlags: 1073741825
  - first: {x: -11, y: -4, z: 0}
    second:
      serializedVersion: 2
      m_TileIndex: 44
      m_TileSpriteIndex: 43
      m_TileMatrixIndex: 0
      m_TileColorIndex: 0
      m_TileObjectToInstantiateIndex: 65535
      dummyAlignment: 0
      m_AllTileFlags: 1073741825
  - first: {x: -10, y: -4, z: 0}
    second:
      serializedVersion: 2
      m_TileIndex: 45
      m_TileSpriteIndex: 44
      m_TileMatrixIndex: 0
      m_TileColorIndex: 0
      m_TileObjectToInstantiateIndex: 65535
      dummyAlignment: 0
      m_AllTileFlags: 1073741825
  - first: {x: -9, y: -4, z: 0}
    second:
      serializedVersion: 2
      m_TileIndex: 46
      m_TileSpriteIndex: 45
      m_TileMatrixIndex: 0
      m_TileColorIndex: 0
      m_TileObjectToInstantiateIndex: 65535
      dummyAlignment: 0
      m_AllTileFlags: 1073741825
  - first: {x: -8, y: -4, z: 0}
    second:
      serializedVersion: 2
      m_TileIndex: 33
      m_TileSpriteIndex: 35
      m_TileMatrixIndex: 0
      m_TileColorIndex: 0
      m_TileObjectToInstantiateIndex: 65535
      dummyAlignment: 0
      m_AllTileFlags: 1073741825
  - first: {x: -7, y: -4, z: 0}
    second:
      serializedVersion: 2
      m_TileIndex: 34
      m_TileSpriteIndex: 33
      m_TileMatrixIndex: 0
      m_TileColorIndex: 0
      m_TileObjectToInstantiateIndex: 65535
      dummyAlignment: 0
      m_AllTileFlags: 1073741825
  - first: {x: -6, y: -4, z: 0}
    second:
      serializedVersion: 2
      m_TileIndex: 35
      m_TileSpriteIndex: 34
      m_TileMatrixIndex: 0
      m_TileColorIndex: 0
      m_TileObjectToInstantiateIndex: 65535
      dummyAlignment: 0
      m_AllTileFlags: 1073741825
  - first: {x: -11, y: -3, z: 0}
    second:
      serializedVersion: 2
      m_TileIndex: 41
      m_TileSpriteIndex: 40
      m_TileMatrixIndex: 0
      m_TileColorIndex: 0
      m_TileObjectToInstantiateIndex: 65535
      dummyAlignment: 0
      m_AllTileFlags: 1073741825
  - first: {x: -10, y: -3, z: 0}
    second:
      serializedVersion: 2
      m_TileIndex: 42
      m_TileSpriteIndex: 41
      m_TileMatrixIndex: 0
      m_TileColorIndex: 0
      m_TileObjectToInstantiateIndex: 65535
      dummyAlignment: 0
      m_AllTileFlags: 1073741825
  - first: {x: -9, y: -3, z: 0}
    second:
      serializedVersion: 2
      m_TileIndex: 43
      m_TileSpriteIndex: 42
      m_TileMatrixIndex: 0
      m_TileColorIndex: 0
      m_TileObjectToInstantiateIndex: 65535
      dummyAlignment: 0
      m_AllTileFlags: 1073741825
  - first: {x: -8, y: -3, z: 0}
    second:
      serializedVersion: 2
      m_TileIndex: 32
      m_TileSpriteIndex: 32
      m_TileMatrixIndex: 0
      m_TileColorIndex: 3
      m_TileObjectToInstantiateIndex: 65535
      dummyAlignment: 0
      m_AllTileFlags: 1073741825
  - first: {x: -7, y: -3, z: 0}
    second:
      serializedVersion: 2
      m_TileIndex: 31
      m_TileSpriteIndex: 31
      m_TileMatrixIndex: 0
      m_TileColorIndex: 3
      m_TileObjectToInstantiateIndex: 65535
      dummyAlignment: 0
      m_AllTileFlags: 1073741825
  - first: {x: -6, y: -3, z: 0}
    second:
      serializedVersion: 2
      m_TileIndex: 30
      m_TileSpriteIndex: 30
      m_TileMatrixIndex: 0
      m_TileColorIndex: 3
      m_TileObjectToInstantiateIndex: 65535
      dummyAlignment: 0
      m_AllTileFlags: 1073741825
  - first: {x: -4, y: -3, z: 0}
    second:
      serializedVersion: 2
      m_TileIndex: 20
      m_TileSpriteIndex: 29
      m_TileMatrixIndex: 0
      m_TileColorIndex: 0
      m_TileObjectToInstantiateIndex: 65535
      dummyAlignment: 0
      m_AllTileFlags: 1073741825
  - first: {x: 0, y: -3, z: 0}
    second:
      serializedVersion: 2
      m_TileIndex: 22
      m_TileSpriteIndex: 21
      m_TileMatrixIndex: 0
      m_TileColorIndex: 0
      m_TileObjectToInstantiateIndex: 65535
      dummyAlignment: 0
      m_AllTileFlags: 1073741825
  - first: {x: 2, y: -3, z: 0}
    second:
      serializedVersion: 2
      m_TileIndex: 21
      m_TileSpriteIndex: 19
      m_TileMatrixIndex: 0
      m_TileColorIndex: 0
      m_TileObjectToInstantiateIndex: 65535
      dummyAlignment: 0
      m_AllTileFlags: 1073741825
  - first: {x: 4, y: -3, z: 0}
    second:
      serializedVersion: 2
      m_TileIndex: 13
      m_TileSpriteIndex: 20
      m_TileMatrixIndex: 0
      m_TileColorIndex: 0
      m_TileObjectToInstantiateIndex: 65535
      dummyAlignment: 0
      m_AllTileFlags: 1073741825
  - first: {x: 6, y: -3, z: 0}
    second:
      serializedVersion: 2
      m_TileIndex: 23
      m_TileSpriteIndex: 22
      m_TileMatrixIndex: 0
      m_TileColorIndex: 0
      m_TileObjectToInstantiateIndex: 65535
      dummyAlignment: 0
      m_AllTileFlags: 1073741825
  - first: {x: 8, y: -3, z: 0}
    second:
      serializedVersion: 2
      m_TileIndex: 27
      m_TileSpriteIndex: 26
      m_TileMatrixIndex: 0
      m_TileColorIndex: 0
      m_TileObjectToInstantiateIndex: 65535
      dummyAlignment: 0
      m_AllTileFlags: 1073741825
  - first: {x: 10, y: -3, z: 0}
    second:
      serializedVersion: 2
      m_TileIndex: 28
      m_TileSpriteIndex: 27
      m_TileMatrixIndex: 0
      m_TileColorIndex: 0
      m_TileObjectToInstantiateIndex: 65535
      dummyAlignment: 0
      m_AllTileFlags: 1073741825
  - first: {x: -10, y: -2, z: 0}
    second:
      serializedVersion: 2
      m_TileIndex: 39
      m_TileSpriteIndex: 38
      m_TileMatrixIndex: 0
      m_TileColorIndex: 0
      m_TileObjectToInstantiateIndex: 65535
      dummyAlignment: 0
      m_AllTileFlags: 1073741825
  - first: {x: -9, y: -2, z: 0}
    second:
      serializedVersion: 2
      m_TileIndex: 40
      m_TileSpriteIndex: 39
      m_TileMatrixIndex: 0
      m_TileColorIndex: 0
      m_TileObjectToInstantiateIndex: 65535
      dummyAlignment: 0
      m_AllTileFlags: 1073741825
  - first: {x: -8, y: -2, z: 0}
    second:
      serializedVersion: 2
      m_TileIndex: 19
      m_TileSpriteIndex: 18
      m_TileMatrixIndex: 0
      m_TileColorIndex: 0
      m_TileObjectToInstantiateIndex: 65535
      dummyAlignment: 0
      m_AllTileFlags: 1073741825
  - first: {x: -7, y: -2, z: 0}
    second:
      serializedVersion: 2
      m_TileIndex: 18
      m_TileSpriteIndex: 17
      m_TileMatrixIndex: 0
      m_TileColorIndex: 0
      m_TileObjectToInstantiateIndex: 65535
      dummyAlignment: 0
      m_AllTileFlags: 1073741825
  - first: {x: -6, y: -2, z: 0}
    second:
      serializedVersion: 2
      m_TileIndex: 17
      m_TileSpriteIndex: 16
      m_TileMatrixIndex: 0
      m_TileColorIndex: 0
      m_TileObjectToInstantiateIndex: 65535
      dummyAlignment: 0
      m_AllTileFlags: 1073741825
  - first: {x: -5, y: -2, z: 0}
    second:
      serializedVersion: 2
      m_TileIndex: 9
      m_TileSpriteIndex: 12
      m_TileMatrixIndex: 0
      m_TileColorIndex: 0
      m_TileObjectToInstantiateIndex: 65535
      dummyAlignment: 0
      m_AllTileFlags: 1073741825
  - first: {x: -4, y: -2, z: 0}
    second:
      serializedVersion: 2
      m_TileIndex: 1
      m_TileSpriteIndex: 8
      m_TileMatrixIndex: 0
      m_TileColorIndex: 0
      m_TileObjectToInstantiateIndex: 65535
      dummyAlignment: 0
      m_AllTileFlags: 1073741825
  - first: {x: -3, y: -2, z: 0}
    second:
      serializedVersion: 2
      m_TileIndex: 3
      m_TileSpriteIndex: 4
      m_TileMatrixIndex: 0
      m_TileColorIndex: 0
      m_TileObjectToInstantiateIndex: 65535
      dummyAlignment: 0
      m_AllTileFlags: 1073741825
  - first: {x: -2, y: -2, z: 0}
    second:
      serializedVersion: 2
      m_TileIndex: 8
      m_TileSpriteIndex: 7
      m_TileMatrixIndex: 0
      m_TileColorIndex: 0
      m_TileObjectToInstantiateIndex: 65535
      dummyAlignment: 0
      m_AllTileFlags: 1073741825
  - first: {x: -10, y: -1, z: 0}
    second:
      serializedVersion: 2
      m_TileIndex: 37
      m_TileSpriteIndex: 36
      m_TileMatrixIndex: 0
      m_TileColorIndex: 0
      m_TileObjectToInstantiateIndex: 65535
      dummyAlignment: 0
      m_AllTileFlags: 1073741825
  - first: {x: -9, y: -1, z: 0}
    second:
      serializedVersion: 2
      m_TileIndex: 38
      m_TileSpriteIndex: 37
      m_TileMatrixIndex: 0
      m_TileColorIndex: 0
      m_TileObjectToInstantiateIndex: 65535
      dummyAlignment: 0
      m_AllTileFlags: 1073741825
  - first: {x: -8, y: -1, z: 0}
    second:
      serializedVersion: 2
      m_TileIndex: 16
      m_TileSpriteIndex: 15
      m_TileMatrixIndex: 0
      m_TileColorIndex: 0
      m_TileObjectToInstantiateIndex: 65535
      dummyAlignment: 0
      m_AllTileFlags: 1073741825
  - first: {x: -7, y: -1, z: 0}
    second:
      serializedVersion: 2
      m_TileIndex: 14
      m_TileSpriteIndex: 14
      m_TileMatrixIndex: 0
      m_TileColorIndex: 0
      m_TileObjectToInstantiateIndex: 65535
      dummyAlignment: 0
      m_AllTileFlags: 1073741825
  - first: {x: -6, y: -1, z: 0}
    second:
      serializedVersion: 2
      m_TileIndex: 15
      m_TileSpriteIndex: 13
      m_TileMatrixIndex: 0
      m_TileColorIndex: 0
      m_TileObjectToInstantiateIndex: 65535
      dummyAlignment: 0
      m_AllTileFlags: 1073741825
  - first: {x: -5, y: -1, z: 0}
    second:
      serializedVersion: 2
      m_TileIndex: 0
      m_TileSpriteIndex: 1
      m_TileMatrixIndex: 0
      m_TileColorIndex: 4
      m_TileObjectToInstantiateIndex: 65535
      dummyAlignment: 0
      m_AllTileFlags: 1073741825
  - first: {x: -4, y: -1, z: 0}
    second:
      serializedVersion: 2
      m_TileIndex: 2
      m_TileSpriteIndex: 1
      m_TileMatrixIndex: 0
      m_TileColorIndex: 0
      m_TileObjectToInstantiateIndex: 65535
      dummyAlignment: 0
      m_AllTileFlags: 1073741825
  - first: {x: -3, y: -1, z: 0}
    second:
      serializedVersion: 2
      m_TileIndex: 4
      m_TileSpriteIndex: 3
      m_TileMatrixIndex: 0
      m_TileColorIndex: 0
      m_TileObjectToInstantiateIndex: 65535
      dummyAlignment: 0
      m_AllTileFlags: 1073741825
  - first: {x: -2, y: -1, z: 0}
    second:
      serializedVersion: 2
      m_TileIndex: 7
      m_TileSpriteIndex: 2
      m_TileMatrixIndex: 0
      m_TileColorIndex: 0
      m_TileObjectToInstantiateIndex: 65535
      dummyAlignment: 0
      m_AllTileFlags: 1073741825
  - first: {x: 0, y: -1, z: 0}
    second:
      serializedVersion: 2
      m_TileIndex: 12
      m_TileSpriteIndex: 11
      m_TileMatrixIndex: 0
      m_TileColorIndex: 0
      m_TileObjectToInstantiateIndex: 65535
      dummyAlignment: 0
      m_AllTileFlags: 1073741825
  - first: {x: 2, y: -1, z: 0}
    second:
      serializedVersion: 2
      m_TileIndex: 6
      m_TileSpriteIndex: 6
      m_TileMatrixIndex: 0
      m_TileColorIndex: 0
      m_TileObjectToInstantiateIndex: 65535
      dummyAlignment: 0
      m_AllTileFlags: 1073741825
  - first: {x: 4, y: -1, z: 0}
    second:
      serializedVersion: 2
      m_TileIndex: 5
      m_TileSpriteIndex: 5
      m_TileMatrixIndex: 0
      m_TileColorIndex: 0
      m_TileObjectToInstantiateIndex: 65535
      dummyAlignment: 0
      m_AllTileFlags: 1073741825
  - first: {x: 6, y: -1, z: 0}
    second:
      serializedVersion: 2
      m_TileIndex: 26
      m_TileSpriteIndex: 25
      m_TileMatrixIndex: 0
      m_TileColorIndex: 0
      m_TileObjectToInstantiateIndex: 65535
      dummyAlignment: 0
      m_AllTileFlags: 1073741825
  - first: {x: 8, y: -1, z: 0}
    second:
      serializedVersion: 2
      m_TileIndex: 25
      m_TileSpriteIndex: 24
      m_TileMatrixIndex: 0
      m_TileColorIndex: 0
      m_TileObjectToInstantiateIndex: 65535
      dummyAlignment: 0
      m_AllTileFlags: 1073741825
  - first: {x: 10, y: -1, z: 0}
    second:
      serializedVersion: 2
      m_TileIndex: 24
      m_TileSpriteIndex: 23
      m_TileMatrixIndex: 0
      m_TileColorIndex: 0
      m_TileObjectToInstantiateIndex: 65535
      dummyAlignment: 0
      m_AllTileFlags: 1073741825
  - first: {x: 13, y: -1, z: 0}
    second:
      serializedVersion: 2
      m_TileIndex: 29
      m_TileSpriteIndex: 28
      m_TileMatrixIndex: 0
      m_TileColorIndex: 0
      m_TileObjectToInstantiateIndex: 65535
      dummyAlignment: 0
      m_AllTileFlags: 1073741825
  - first: {x: -5, y: 0, z: 0}
    second:
      serializedVersion: 2
      m_TileIndex: 10
      m_TileSpriteIndex: 9
      m_TileMatrixIndex: 0
      m_TileColorIndex: 0
      m_TileObjectToInstantiateIndex: 65535
      dummyAlignment: 0
      m_AllTileFlags: 1073741825
  - first: {x: -4, y: 0, z: 0}
    second:
      serializedVersion: 2
      m_TileIndex: 11
      m_TileSpriteIndex: 10
      m_TileMatrixIndex: 0
      m_TileColorIndex: 0
      m_TileObjectToInstantiateIndex: 65535
      dummyAlignment: 0
      m_AllTileFlags: 1073741825
  - first: {x: 2, y: 1, z: 0}
    second:
      serializedVersion: 2
      m_TileIndex: 51
      m_TileSpriteIndex: 50
      m_TileMatrixIndex: 0
      m_TileColorIndex: 0
      m_TileObjectToInstantiateIndex: 65535
      dummyAlignment: 0
      m_AllTileFlags: 1073741825
  - first: {x: 4, y: 1, z: 0}
    second:
      serializedVersion: 2
      m_TileIndex: 52
      m_TileSpriteIndex: 51
      m_TileMatrixIndex: 0
      m_TileColorIndex: 0
      m_TileObjectToInstantiateIndex: 65535
      dummyAlignment: 0
      m_AllTileFlags: 1073741825
  m_AnimatedTiles: {}
  m_TileAssetArray:
  - m_RefCount: 1
    m_Data: {fileID: 11400000, guid: c14aeefda5b852e49a0c8064b7fe6c5a, type: 2}
  - m_RefCount: 1
    m_Data: {fileID: 11400000, guid: da1b34cc91ebbb24995cd77417e588da, type: 2}
  - m_RefCount: 1
    m_Data: {fileID: 11400000, guid: 9dc1da76bc948e34ead0c07bd77f9c0a, type: 2}
  - m_RefCount: 1
    m_Data: {fileID: 11400000, guid: 83f678f02f79fb543b0b95fe3a40f214, type: 2}
  - m_RefCount: 1
    m_Data: {fileID: 11400000, guid: 972c9be6b075c7a4eac3fcf69cbddd78, type: 2}
  - m_RefCount: 1
    m_Data: {fileID: 11400000, guid: 1b7395c77192c8f4f8e126bf06d7dbca, type: 2}
  - m_RefCount: 1
    m_Data: {fileID: 11400000, guid: 21efd36ff7e89d0498e703529a5d195b, type: 2}
  - m_RefCount: 1
    m_Data: {fileID: 11400000, guid: 3d2fb073380dfb941a1a7683a677643d, type: 2}
  - m_RefCount: 1
    m_Data: {fileID: 11400000, guid: ec5167ee7f947fd4c9a37d4688c2451e, type: 2}
  - m_RefCount: 1
    m_Data: {fileID: 11400000, guid: e465481fd624e434382f7e049071bb7d, type: 2}
  - m_RefCount: 1
    m_Data: {fileID: 11400000, guid: 3d32aa5f6d8c9c841951adf2020c9217, type: 2}
  - m_RefCount: 1
    m_Data: {fileID: 11400000, guid: cdb38f3b9b4b99c43a114d24c33b0c70, type: 2}
  - m_RefCount: 1
    m_Data: {fileID: 11400000, guid: 7159ec1d32a859a4e9dc433372135a89, type: 2}
  - m_RefCount: 1
    m_Data: {fileID: 11400000, guid: f4bba8deeef85ec43aa1e7f439a09e36, type: 2}
  - m_RefCount: 1
    m_Data: {fileID: 11400000, guid: c43195f18429a92429f36713973faedf, type: 2}
  - m_RefCount: 1
    m_Data: {fileID: 11400000, guid: ca6e6345290691d4d9eed17875fe3356, type: 2}
  - m_RefCount: 1
    m_Data: {fileID: 11400000, guid: ef7b0c8d38dddd54b9dc09665c1f3ddb, type: 2}
  - m_RefCount: 1
    m_Data: {fileID: 11400000, guid: a4f8e9570ad2ddb4a97f36fcb3025dc4, type: 2}
  - m_RefCount: 1
    m_Data: {fileID: 11400000, guid: 5041e3395fc5a204aaee00847038bf6b, type: 2}
  - m_RefCount: 1
    m_Data: {fileID: 11400000, guid: 7bdc6e4846ca7774ab679292e7919ab1, type: 2}
  - m_RefCount: 1
    m_Data: {fileID: 11400000, guid: 2a1c80b6675031f449bcdce63ded9fcc, type: 2}
  - m_RefCount: 1
    m_Data: {fileID: 11400000, guid: 86a1bb850e4bfeb46b1702329cb5c8b5, type: 2}
  - m_RefCount: 1
    m_Data: {fileID: 11400000, guid: 53cd99d292a6cff4a8a0506aedb71e37, type: 2}
  - m_RefCount: 1
    m_Data: {fileID: 11400000, guid: 79c56c1cb54940f4381e51808eadf55f, type: 2}
  - m_RefCount: 1
    m_Data: {fileID: 11400000, guid: 266653c36aa71b84eaea61de946e9291, type: 2}
  - m_RefCount: 1
    m_Data: {fileID: 11400000, guid: 093173f7294b88d43a432f7febf7de43, type: 2}
  - m_RefCount: 1
    m_Data: {fileID: 11400000, guid: 0b80ee2de25a1b44da07bbb5e707cda7, type: 2}
  - m_RefCount: 1
    m_Data: {fileID: 11400000, guid: dd57cab99b27b854d98e1f5452b509ef, type: 2}
  - m_RefCount: 1
    m_Data: {fileID: 11400000, guid: 108cf0704de9d0b4c9e6c71e328811ee, type: 2}
  - m_RefCount: 1
    m_Data: {fileID: 11400000, guid: 87ed9006bfcb80144816dfecf4e4b447, type: 2}
  - m_RefCount: 1
    m_Data: {fileID: 11400000, guid: 3a485a88473cab546ac22f80ab0cf7c7, type: 2}
  - m_RefCount: 1
    m_Data: {fileID: 11400000, guid: e88dcb4ae8ee46349b17a54b6ff747e9, type: 2}
  - m_RefCount: 1
    m_Data: {fileID: 11400000, guid: 5c348c75fb1aab34385ea9d2cdab79c1, type: 2}
  - m_RefCount: 1
    m_Data: {fileID: 11400000, guid: fabf3814ea4ba504a9b4b48e7085e450, type: 2}
  - m_RefCount: 1
    m_Data: {fileID: 11400000, guid: 215fc04815047eb4f874d52aedf0706c, type: 2}
  - m_RefCount: 1
    m_Data: {fileID: 11400000, guid: b85cb95c52b22f149ba7b1a469e2d633, type: 2}
  - m_RefCount: 1
    m_Data: {fileID: 11400000, guid: 0079ac9b3ff33a545b948a8d765cb435, type: 2}
  - m_RefCount: 1
    m_Data: {fileID: 11400000, guid: 2d333414b48c50444bbfccc770b157f0, type: 2}
  - m_RefCount: 1
    m_Data: {fileID: 11400000, guid: be6905c6ecc2adb41a2d386ba6444975, type: 2}
  - m_RefCount: 1
    m_Data: {fileID: 11400000, guid: 9b623e201d70cde4aba6954fe47fd668, type: 2}
  - m_RefCount: 1
    m_Data: {fileID: 11400000, guid: f04e1039646241648b888e9a8d83e740, type: 2}
  - m_RefCount: 1
    m_Data: {fileID: 11400000, guid: 462b61d9e43f7204ea99fe5b1a623a09, type: 2}
  - m_RefCount: 1
    m_Data: {fileID: 11400000, guid: 99ea6ccdcde658542a8289be1bdb9e8a, type: 2}
  - m_RefCount: 1
    m_Data: {fileID: 11400000, guid: b806257cd09c20f449550b45848d4ac2, type: 2}
  - m_RefCount: 1
    m_Data: {fileID: 11400000, guid: 34230f6b84a8e02438d430955de9ee39, type: 2}
  - m_RefCount: 1
    m_Data: {fileID: 11400000, guid: c1b97dfb003c4134eb9e7516f7485862, type: 2}
  - m_RefCount: 1
    m_Data: {fileID: 11400000, guid: 1b79633e8b52fc142a649a36fc9b347f, type: 2}
  - m_RefCount: 1
    m_Data: {fileID: 11400000, guid: 6bca4a367b4927f45a952cad347716d5, type: 2}
  - m_RefCount: 1
    m_Data: {fileID: 11400000, guid: 63c5f12dc83a69e4a95169d553a4befd, type: 2}
  - m_RefCount: 1
    m_Data: {fileID: 11400000, guid: a69ee56de292a1840b8f7a57c2a595e9, type: 2}
  - m_RefCount: 0
    m_Data: {fileID: 0}
  - m_RefCount: 1
    m_Data: {fileID: 11400000, guid: 00b1510a85cbc844bb26fe9f8b07f83a, type: 2}
  - m_RefCount: 1
    m_Data: {fileID: 11400000, guid: 07044c06a77ca3c44b5a86046c6b1127, type: 2}
  m_TileSpriteArray:
  - m_RefCount: 0
    m_Data: {fileID: 0}
  - m_RefCount: 2
    m_Data: {fileID: 21300000, guid: f9810ca09d27e274899e5847ec3809ae, type: 3}
  - m_RefCount: 1
    m_Data: {fileID: 21300000, guid: 729d52a702701d44892722a1ef060fff, type: 3}
  - m_RefCount: 1
    m_Data: {fileID: 21300000, guid: 69184ab354a93614fbbcb46c2e49233e, type: 3}
  - m_RefCount: 1
    m_Data: {fileID: 21300000, guid: ec03f5208ae932e4eac9c586e7088b74, type: 3}
  - m_RefCount: 1
    m_Data: {fileID: 21300000, guid: fca89efbecc91074099e9b57fc5a718a, type: 3}
  - m_RefCount: 1
    m_Data: {fileID: 21300000, guid: 16606e1c931631d4dacd13a4205a4248, type: 3}
  - m_RefCount: 1
    m_Data: {fileID: 21300000, guid: cc5b543d39ddfc24980f743f293b0194, type: 3}
  - m_RefCount: 1
    m_Data: {fileID: 21300000, guid: d21b09178633f6d4ba0a62d9c3ae2be4, type: 3}
  - m_RefCount: 1
    m_Data: {fileID: 21300000, guid: 7d1150b05a73f1942a2290bafe308737, type: 3}
  - m_RefCount: 1
    m_Data: {fileID: 21300000, guid: 1a45520ae114b8b49b755de69536aeb9, type: 3}
  - m_RefCount: 1
    m_Data: {fileID: 21300000, guid: 01376c172f98aa447aa04f8ee2b86e70, type: 3}
  - m_RefCount: 1
    m_Data: {fileID: 21300000, guid: a19a08fbfd8485945b30173a7f05800e, type: 3}
  - m_RefCount: 1
    m_Data: {fileID: 21300000, guid: dfa912f841536734d965208628e03ba4, type: 3}
  - m_RefCount: 1
    m_Data: {fileID: 21300000, guid: ef54d4376f45cc34b86c07fac4ecea4f, type: 3}
  - m_RefCount: 1
    m_Data: {fileID: 21300000, guid: b905519681e06f54e9c320bf1f11f286, type: 3}
  - m_RefCount: 1
    m_Data: {fileID: 21300000, guid: 07fa5e4701307374899cf8fa0f9fc540, type: 3}
  - m_RefCount: 1
    m_Data: {fileID: 21300000, guid: 070e39d3f2261674fa1b218430d69dc8, type: 3}
  - m_RefCount: 1
    m_Data: {fileID: 21300000, guid: 86483549c0bc0b640974d318103990c5, type: 3}
  - m_RefCount: 1
    m_Data: {fileID: 21300000, guid: 2faef40ff7178e7499816a2d39af2582, type: 3}
  - m_RefCount: 1
    m_Data: {fileID: 21300000, guid: 298eaed7af8e2ba46ac0e86af0f70e6f, type: 3}
  - m_RefCount: 1
    m_Data: {fileID: 21300000, guid: 678e7dbd4179904409a6f4fcdfb2dd77, type: 3}
  - m_RefCount: 1
    m_Data: {fileID: 5272199622395594349, guid: 87a7cd212bca61448be85b127723c653,
      type: 3}
  - m_RefCount: 1
    m_Data: {fileID: -636825871004129389, guid: 87a7cd212bca61448be85b127723c653,
      type: 3}
  - m_RefCount: 1
    m_Data: {fileID: -7728125645611253085, guid: 87a7cd212bca61448be85b127723c653,
      type: 3}
  - m_RefCount: 1
    m_Data: {fileID: -4249258978787009171, guid: 87a7cd212bca61448be85b127723c653,
      type: 3}
  - m_RefCount: 1
    m_Data: {fileID: -9050950993373126452, guid: 87a7cd212bca61448be85b127723c653,
      type: 3}
  - m_RefCount: 1
    m_Data: {fileID: -7043640594327974022, guid: 87a7cd212bca61448be85b127723c653,
      type: 3}
  - m_RefCount: 1
    m_Data: {fileID: 21300000, guid: 05e205b023719c34b8ef83a40d018ddf, type: 3}
  - m_RefCount: 1
    m_Data: {fileID: 21300000, guid: d019127d9b512d64587ec0e06a0a3106, type: 3}
  - m_RefCount: 1
    m_Data: {fileID: 21300000, guid: d1a8ac07dee80ce4b8df7699ff115dd0, type: 3}
  - m_RefCount: 1
    m_Data: {fileID: 21300000, guid: f24821b8629123448a0374dee9896572, type: 3}
  - m_RefCount: 1
    m_Data: {fileID: 21300000, guid: e811fb706c283ca4d89ebb68b368e1f4, type: 3}
  - m_RefCount: 1
    m_Data: {fileID: 21300000, guid: 9026c0f5cf71c6047a0748f56489da77, type: 3}
  - m_RefCount: 1
    m_Data: {fileID: 21300000, guid: 1e029a39a177bbd44bc28c3f80f5a4c6, type: 3}
  - m_RefCount: 1
    m_Data: {fileID: 21300000, guid: 836efd0b110f0cf4b8fbdcecb1599d6b, type: 3}
  - m_RefCount: 1
    m_Data: {fileID: 21300000, guid: ce2a0b96ea0857a42915f2193b256d42, type: 3}
  - m_RefCount: 1
    m_Data: {fileID: 21300000, guid: 494031f79fe1a2748bb1a4e303b36adb, type: 3}
  - m_RefCount: 1
    m_Data: {fileID: 21300000, guid: 2ef095841cc6dbe48a33b642e3308505, type: 3}
  - m_RefCount: 1
    m_Data: {fileID: 21300000, guid: 9ed3f5a726f6c2241befc29f8c7777af, type: 3}
  - m_RefCount: 1
    m_Data: {fileID: 21300000, guid: 0468d95436f5c874eb7e16c77b6855d9, type: 3}
  - m_RefCount: 1
    m_Data: {fileID: 21300000, guid: 7fb4b84d6dee428448183d0100e01c9e, type: 3}
  - m_RefCount: 1
    m_Data: {fileID: 21300000, guid: 4384c0e494980b141af7e7bd7e821928, type: 3}
  - m_RefCount: 1
    m_Data: {fileID: 21300000, guid: 514ec52a42aeb6a4c98c4477f6677bae, type: 3}
  - m_RefCount: 1
    m_Data: {fileID: 21300000, guid: e1cf38b830f027f44a0fc429358a8718, type: 3}
  - m_RefCount: 1
    m_Data: {fileID: 21300000, guid: d887fb155a6cbbf44838a6308e9b8457, type: 3}
  - m_RefCount: 1
    m_Data: {fileID: 21300000, guid: 9497e993bb74f6544addf25589d16923, type: 3}
  - m_RefCount: 1
    m_Data: {fileID: 21300000, guid: bbc3f52350aa3d54c87310c9af6347eb, type: 3}
  - m_RefCount: 1
    m_Data: {fileID: 21300000, guid: ce441e3b69caf4d4a97601bddff2f6af, type: 3}
  - m_RefCount: 1
    m_Data: {fileID: 21300000, guid: 6d756b2e3fad1a14385c802fd95de762, type: 3}
  - m_RefCount: 1
    m_Data: {fileID: 21300000, guid: 851c2d3ecae2da44a88e918906521ebb, type: 3}
  - m_RefCount: 1
    m_Data: {fileID: 21300000, guid: da753daff77680e488fd114bfd57e49a, type: 3}
  m_TileMatrixArray:
  - m_RefCount: 52
    m_Data:
      e00: 1
      e01: 0
      e02: 0
      e03: 0
      e10: 0
      e11: 1
      e12: 0
      e13: 0
      e20: 0
      e21: 0
      e22: 1
      e23: 0
      e30: 0
      e31: 0
      e32: 0
      e33: 1
  m_TileColorArray:
  - m_RefCount: 48
    m_Data: {r: 1, g: 1, b: 1, a: 1}
  - m_RefCount: 0
    m_Data: {r: 0, g: 0, b: 0, a: 0}
  - m_RefCount: 0
    m_Data: {r: 6.4768904e-17, g: 6.4768904e-17, b: 6.4768904e-17, a: 6.4768904e-17}
  - m_RefCount: 3
    m_Data: {r: 0.5176471, g: 0.5176471, b: 0.5176471, a: 1}
  - m_RefCount: 1
    m_Data: {r: 0.5188679, g: 0.5188679, b: 0.5188679, a: 1}
  m_TileObjectToInstantiateArray: []
  m_AnimationFrameRate: 1
  m_Color: {r: 1, g: 1, b: 1, a: 1}
  m_Origin: {x: -11, y: -5, z: 0}
  m_Size: {x: 25, y: 8, z: 1}
  m_TileAnchor: {x: 0.5, y: 0.5, z: 0}
  m_TileOrientation: 0
  m_TileOrientationMatrix:
    e00: 1
    e01: 0
    e02: 0
    e03: 0
    e10: 0
    e11: 1
    e12: 0
    e13: 0
    e20: 0
    e21: 0
    e22: 1
    e23: 0
    e30: 0
    e31: 0
    e32: 0
    e33: 1
--- !u!483693784 &3198432304664730073
TilemapRenderer:
  m_ObjectHideFlags: 0
  m_CorrespondingSourceObject: {fileID: 0}
  m_PrefabInstance: {fileID: 0}
  m_PrefabAsset: {fileID: 0}
  m_GameObject: {fileID: 7038993326704448340}
  m_Enabled: 0
  m_CastShadows: 0
  m_ReceiveShadows: 0
  m_DynamicOccludee: 0
  m_MotionVectors: 1
  m_LightProbeUsage: 0
  m_ReflectionProbeUsage: 0
  m_RayTracingMode: 0
  m_RenderingLayerMask: 1
  m_RendererPriority: 0
  m_Materials:
  - {fileID: 10754, guid: 0000000000000000f000000000000000, type: 0}
  m_StaticBatchInfo:
    firstSubMesh: 0
    subMeshCount: 0
  m_StaticBatchRoot: {fileID: 0}
  m_ProbeAnchor: {fileID: 0}
  m_LightProbeVolumeOverride: {fileID: 0}
  m_ScaleInLightmap: 1
  m_ReceiveGI: 1
  m_PreserveUVs: 0
  m_IgnoreNormalsForChartDetection: 0
  m_ImportantGI: 0
  m_StitchLightmapSeams: 1
  m_SelectedEditorRenderState: 0
  m_MinimumChartSize: 4
  m_AutoUVMaxDistance: 0.5
  m_AutoUVMaxAngle: 89
  m_LightmapParameters: {fileID: 0}
  m_SortingLayerID: 0
  m_SortingLayer: 0
  m_SortingOrder: 0
  m_ChunkSize: {x: 32, y: 32, z: 32}
  m_ChunkCullingBounds: {x: 0, y: 0, z: 0}
  m_MaxChunkCount: 16
  m_MaxFrameAge: 16
  m_SortOrder: 0
  m_Mode: 0
  m_DetectChunkCullingBounds: 0
  m_MaskInteraction: 0
--- !u!114 &-4970762269962109253
MonoBehaviour:
  m_ObjectHideFlags: 0
  m_CorrespondingSourceObject: {fileID: 0}
  m_PrefabInstance: {fileID: 0}
  m_PrefabAsset: {fileID: 0}
  m_GameObject: {fileID: 0}
  m_Enabled: 1
  m_EditorHideFlags: 0
  m_Script: {fileID: 12395, guid: 0000000000000000e000000000000000, type: 0}
  m_Name: Palette Settings
  m_EditorClassIdentifier: 
  cellSizing: 0
