%YAML 1.1
%TAG !u! tag:unity3d.com,2011:
--- !u!114 &11400000
MonoBehaviour:
  m_ObjectHideFlags: 0
  m_CorrespondingSourceObject: {fileID: 0}
  m_PrefabInstance: {fileID: 0}
  m_PrefabAsset: {fileID: 0}
  m_GameObject: {fileID: 0}
  m_Enabled: 1
  m_EditorHideFlags: 0
  m_Script: {fileID: 11500000, guid: dedc879172008504a9ed9fe5495a359c, type: 3}
  m_Name: MachineGun
  m_EditorClassIdentifier: 
  itemName: MachineGun
  item: 4
  price: 50
  caimable: 0
  claimed: 0
