%YAML 1.1
%TAG !u! tag:unity3d.com,2011:
--- !u!1 &3407203733767746932
GameObject:
  m_ObjectHideFlags: 0
  m_CorrespondingSourceObject: {fileID: 0}
  m_PrefabInstance: {fileID: 0}
  m_PrefabAsset: {fileID: 0}
  serializedVersion: 6
  m_Component:
  - component: {fileID: 3407203733767746930}
  - component: {fileID: 3407203733767746933}
  m_Layer: 0
  m_Name: PowerUpSpawn
  m_TagString: Untagged
  m_Icon: {fileID: 0}
  m_NavMeshLayer: 0
  m_StaticEditorFlags: 0
  m_IsActive: 1
--- !u!4 &3407203733767746930
Transform:
  m_ObjectHideFlags: 0
  m_CorrespondingSourceObject: {fileID: 0}
  m_PrefabInstance: {fileID: 0}
  m_PrefabAsset: {fileID: 0}
  m_GameObject: {fileID: 3407203733767746932}
  m_LocalRotation: {x: 0, y: 0, z: 0, w: 1}
  m_LocalPosition: {x: 0.21606213, y: -0.44506398, z: -1.8706772}
  m_LocalScale: {x: 1, y: 1, z: 1}
  m_Children: []
  m_Father: {fileID: 0}
  m_RootOrder: 0
  m_LocalEulerAnglesHint: {x: 0, y: 0, z: 0}
--- !u!114 &3407203733767746933
MonoBehaviour:
  m_ObjectHideFlags: 0
  m_CorrespondingSourceObject: {fileID: 0}
  m_PrefabInstance: {fileID: 0}
  m_PrefabAsset: {fileID: 0}
  m_GameObject: {fileID: 3407203733767746932}
  m_Enabled: 1
  m_EditorHideFlags: 0
  m_Script: {fileID: 11500000, guid: a0f343d5ab1484c4bb7de570ebcb98d5, type: 3}
  m_Name: 
  m_EditorClassIdentifier: 
  spawnProb: 15
  powerUps:
  - {fileID: 5742412672885721672, guid: 8d7b3214d4f88cd4183a29dff48ccf3c, type: 3}
  - {fileID: 8265114467768073734, guid: 5e1ec17c1b9008043a3c643221512e74, type: 3}
  - {fileID: 6869792513780447702, guid: 9baefa895dd72144fa7b7229a470b57c, type: 3}
