%YAML 1.1
%TAG !u! tag:unity3d.com,2011:
--- !u!74 &7400000
AnimationClip:
  m_ObjectHideFlags: 0
  m_CorrespondingSourceObject: {fileID: 0}
  m_PrefabInstance: {fileID: 0}
  m_PrefabAsset: {fileID: 0}
  m_Name: BombRed
  serializedVersion: 6
  m_Legacy: 0
  m_Compressed: 0
  m_UseHighQualityCurve: 1
  m_RotationCurves: []
  m_CompressedRotationCurves: []
  m_EulerCurves: []
  m_PositionCurves: []
  m_ScaleCurves: []
  m_FloatCurves: []
  m_PPtrCurves:
  - curve:
    - time: 0
      value: {fileID: -1901201540868286669, guid: 69457d7deed3aee4f9b26dadb5071188,
        type: 3}
    - time: 0.083333336
      value: {fileID: -4867575868444148317, guid: 69457d7deed3aee4f9b26dadb5071188,
        type: 3}
    - time: 0.15
      value: {fileID: -2739726608875311680, guid: 69457d7deed3aee4f9b26dadb5071188,
        type: 3}
    - time: 0.23333333
      value: {fileID: 3631501279124158950, guid: 69457d7deed3aee4f9b26dadb5071188,
        type: 3}
    - time: 0.3
      value: {fileID: 7489309296337468156, guid: 69457d7deed3aee4f9b26dadb5071188,
        type: 3}
    - time: 0.38333333
      value: {fileID: 4865064892897031939, guid: 69457d7deed3aee4f9b26dadb5071188,
        type: 3}
    - time: 0.45
      value: {fileID: -7371197775302988443, guid: 69457d7deed3aee4f9b26dadb5071188,
        type: 3}
    - time: 0.53333336
      value: {fileID: -3849780885044179190, guid: 69457d7deed3aee4f9b26dadb5071188,
        type: 3}
    attribute: m_Sprite
    path: 
    classID: 212
    script: {fileID: 0}
  m_SampleRate: 60
  m_WrapMode: 0
  m_Bounds:
    m_Center: {x: 0, y: 0, z: 0}
    m_Extent: {x: 0, y: 0, z: 0}
  m_ClipBindingConstant:
    genericBindings:
    - serializedVersion: 2
      path: 0
      attribute: 0
      script: {fileID: 0}
      typeID: 212
      customType: 23
      isPPtrCurve: 1
    pptrCurveMapping:
    - {fileID: -1901201540868286669, guid: 69457d7deed3aee4f9b26dadb5071188, type: 3}
    - {fileID: -4867575868444148317, guid: 69457d7deed3aee4f9b26dadb5071188, type: 3}
    - {fileID: -2739726608875311680, guid: 69457d7deed3aee4f9b26dadb5071188, type: 3}
    - {fileID: 3631501279124158950, guid: 69457d7deed3aee4f9b26dadb5071188, type: 3}
    - {fileID: 7489309296337468156, guid: 69457d7deed3aee4f9b26dadb5071188, type: 3}
    - {fileID: 4865064892897031939, guid: 69457d7deed3aee4f9b26dadb5071188, type: 3}
    - {fileID: -7371197775302988443, guid: 69457d7deed3aee4f9b26dadb5071188, type: 3}
    - {fileID: -3849780885044179190, guid: 69457d7deed3aee4f9b26dadb5071188, type: 3}
  m_AnimationClipSettings:
    serializedVersion: 2
    m_AdditiveReferencePoseClip: {fileID: 0}
    m_AdditiveReferencePoseTime: 0
    m_StartTime: 0
    m_StopTime: 0.55
    m_OrientationOffsetY: 0
    m_Level: 0
    m_CycleOffset: 0
    m_HasAdditiveReferencePose: 0
    m_LoopTime: 1
    m_LoopBlend: 0
    m_LoopBlendOrientation: 0
    m_LoopBlendPositionY: 0
    m_LoopBlendPositionXZ: 0
    m_KeepOriginalOrientation: 0
    m_KeepOriginalPositionY: 1
    m_KeepOriginalPositionXZ: 0
    m_HeightFromFeet: 0
    m_Mirror: 0
  m_EditorCurves: []
  m_EulerEditorCurves: []
  m_HasGenericRootTransform: 0
  m_HasMotionFloatCurves: 0
  m_Events: []
