%YAML 1.1
%TAG !u! tag:unity3d.com,2011:
--- !u!1 &69229799252085346
GameObject:
  m_ObjectHideFlags: 0
  m_CorrespondingSourceObject: {fileID: 0}
  m_PrefabInstance: {fileID: 0}
  m_PrefabAsset: {fileID: 0}
  serializedVersion: 6
  m_Component:
  - component: {fileID: 5276495553395576943}
  - component: {fileID: 4641519390328497918}
  m_Layer: 0
  m_Name: Grid1
  m_TagString: Untagged
  m_Icon: {fileID: 0}
  m_NavMeshLayer: 0
  m_StaticEditorFlags: 0
  m_IsActive: 1
--- !u!4 &5276495553395576943
Transform:
  m_ObjectHideFlags: 0
  m_CorrespondingSourceObject: {fileID: 0}
  m_PrefabInstance: {fileID: 0}
  m_PrefabAsset: {fileID: 0}
  m_GameObject: {fileID: 69229799252085346}
  m_LocalRotation: {x: -0, y: -0, z: -0, w: 1}
  m_LocalPosition: {x: 0, y: 0, z: 7.6381254}
  m_LocalScale: {x: 1, y: 1, z: 1}
  m_Children:
  - {fileID: 6504490466777691134}
  m_Father: {fileID: 1890781679189965907}
  m_RootOrder: 0
  m_LocalEulerAnglesHint: {x: 0, y: 0, z: 0}
--- !u!156049354 &4641519390328497918
Grid:
  m_ObjectHideFlags: 0
  m_CorrespondingSourceObject: {fileID: 0}
  m_PrefabInstance: {fileID: 0}
  m_PrefabAsset: {fileID: 0}
  m_GameObject: {fileID: 69229799252085346}
  m_Enabled: 1
  m_CellSize: {x: 1, y: 1, z: 0}
  m_CellGap: {x: 0, y: 0, z: 0}
  m_CellLayout: 0
  m_CellSwizzle: 0
--- !u!1 &328371559355272570
GameObject:
  m_ObjectHideFlags: 0
  m_CorrespondingSourceObject: {fileID: 0}
  m_PrefabInstance: {fileID: 0}
  m_PrefabAsset: {fileID: 0}
  serializedVersion: 6
  m_Component:
  - component: {fileID: 6142548518981855983}
  - component: {fileID: 2998441850965516078}
  - component: {fileID: 4526759372948243981}
  m_Layer: 0
  m_Name: Tilemap
  m_TagString: Untagged
  m_Icon: {fileID: 0}
  m_NavMeshLayer: 0
  m_StaticEditorFlags: 0
  m_IsActive: 1
--- !u!4 &6142548518981855983
Transform:
  m_ObjectHideFlags: 0
  m_CorrespondingSourceObject: {fileID: 0}
  m_PrefabInstance: {fileID: 0}
  m_PrefabAsset: {fileID: 0}
  m_GameObject: {fileID: 328371559355272570}
  m_LocalRotation: {x: -0, y: -0, z: -0, w: 1}
  m_LocalPosition: {x: 0, y: 0, z: 0}
  m_LocalScale: {x: 1, y: 1, z: 1}
  m_Children: []
  m_Father: {fileID: 3996315776129497266}
  m_RootOrder: 0
  m_LocalEulerAnglesHint: {x: 0, y: 0, z: 0}
--- !u!1839735485 &2998441850965516078
Tilemap:
  m_ObjectHideFlags: 0
  m_CorrespondingSourceObject: {fileID: 0}
  m_PrefabInstance: {fileID: 0}
  m_PrefabAsset: {fileID: 0}
  m_GameObject: {fileID: 328371559355272570}
  m_Enabled: 1
  m_Tiles:
  - first: {x: -9, y: -3, z: 0}
    second:
      serializedVersion: 2
      m_TileIndex: 0
      m_TileSpriteIndex: 1
      m_TileMatrixIndex: 0
      m_TileColorIndex: 0
      m_TileObjectToInstantiateIndex: 65535
      dummyAlignment: 0
      m_AllTileFlags: 1073741825
  - first: {x: -8, y: -3, z: 0}
    second:
      serializedVersion: 2
      m_TileIndex: 2
      m_TileSpriteIndex: 2
      m_TileMatrixIndex: 0
      m_TileColorIndex: 0
      m_TileObjectToInstantiateIndex: 65535
      dummyAlignment: 0
      m_AllTileFlags: 1073741825
  m_AnimatedTiles: {}
  m_TileAssetArray:
  - m_RefCount: 1
    m_Data: {fileID: 11400000, guid: 0079ac9b3ff33a545b948a8d765cb435, type: 2}
  - m_RefCount: 0
    m_Data: {fileID: 0}
  - m_RefCount: 1
    m_Data: {fileID: 11400000, guid: b85cb95c52b22f149ba7b1a469e2d633, type: 2}
  m_TileSpriteArray:
  - m_RefCount: 0
    m_Data: {fileID: 0}
  - m_RefCount: 1
    m_Data: {fileID: 21300000, guid: 9497e993bb74f6544addf25589d16923, type: 3}
  - m_RefCount: 1
    m_Data: {fileID: 21300000, guid: 1e029a39a177bbd44bc28c3f80f5a4c6, type: 3}
  m_TileMatrixArray:
  - m_RefCount: 2
    m_Data:
      e00: 1
      e01: 0
      e02: 0
      e03: 0
      e10: 0
      e11: 1
      e12: 0
      e13: 0
      e20: 0
      e21: 0
      e22: 1
      e23: 0
      e30: 0
      e31: 0
      e32: 0
      e33: 1
  m_TileColorArray:
  - m_RefCount: 2
    m_Data: {r: 1, g: 1, b: 1, a: 1}
  m_TileObjectToInstantiateArray: []
  m_AnimationFrameRate: 1
  m_Color: {r: 1, g: 1, b: 1, a: 1}
  m_Origin: {x: -9, y: -3, z: 0}
  m_Size: {x: 4, y: 1, z: 1}
  m_TileAnchor: {x: 0.5, y: 0.5, z: 0}
  m_TileOrientation: 0
  m_TileOrientationMatrix:
    e00: 1
    e01: 0
    e02: 0
    e03: 0
    e10: 0
    e11: 1
    e12: 0
    e13: 0
    e20: 0
    e21: 0
    e22: 1
    e23: 0
    e30: 0
    e31: 0
    e32: 0
    e33: 1
--- !u!483693784 &4526759372948243981
TilemapRenderer:
  m_ObjectHideFlags: 0
  m_CorrespondingSourceObject: {fileID: 0}
  m_PrefabInstance: {fileID: 0}
  m_PrefabAsset: {fileID: 0}
  m_GameObject: {fileID: 328371559355272570}
  m_Enabled: 1
  m_CastShadows: 0
  m_ReceiveShadows: 0
  m_DynamicOccludee: 1
  m_MotionVectors: 1
  m_LightProbeUsage: 0
  m_ReflectionProbeUsage: 0
  m_RayTracingMode: 0
  m_RenderingLayerMask: 1
  m_RendererPriority: 0
  m_Materials:
  - {fileID: 10754, guid: 0000000000000000f000000000000000, type: 0}
  m_StaticBatchInfo:
    firstSubMesh: 0
    subMeshCount: 0
  m_StaticBatchRoot: {fileID: 0}
  m_ProbeAnchor: {fileID: 0}
  m_LightProbeVolumeOverride: {fileID: 0}
  m_ScaleInLightmap: 1
  m_ReceiveGI: 1
  m_PreserveUVs: 0
  m_IgnoreNormalsForChartDetection: 0
  m_ImportantGI: 0
  m_StitchLightmapSeams: 1
  m_SelectedEditorRenderState: 0
  m_MinimumChartSize: 4
  m_AutoUVMaxDistance: 0.5
  m_AutoUVMaxAngle: 89
  m_LightmapParameters: {fileID: 0}
  m_SortingLayerID: 0
  m_SortingLayer: 0
  m_SortingOrder: 1
  m_ChunkSize: {x: 32, y: 32, z: 32}
  m_ChunkCullingBounds: {x: 0, y: 0, z: 0}
  m_MaxChunkCount: 16
  m_MaxFrameAge: 16
  m_SortOrder: 0
  m_Mode: 0
  m_DetectChunkCullingBounds: 0
  m_MaskInteraction: 0
--- !u!1 &376915765518791323
GameObject:
  m_ObjectHideFlags: 0
  m_CorrespondingSourceObject: {fileID: 0}
  m_PrefabInstance: {fileID: 0}
  m_PrefabAsset: {fileID: 0}
  serializedVersion: 6
  m_Component:
  - component: {fileID: 3996315776129497266}
  - component: {fileID: 4291203305264262763}
  m_Layer: 0
  m_Name: Props
  m_TagString: Untagged
  m_Icon: {fileID: 0}
  m_NavMeshLayer: 0
  m_StaticEditorFlags: 0
  m_IsActive: 1
--- !u!4 &3996315776129497266
Transform:
  m_ObjectHideFlags: 0
  m_CorrespondingSourceObject: {fileID: 0}
  m_PrefabInstance: {fileID: 0}
  m_PrefabAsset: {fileID: 0}
  m_GameObject: {fileID: 376915765518791323}
  m_LocalRotation: {x: -0, y: -0, z: -0, w: 1}
  m_LocalPosition: {x: 0.5, y: 0.2, z: 7.6381254}
  m_LocalScale: {x: 1, y: 1, z: 1}
  m_Children:
  - {fileID: 6142548518981855983}
  m_Father: {fileID: 1890781679189965907}
  m_RootOrder: 4
  m_LocalEulerAnglesHint: {x: 0, y: 0, z: 0}
--- !u!156049354 &4291203305264262763
Grid:
  m_ObjectHideFlags: 0
  m_CorrespondingSourceObject: {fileID: 0}
  m_PrefabInstance: {fileID: 0}
  m_PrefabAsset: {fileID: 0}
  m_GameObject: {fileID: 376915765518791323}
  m_Enabled: 1
  m_CellSize: {x: 1, y: 1, z: 0}
  m_CellGap: {x: 0, y: 0, z: 0}
  m_CellLayout: 0
  m_CellSwizzle: 0
--- !u!1 &2928473948415376345
GameObject:
  m_ObjectHideFlags: 0
  m_CorrespondingSourceObject: {fileID: 0}
  m_PrefabInstance: {fileID: 0}
  m_PrefabAsset: {fileID: 0}
  serializedVersion: 6
  m_Component:
  - component: {fileID: 6504490466777691134}
  - component: {fileID: 982414211137460379}
  - component: {fileID: 7143347578055030367}
  - component: {fileID: 7874450409817655262}
  - component: {fileID: 2839868931543959555}
  - component: {fileID: 7572905061778343245}
  m_Layer: 0
  m_Name: Tilemap
  m_TagString: Untagged
  m_Icon: {fileID: 0}
  m_NavMeshLayer: 0
  m_StaticEditorFlags: 0
  m_IsActive: 1
--- !u!4 &6504490466777691134
Transform:
  m_ObjectHideFlags: 0
  m_CorrespondingSourceObject: {fileID: 0}
  m_PrefabInstance: {fileID: 0}
  m_PrefabAsset: {fileID: 0}
  m_GameObject: {fileID: 2928473948415376345}
  m_LocalRotation: {x: -0, y: -0, z: -0, w: 1}
  m_LocalPosition: {x: 0, y: 0, z: 0}
  m_LocalScale: {x: 1, y: 1, z: 1}
  m_Children: []
  m_Father: {fileID: 5276495553395576943}
  m_RootOrder: 0
  m_LocalEulerAnglesHint: {x: 0, y: 0, z: 0}
--- !u!1839735485 &982414211137460379
Tilemap:
  m_ObjectHideFlags: 0
  m_CorrespondingSourceObject: {fileID: 0}
  m_PrefabInstance: {fileID: 0}
  m_PrefabAsset: {fileID: 0}
  m_GameObject: {fileID: 2928473948415376345}
  m_Enabled: 1
  m_Tiles:
  - first: {x: -9, y: -5, z: 0}
    second:
      serializedVersion: 2
      m_TileIndex: 0
      m_TileSpriteIndex: 0
      m_TileMatrixIndex: 0
      m_TileColorIndex: 0
      m_TileObjectToInstantiateIndex: 65535
      dummyAlignment: 0
      m_AllTileFlags: 1073741825
  - first: {x: -8, y: -5, z: 0}
    second:
      serializedVersion: 2
      m_TileIndex: 0
      m_TileSpriteIndex: 0
      m_TileMatrixIndex: 0
      m_TileColorIndex: 0
      m_TileObjectToInstantiateIndex: 65535
      dummyAlignment: 0
      m_AllTileFlags: 1073741825
  - first: {x: -7, y: -5, z: 0}
    second:
      serializedVersion: 2
      m_TileIndex: 0
      m_TileSpriteIndex: 0
      m_TileMatrixIndex: 0
      m_TileColorIndex: 0
      m_TileObjectToInstantiateIndex: 65535
      dummyAlignment: 0
      m_AllTileFlags: 1073741825
  - first: {x: -6, y: -5, z: 0}
    second:
      serializedVersion: 2
      m_TileIndex: 0
      m_TileSpriteIndex: 0
      m_TileMatrixIndex: 0
      m_TileColorIndex: 0
      m_TileObjectToInstantiateIndex: 65535
      dummyAlignment: 0
      m_AllTileFlags: 1073741825
  - first: {x: -5, y: -5, z: 0}
    second:
      serializedVersion: 2
      m_TileIndex: 0
      m_TileSpriteIndex: 0
      m_TileMatrixIndex: 0
      m_TileColorIndex: 0
      m_TileObjectToInstantiateIndex: 65535
      dummyAlignment: 0
      m_AllTileFlags: 1073741825
  - first: {x: -4, y: -5, z: 0}
    second:
      serializedVersion: 2
      m_TileIndex: 0
      m_TileSpriteIndex: 0
      m_TileMatrixIndex: 0
      m_TileColorIndex: 0
      m_TileObjectToInstantiateIndex: 65535
      dummyAlignment: 0
      m_AllTileFlags: 1073741825
  m_AnimatedTiles: {}
  m_TileAssetArray:
  - m_RefCount: 6
    m_Data: {fileID: 11400000, guid: 53cd99d292a6cff4a8a0506aedb71e37, type: 2}
  m_TileSpriteArray:
  - m_RefCount: 6
    m_Data: {fileID: 21300000, guid: 678e7dbd4179904409a6f4fcdfb2dd77, type: 3}
  m_TileMatrixArray:
  - m_RefCount: 6
    m_Data:
      e00: 1
      e01: 0
      e02: 0
      e03: 0
      e10: 0
      e11: 1
      e12: 0
      e13: 0
      e20: 0
      e21: 0
      e22: 1
      e23: 0
      e30: 0
      e31: 0
      e32: 0
      e33: 1
  m_TileColorArray:
  - m_RefCount: 6
    m_Data: {r: 1, g: 1, b: 1, a: 1}
  m_TileObjectToInstantiateArray: []
  m_AnimationFrameRate: 1
  m_Color: {r: 1, g: 1, b: 1, a: 1}
  m_Origin: {x: -9, y: -5, z: 0}
  m_Size: {x: 6, y: 1, z: 1}
  m_TileAnchor: {x: 0.5, y: 0.5, z: 0}
  m_TileOrientation: 0
  m_TileOrientationMatrix:
    e00: 1
    e01: 0
    e02: 0
    e03: 0
    e10: 0
    e11: 1
    e12: 0
    e13: 0
    e20: 0
    e21: 0
    e22: 1
    e23: 0
    e30: 0
    e31: 0
    e32: 0
    e33: 1
--- !u!483693784 &7143347578055030367
TilemapRenderer:
  m_ObjectHideFlags: 0
  m_CorrespondingSourceObject: {fileID: 0}
  m_PrefabInstance: {fileID: 0}
  m_PrefabAsset: {fileID: 0}
  m_GameObject: {fileID: 2928473948415376345}
  m_Enabled: 1
  m_CastShadows: 0
  m_ReceiveShadows: 0
  m_DynamicOccludee: 1
  m_MotionVectors: 1
  m_LightProbeUsage: 0
  m_ReflectionProbeUsage: 0
  m_RayTracingMode: 0
  m_RenderingLayerMask: 1
  m_RendererPriority: 0
  m_Materials:
  - {fileID: 10754, guid: 0000000000000000f000000000000000, type: 0}
  m_StaticBatchInfo:
    firstSubMesh: 0
    subMeshCount: 0
  m_StaticBatchRoot: {fileID: 0}
  m_ProbeAnchor: {fileID: 0}
  m_LightProbeVolumeOverride: {fileID: 0}
  m_ScaleInLightmap: 1
  m_ReceiveGI: 1
  m_PreserveUVs: 0
  m_IgnoreNormalsForChartDetection: 0
  m_ImportantGI: 0
  m_StitchLightmapSeams: 1
  m_SelectedEditorRenderState: 0
  m_MinimumChartSize: 4
  m_AutoUVMaxDistance: 0.5
  m_AutoUVMaxAngle: 89
  m_LightmapParameters: {fileID: 0}
  m_SortingLayerID: 0
  m_SortingLayer: 0
  m_SortingOrder: 3
  m_ChunkSize: {x: 32, y: 32, z: 32}
  m_ChunkCullingBounds: {x: 0, y: 0, z: 0}
  m_MaxChunkCount: 16
  m_MaxFrameAge: 16
  m_SortOrder: 0
  m_Mode: 0
  m_DetectChunkCullingBounds: 0
  m_MaskInteraction: 0
--- !u!19719996 &7874450409817655262
TilemapCollider2D:
  m_ObjectHideFlags: 0
  m_CorrespondingSourceObject: {fileID: 0}
  m_PrefabInstance: {fileID: 0}
  m_PrefabAsset: {fileID: 0}
  m_GameObject: {fileID: 2928473948415376345}
  m_Enabled: 1
  m_Density: 1
  m_Material: {fileID: 0}
  m_IsTrigger: 0
  m_UsedByEffector: 0
  m_UsedByComposite: 1
  m_Offset: {x: 0, y: 0}
  m_MaximumTileChangeCount: 1000
  m_ExtrusionFactor: 0.00001
--- !u!50 &2839868931543959555
Rigidbody2D:
  serializedVersion: 4
  m_ObjectHideFlags: 0
  m_CorrespondingSourceObject: {fileID: 0}
  m_PrefabInstance: {fileID: 0}
  m_PrefabAsset: {fileID: 0}
  m_GameObject: {fileID: 2928473948415376345}
  m_BodyType: 1
  m_Simulated: 1
  m_UseFullKinematicContacts: 0
  m_UseAutoMass: 0
  m_Mass: 1
  m_LinearDrag: 0
  m_AngularDrag: 0.05
  m_GravityScale: 1
  m_Material: {fileID: 0}
  m_Interpolate: 0
  m_SleepingMode: 1
  m_CollisionDetection: 0
  m_Constraints: 0
--- !u!66 &7572905061778343245
CompositeCollider2D:
  m_ObjectHideFlags: 0
  m_CorrespondingSourceObject: {fileID: 0}
  m_PrefabInstance: {fileID: 0}
  m_PrefabAsset: {fileID: 0}
  m_GameObject: {fileID: 2928473948415376345}
  m_Enabled: 1
  m_Density: 1
  m_Material: {fileID: 0}
  m_IsTrigger: 0
  m_UsedByEffector: 0
  m_UsedByComposite: 0
  m_Offset: {x: 0, y: 0}
  m_GeometryType: 0
  m_GenerationType: 0
  m_EdgeRadius: 0
  m_ColliderPaths:
  - m_Collider: {fileID: 7874450409817655262}
    m_ColliderPaths:
    - - X: -90000000
        Y: -50000000
      - X: -30000000
        Y: -50000000
      - X: -30000000
        Y: -40000000
      - X: -90000000
        Y: -40000000
  m_CompositePaths:
    m_Paths:
    - - {x: -3.0000293, y: -5}
      - {x: -3.0000293, y: -4}
      - {x: -9, y: -4.000029}
      - {x: -8.99997, y: -5}
  m_VertexDistance: 0.0005
  m_OffsetDistance: 0.00005
--- !u!1 &3356039912360022094
GameObject:
  m_ObjectHideFlags: 0
  m_CorrespondingSourceObject: {fileID: 0}
  m_PrefabInstance: {fileID: 0}
  m_PrefabAsset: {fileID: 0}
  serializedVersion: 6
  m_Component:
  - component: {fileID: 7215129559598402905}
  - component: {fileID: 6812077035148767879}
  - component: {fileID: 6358106146262412225}
  m_Layer: 0
  m_Name: Tilemap
  m_TagString: Untagged
  m_Icon: {fileID: 0}
  m_NavMeshLayer: 0
  m_StaticEditorFlags: 0
  m_IsActive: 1
--- !u!4 &7215129559598402905
Transform:
  m_ObjectHideFlags: 0
  m_CorrespondingSourceObject: {fileID: 0}
  m_PrefabInstance: {fileID: 0}
  m_PrefabAsset: {fileID: 0}
  m_GameObject: {fileID: 3356039912360022094}
  m_LocalRotation: {x: -0, y: -0, z: -0, w: 1}
  m_LocalPosition: {x: 0, y: 0, z: 0}
  m_LocalScale: {x: 1, y: 1, z: 1}
  m_Children: []
  m_Father: {fileID: 7339211372583000064}
  m_RootOrder: 0
  m_LocalEulerAnglesHint: {x: 0, y: 0, z: 0}
--- !u!1839735485 &6812077035148767879
Tilemap:
  m_ObjectHideFlags: 0
  m_CorrespondingSourceObject: {fileID: 0}
  m_PrefabInstance: {fileID: 0}
  m_PrefabAsset: {fileID: 0}
  m_GameObject: {fileID: 3356039912360022094}
  m_Enabled: 1
  m_Tiles:
  - first: {x: -9, y: -4, z: 0}
    second:
      serializedVersion: 2
      m_TileIndex: 0
      m_TileSpriteIndex: 0
      m_TileMatrixIndex: 0
      m_TileColorIndex: 0
      m_TileObjectToInstantiateIndex: 65535
      dummyAlignment: 0
      m_AllTileFlags: 1073741825
  - first: {x: -8, y: -4, z: 0}
    second:
      serializedVersion: 2
      m_TileIndex: 0
      m_TileSpriteIndex: 0
      m_TileMatrixIndex: 0
      m_TileColorIndex: 0
      m_TileObjectToInstantiateIndex: 65535
      dummyAlignment: 0
      m_AllTileFlags: 1073741825
  - first: {x: -7, y: -4, z: 0}
    second:
      serializedVersion: 2
      m_TileIndex: 0
      m_TileSpriteIndex: 0
      m_TileMatrixIndex: 0
      m_TileColorIndex: 0
      m_TileObjectToInstantiateIndex: 65535
      dummyAlignment: 0
      m_AllTileFlags: 1073741825
  - first: {x: -6, y: -4, z: 0}
    second:
      serializedVersion: 2
      m_TileIndex: 0
      m_TileSpriteIndex: 0
      m_TileMatrixIndex: 0
      m_TileColorIndex: 0
      m_TileObjectToInstantiateIndex: 65535
      dummyAlignment: 0
      m_AllTileFlags: 1073741825
  - first: {x: -5, y: -4, z: 0}
    second:
      serializedVersion: 2
      m_TileIndex: 0
      m_TileSpriteIndex: 0
      m_TileMatrixIndex: 0
      m_TileColorIndex: 0
      m_TileObjectToInstantiateIndex: 65535
      dummyAlignment: 0
      m_AllTileFlags: 1073741825
  - first: {x: -4, y: -4, z: 0}
    second:
      serializedVersion: 2
      m_TileIndex: 0
      m_TileSpriteIndex: 0
      m_TileMatrixIndex: 0
      m_TileColorIndex: 0
      m_TileObjectToInstantiateIndex: 65535
      dummyAlignment: 0
      m_AllTileFlags: 1073741825
  - first: {x: -9, y: -3, z: 0}
    second:
      serializedVersion: 2
      m_TileIndex: 1
      m_TileSpriteIndex: 1
      m_TileMatrixIndex: 0
      m_TileColorIndex: 0
      m_TileObjectToInstantiateIndex: 65535
      dummyAlignment: 0
      m_AllTileFlags: 1073741825
  - first: {x: -8, y: -3, z: 0}
    second:
      serializedVersion: 2
      m_TileIndex: 2
      m_TileSpriteIndex: 2
      m_TileMatrixIndex: 0
      m_TileColorIndex: 0
      m_TileObjectToInstantiateIndex: 65535
      dummyAlignment: 0
      m_AllTileFlags: 1073741825
  - first: {x: -7, y: -3, z: 0}
    second:
      serializedVersion: 2
      m_TileIndex: 1
      m_TileSpriteIndex: 1
      m_TileMatrixIndex: 0
      m_TileColorIndex: 0
      m_TileObjectToInstantiateIndex: 65535
      dummyAlignment: 0
      m_AllTileFlags: 1073741825
  - first: {x: -6, y: -3, z: 0}
    second:
      serializedVersion: 2
      m_TileIndex: 2
      m_TileSpriteIndex: 2
      m_TileMatrixIndex: 0
      m_TileColorIndex: 0
      m_TileObjectToInstantiateIndex: 65535
      dummyAlignment: 0
      m_AllTileFlags: 1073741825
  - first: {x: -5, y: -3, z: 0}
    second:
      serializedVersion: 2
      m_TileIndex: 1
      m_TileSpriteIndex: 1
      m_TileMatrixIndex: 0
      m_TileColorIndex: 0
      m_TileObjectToInstantiateIndex: 65535
      dummyAlignment: 0
      m_AllTileFlags: 1073741825
  - first: {x: -4, y: -3, z: 0}
    second:
      serializedVersion: 2
      m_TileIndex: 2
      m_TileSpriteIndex: 2
      m_TileMatrixIndex: 0
      m_TileColorIndex: 0
      m_TileObjectToInstantiateIndex: 65535
      dummyAlignment: 0
      m_AllTileFlags: 1073741825
  m_AnimatedTiles: {}
  m_TileAssetArray:
  - m_RefCount: 6
    m_Data: {fileID: 11400000, guid: 7159ec1d32a859a4e9dc433372135a89, type: 2}
  - m_RefCount: 3
    m_Data: {fileID: 11400000, guid: 21efd36ff7e89d0498e703529a5d195b, type: 2}
  - m_RefCount: 3
    m_Data: {fileID: 11400000, guid: 1b7395c77192c8f4f8e126bf06d7dbca, type: 2}
  - m_RefCount: 0
    m_Data: {fileID: 0}
  - m_RefCount: 0
    m_Data: {fileID: 0}
  m_TileSpriteArray:
  - m_RefCount: 6
    m_Data: {fileID: 21300000, guid: 01376c172f98aa447aa04f8ee2b86e70, type: 3}
  - m_RefCount: 3
    m_Data: {fileID: 21300000, guid: 16606e1c931631d4dacd13a4205a4248, type: 3}
  - m_RefCount: 3
    m_Data: {fileID: 21300000, guid: fca89efbecc91074099e9b57fc5a718a, type: 3}
  - m_RefCount: 0
    m_Data: {fileID: 0}
  - m_RefCount: 0
    m_Data: {fileID: 0}
  m_TileMatrixArray:
  - m_RefCount: 12
    m_Data:
      e00: 1
      e01: 0
      e02: 0
      e03: 0
      e10: 0
      e11: 1
      e12: 0
      e13: 0
      e20: 0
      e21: 0
      e22: 1
      e23: 0
      e30: 0
      e31: 0
      e32: 0
      e33: 1
  m_TileColorArray:
  - m_RefCount: 12
    m_Data: {r: 1, g: 1, b: 1, a: 1}
  m_TileObjectToInstantiateArray: []
  m_AnimationFrameRate: 1
  m_Color: {r: 1, g: 1, b: 1, a: 1}
  m_Origin: {x: -9, y: -4, z: 0}
  m_Size: {x: 6, y: 3, z: 1}
  m_TileAnchor: {x: 0.5, y: 0.5, z: 0}
  m_TileOrientation: 0
  m_TileOrientationMatrix:
    e00: 1
    e01: 0
    e02: 0
    e03: 0
    e10: 0
    e11: 1
    e12: 0
    e13: 0
    e20: 0
    e21: 0
    e22: 1
    e23: 0
    e30: 0
    e31: 0
    e32: 0
    e33: 1
--- !u!483693784 &6358106146262412225
TilemapRenderer:
  m_ObjectHideFlags: 0
  m_CorrespondingSourceObject: {fileID: 0}
  m_PrefabInstance: {fileID: 0}
  m_PrefabAsset: {fileID: 0}
  m_GameObject: {fileID: 3356039912360022094}
  m_Enabled: 1
  m_CastShadows: 0
  m_ReceiveShadows: 0
  m_DynamicOccludee: 1
  m_MotionVectors: 1
  m_LightProbeUsage: 0
  m_ReflectionProbeUsage: 0
  m_RayTracingMode: 0
  m_RenderingLayerMask: 1
  m_RendererPriority: 0
  m_Materials:
  - {fileID: 10754, guid: 0000000000000000f000000000000000, type: 0}
  m_StaticBatchInfo:
    firstSubMesh: 0
    subMeshCount: 0
  m_StaticBatchRoot: {fileID: 0}
  m_ProbeAnchor: {fileID: 0}
  m_LightProbeVolumeOverride: {fileID: 0}
  m_ScaleInLightmap: 1
  m_ReceiveGI: 1
  m_PreserveUVs: 0
  m_IgnoreNormalsForChartDetection: 0
  m_ImportantGI: 0
  m_StitchLightmapSeams: 1
  m_SelectedEditorRenderState: 0
  m_MinimumChartSize: 4
  m_AutoUVMaxDistance: 0.5
  m_AutoUVMaxAngle: 89
  m_LightmapParameters: {fileID: 0}
  m_SortingLayerID: 0
  m_SortingLayer: 0
  m_SortingOrder: 0
  m_ChunkSize: {x: 32, y: 32, z: 32}
  m_ChunkCullingBounds: {x: 0, y: 0, z: 0}
  m_MaxChunkCount: 16
  m_MaxFrameAge: 16
  m_SortOrder: 0
  m_Mode: 0
  m_DetectChunkCullingBounds: 0
  m_MaskInteraction: 0
--- !u!1 &3703119526175543657
GameObject:
  m_ObjectHideFlags: 0
  m_CorrespondingSourceObject: {fileID: 0}
  m_PrefabInstance: {fileID: 0}
  m_PrefabAsset: {fileID: 0}
  serializedVersion: 6
  m_Component:
  - component: {fileID: 7339211372583000064}
  - component: {fileID: 6474547282301878008}
  m_Layer: 0
  m_Name: Grid2
  m_TagString: Untagged
  m_Icon: {fileID: 0}
  m_NavMeshLayer: 0
  m_StaticEditorFlags: 0
  m_IsActive: 1
--- !u!4 &7339211372583000064
Transform:
  m_ObjectHideFlags: 0
  m_CorrespondingSourceObject: {fileID: 0}
  m_PrefabInstance: {fileID: 0}
  m_PrefabAsset: {fileID: 0}
  m_GameObject: {fileID: 3703119526175543657}
  m_LocalRotation: {x: -0, y: -0, z: -0, w: 1}
  m_LocalPosition: {x: 0, y: 0, z: 7.6381254}
  m_LocalScale: {x: 1, y: 1, z: 1}
  m_Children:
  - {fileID: 7215129559598402905}
  m_Father: {fileID: 1890781679189965907}
  m_RootOrder: 1
  m_LocalEulerAnglesHint: {x: 0, y: 0, z: 0}
--- !u!156049354 &6474547282301878008
Grid:
  m_ObjectHideFlags: 0
  m_CorrespondingSourceObject: {fileID: 0}
  m_PrefabInstance: {fileID: 0}
  m_PrefabAsset: {fileID: 0}
  m_GameObject: {fileID: 3703119526175543657}
  m_Enabled: 1
  m_CellSize: {x: 1, y: 1, z: 0}
  m_CellGap: {x: 0, y: 0, z: 0}
  m_CellLayout: 0
  m_CellSwizzle: 0
--- !u!1 &6156797318311449079
GameObject:
  m_ObjectHideFlags: 0
  m_CorrespondingSourceObject: {fileID: 0}
  m_PrefabInstance: {fileID: 0}
  m_PrefabAsset: {fileID: 0}
  serializedVersion: 6
  m_Component:
  - component: {fileID: 1890781679189965907}
  - component: {fileID: 9144673975036372048}
  - component: {fileID: -5132486227498702465}
  m_Layer: 0
  m_Name: 1
  m_TagString: Untagged
  m_Icon: {fileID: 0}
  m_NavMeshLayer: 0
  m_StaticEditorFlags: 0
  m_IsActive: 1
--- !u!4 &1890781679189965907
Transform:
  m_ObjectHideFlags: 0
  m_CorrespondingSourceObject: {fileID: 0}
  m_PrefabInstance: {fileID: 0}
  m_PrefabAsset: {fileID: 0}
  m_GameObject: {fileID: 6156797318311449079}
  m_LocalRotation: {x: 0, y: 0, z: 0, w: 1}
  m_LocalPosition: {x: 0, y: 0, z: -7.6381254}
  m_LocalScale: {x: 1, y: 1, z: 1}
  m_Children:
  - {fileID: 5276495553395576943}
  - {fileID: 7339211372583000064}
  - {fileID: 5568439475036742200}
  - {fileID: 3557037465248901827}
  - {fileID: 3996315776129497266}
  - {fileID: 8118274271480868682}
  - {fileID: 1450421483684133243}
  - {fileID: 8807923922189078522}
  - {fileID: 2475850432720950436}
  m_Father: {fileID: 0}
  m_RootOrder: 0
  m_LocalEulerAnglesHint: {x: 0, y: 0, z: 0}
--- !u!114 &9144673975036372048
MonoBehaviour:
  m_ObjectHideFlags: 0
  m_CorrespondingSourceObject: {fileID: 0}
  m_PrefabInstance: {fileID: 0}
  m_PrefabAsset: {fileID: 0}
  m_GameObject: {fileID: 6156797318311449079}
  m_Enabled: 1
  m_EditorHideFlags: 0
  m_Script: {fileID: 11500000, guid: 8d464916a3f19dc4e97b5df9e5d6690d, type: 3}
  m_Name: 
  m_EditorClassIdentifier: 
--- !u!114 &-5132486227498702465
MonoBehaviour:
  m_ObjectHideFlags: 0
  m_CorrespondingSourceObject: {fileID: 0}
  m_PrefabInstance: {fileID: 0}
  m_PrefabAsset: {fileID: 0}
  m_GameObject: {fileID: 6156797318311449079}
  m_Enabled: 1
  m_EditorHideFlags: 0
  m_Script: {fileID: 11500000, guid: 7b8060118265d5048a840e84f126a99b, type: 3}
  m_Name: 
  m_EditorClassIdentifier: 
--- !u!1001 &244183846157716251
PrefabInstance:
  m_ObjectHideFlags: 0
  serializedVersion: 2
  m_Modification:
    m_TransformParent: {fileID: 1890781679189965907}
    m_Modifications:
    - target: {fileID: 4822639879976932032, guid: f09329808afa1674fb677dbe7dfc9142,
        type: 3}
      propertyPath: spawnProb
      value: 30
      objectReference: {fileID: 0}
    - target: {fileID: 5441869364026364299, guid: f09329808afa1674fb677dbe7dfc9142,
        type: 3}
      propertyPath: m_Name
      value: EnemySpawner (2)
      objectReference: {fileID: 0}
    - target: {fileID: 8343591786057426001, guid: f09329808afa1674fb677dbe7dfc9142,
        type: 3}
      propertyPath: m_RootOrder
      value: 5
      objectReference: {fileID: 0}
    - target: {fileID: 8343591786057426001, guid: f09329808afa1674fb677dbe7dfc9142,
        type: 3}
      propertyPath: m_LocalPosition.x
      value: -4.12
      objectReference: {fileID: 0}
    - target: {fileID: 8343591786057426001, guid: f09329808afa1674fb677dbe7dfc9142,
        type: 3}
      propertyPath: m_LocalPosition.y
      value: -3.36
      objectReference: {fileID: 0}
    - target: {fileID: 8343591786057426001, guid: f09329808afa1674fb677dbe7dfc9142,
        type: 3}
      propertyPath: m_LocalPosition.z
      value: -0.8768133
      objectReference: {fileID: 0}
    - target: {fileID: 8343591786057426001, guid: f09329808afa1674fb677dbe7dfc9142,
        type: 3}
      propertyPath: m_LocalRotation.w
      value: 1
      objectReference: {fileID: 0}
    - target: {fileID: 8343591786057426001, guid: f09329808afa1674fb677dbe7dfc9142,
        type: 3}
      propertyPath: m_LocalRotation.x
      value: -0
      objectReference: {fileID: 0}
    - target: {fileID: 8343591786057426001, guid: f09329808afa1674fb677dbe7dfc9142,
        type: 3}
      propertyPath: m_LocalRotation.y
      value: -0
      objectReference: {fileID: 0}
    - target: {fileID: 8343591786057426001, guid: f09329808afa1674fb677dbe7dfc9142,
        type: 3}
      propertyPath: m_LocalRotation.z
      value: -0
      objectReference: {fileID: 0}
    - target: {fileID: 8343591786057426001, guid: f09329808afa1674fb677dbe7dfc9142,
        type: 3}
      propertyPath: m_LocalEulerAnglesHint.x
      value: 0
      objectReference: {fileID: 0}
    - target: {fileID: 8343591786057426001, guid: f09329808afa1674fb677dbe7dfc9142,
        type: 3}
      propertyPath: m_LocalEulerAnglesHint.y
      value: 0
      objectReference: {fileID: 0}
    - target: {fileID: 8343591786057426001, guid: f09329808afa1674fb677dbe7dfc9142,
        type: 3}
      propertyPath: m_LocalEulerAnglesHint.z
      value: 0
      objectReference: {fileID: 0}
    m_RemovedComponents: []
  m_SourcePrefab: {fileID: 100100000, guid: f09329808afa1674fb677dbe7dfc9142, type: 3}
--- !u!4 &8118274271480868682 stripped
Transform:
  m_CorrespondingSourceObject: {fileID: 8343591786057426001, guid: f09329808afa1674fb677dbe7dfc9142,
    type: 3}
  m_PrefabInstance: {fileID: 244183846157716251}
  m_PrefabAsset: {fileID: 0}
--- !u!1001 &717880633123089323
PrefabInstance:
  m_ObjectHideFlags: 0
  serializedVersion: 2
  m_Modification:
    m_TransformParent: {fileID: 1890781679189965907}
    m_Modifications:
    - target: {fileID: 4822639879976932032, guid: f09329808afa1674fb677dbe7dfc9142,
        type: 3}
      propertyPath: enemy
      value: 
      objectReference: {fileID: 3705602519594052203, guid: 660b5166df6b36c41ad544d2afab1531,
        type: 3}
    - target: {fileID: 4822639879976932032, guid: f09329808afa1674fb677dbe7dfc9142,
        type: 3}
      propertyPath: spawnProb
      value: 30
      objectReference: {fileID: 0}
    - target: {fileID: 5441869364026364299, guid: f09329808afa1674fb677dbe7dfc9142,
        type: 3}
      propertyPath: m_Name
      value: CoinSpawner (1)
      objectReference: {fileID: 0}
    - target: {fileID: 8343591786057426001, guid: f09329808afa1674fb677dbe7dfc9142,
        type: 3}
      propertyPath: m_RootOrder
      value: 7
      objectReference: {fileID: 0}
    - target: {fileID: 8343591786057426001, guid: f09329808afa1674fb677dbe7dfc9142,
        type: 3}
      propertyPath: m_LocalPosition.x
      value: -6.8
      objectReference: {fileID: 0}
    - target: {fileID: 8343591786057426001, guid: f09329808afa1674fb677dbe7dfc9142,
        type: 3}
      propertyPath: m_LocalPosition.y
      value: -3.36
      objectReference: {fileID: 0}
    - target: {fileID: 8343591786057426001, guid: f09329808afa1674fb677dbe7dfc9142,
        type: 3}
      propertyPath: m_LocalPosition.z
      value: -0.8768133
      objectReference: {fileID: 0}
    - target: {fileID: 8343591786057426001, guid: f09329808afa1674fb677dbe7dfc9142,
        type: 3}
      propertyPath: m_LocalRotation.w
      value: 1
      objectReference: {fileID: 0}
    - target: {fileID: 8343591786057426001, guid: f09329808afa1674fb677dbe7dfc9142,
        type: 3}
      propertyPath: m_LocalRotation.x
      value: -0
      objectReference: {fileID: 0}
    - target: {fileID: 8343591786057426001, guid: f09329808afa1674fb677dbe7dfc9142,
        type: 3}
      propertyPath: m_LocalRotation.y
      value: -0
      objectReference: {fileID: 0}
    - target: {fileID: 8343591786057426001, guid: f09329808afa1674fb677dbe7dfc9142,
        type: 3}
      propertyPath: m_LocalRotation.z
      value: -0
      objectReference: {fileID: 0}
    - target: {fileID: 8343591786057426001, guid: f09329808afa1674fb677dbe7dfc9142,
        type: 3}
      propertyPath: m_LocalEulerAnglesHint.x
      value: 0
      objectReference: {fileID: 0}
    - target: {fileID: 8343591786057426001, guid: f09329808afa1674fb677dbe7dfc9142,
        type: 3}
      propertyPath: m_LocalEulerAnglesHint.y
      value: 0
      objectReference: {fileID: 0}
    - target: {fileID: 8343591786057426001, guid: f09329808afa1674fb677dbe7dfc9142,
        type: 3}
      propertyPath: m_LocalEulerAnglesHint.z
      value: 0
      objectReference: {fileID: 0}
    m_RemovedComponents: []
  m_SourcePrefab: {fileID: 100100000, guid: f09329808afa1674fb677dbe7dfc9142, type: 3}
--- !u!4 &8807923922189078522 stripped
Transform:
  m_CorrespondingSourceObject: {fileID: 8343591786057426001, guid: f09329808afa1674fb677dbe7dfc9142,
    type: 3}
  m_PrefabInstance: {fileID: 717880633123089323}
  m_PrefabAsset: {fileID: 0}
--- !u!1001 &942146670471684566
PrefabInstance:
  m_ObjectHideFlags: 0
  serializedVersion: 2
  m_Modification:
    m_TransformParent: {fileID: 1890781679189965907}
    m_Modifications:
    - target: {fileID: 3407203733767746930, guid: f0097ace094c2ac468541895c512e932,
        type: 3}
      propertyPath: m_RootOrder
      value: 8
      objectReference: {fileID: 0}
    - target: {fileID: 3407203733767746930, guid: f0097ace094c2ac468541895c512e932,
        type: 3}
      propertyPath: m_LocalPosition.x
      value: -6.25
      objectReference: {fileID: 0}
    - target: {fileID: 3407203733767746930, guid: f0097ace094c2ac468541895c512e932,
        type: 3}
      propertyPath: m_LocalPosition.y
      value: -3.44
      objectReference: {fileID: 0}
    - target: {fileID: 3407203733767746930, guid: f0097ace094c2ac468541895c512e932,
        type: 3}
      propertyPath: m_LocalPosition.z
      value: -1.8706772
      objectReference: {fileID: 0}
    - target: {fileID: 3407203733767746930, guid: f0097ace094c2ac468541895c512e932,
        type: 3}
      propertyPath: m_LocalRotation.w
      value: 1
      objectReference: {fileID: 0}
    - target: {fileID: 3407203733767746930, guid: f0097ace094c2ac468541895c512e932,
        type: 3}
      propertyPath: m_LocalRotation.x
      value: -0
      objectReference: {fileID: 0}
    - target: {fileID: 3407203733767746930, guid: f0097ace094c2ac468541895c512e932,
        type: 3}
      propertyPath: m_LocalRotation.y
      value: -0
      objectReference: {fileID: 0}
    - target: {fileID: 3407203733767746930, guid: f0097ace094c2ac468541895c512e932,
        type: 3}
      propertyPath: m_LocalRotation.z
      value: -0
      objectReference: {fileID: 0}
    - target: {fileID: 3407203733767746930, guid: f0097ace094c2ac468541895c512e932,
        type: 3}
      propertyPath: m_LocalEulerAnglesHint.x
      value: 0
      objectReference: {fileID: 0}
    - target: {fileID: 3407203733767746930, guid: f0097ace094c2ac468541895c512e932,
        type: 3}
      propertyPath: m_LocalEulerAnglesHint.y
      value: 0
      objectReference: {fileID: 0}
    - target: {fileID: 3407203733767746930, guid: f0097ace094c2ac468541895c512e932,
        type: 3}
      propertyPath: m_LocalEulerAnglesHint.z
      value: 0
      objectReference: {fileID: 0}
    - target: {fileID: 3407203733767746932, guid: f0097ace094c2ac468541895c512e932,
        type: 3}
      propertyPath: m_Name
      value: PowerUpSpawn
      objectReference: {fileID: 0}
    m_RemovedComponents: []
  m_SourcePrefab: {fileID: 100100000, guid: f0097ace094c2ac468541895c512e932, type: 3}
--- !u!4 &2475850432720950436 stripped
Transform:
  m_CorrespondingSourceObject: {fileID: 3407203733767746930, guid: f0097ace094c2ac468541895c512e932,
    type: 3}
  m_PrefabInstance: {fileID: 942146670471684566}
  m_PrefabAsset: {fileID: 0}
--- !u!1001 &4507389330150524521
PrefabInstance:
  m_ObjectHideFlags: 0
  serializedVersion: 2
  m_Modification:
    m_TransformParent: {fileID: 1890781679189965907}
    m_Modifications:
    - target: {fileID: 4822639879976932032, guid: f09329808afa1674fb677dbe7dfc9142,
        type: 3}
      propertyPath: spawnProb
      value: 50
      objectReference: {fileID: 0}
    - target: {fileID: 5441869364026364299, guid: f09329808afa1674fb677dbe7dfc9142,
        type: 3}
      propertyPath: m_Name
      value: EnemySpawner
      objectReference: {fileID: 0}
    - target: {fileID: 8343591786057426001, guid: f09329808afa1674fb677dbe7dfc9142,
        type: 3}
      propertyPath: m_RootOrder
      value: 2
      objectReference: {fileID: 0}
    - target: {fileID: 8343591786057426001, guid: f09329808afa1674fb677dbe7dfc9142,
        type: 3}
      propertyPath: m_LocalPosition.x
      value: -5.58
      objectReference: {fileID: 0}
    - target: {fileID: 8343591786057426001, guid: f09329808afa1674fb677dbe7dfc9142,
        type: 3}
      propertyPath: m_LocalPosition.y
      value: -3.36
      objectReference: {fileID: 0}
    - target: {fileID: 8343591786057426001, guid: f09329808afa1674fb677dbe7dfc9142,
        type: 3}
      propertyPath: m_LocalPosition.z
      value: -0.8768133
      objectReference: {fileID: 0}
    - target: {fileID: 8343591786057426001, guid: f09329808afa1674fb677dbe7dfc9142,
        type: 3}
      propertyPath: m_LocalRotation.w
      value: 1
      objectReference: {fileID: 0}
    - target: {fileID: 8343591786057426001, guid: f09329808afa1674fb677dbe7dfc9142,
        type: 3}
      propertyPath: m_LocalRotation.x
      value: -0
      objectReference: {fileID: 0}
    - target: {fileID: 8343591786057426001, guid: f09329808afa1674fb677dbe7dfc9142,
        type: 3}
      propertyPath: m_LocalRotation.y
      value: -0
      objectReference: {fileID: 0}
    - target: {fileID: 8343591786057426001, guid: f09329808afa1674fb677dbe7dfc9142,
        type: 3}
      propertyPath: m_LocalRotation.z
      value: -0
      objectReference: {fileID: 0}
    - target: {fileID: 8343591786057426001, guid: f09329808afa1674fb677dbe7dfc9142,
        type: 3}
      propertyPath: m_LocalEulerAnglesHint.x
      value: 0
      objectReference: {fileID: 0}
    - target: {fileID: 8343591786057426001, guid: f09329808afa1674fb677dbe7dfc9142,
        type: 3}
      propertyPath: m_LocalEulerAnglesHint.y
      value: 0
      objectReference: {fileID: 0}
    - target: {fileID: 8343591786057426001, guid: f09329808afa1674fb677dbe7dfc9142,
        type: 3}
      propertyPath: m_LocalEulerAnglesHint.z
      value: 0
      objectReference: {fileID: 0}
    m_RemovedComponents: []
  m_SourcePrefab: {fileID: 100100000, guid: f09329808afa1674fb677dbe7dfc9142, type: 3}
--- !u!4 &5568439475036742200 stripped
Transform:
  m_CorrespondingSourceObject: {fileID: 8343591786057426001, guid: f09329808afa1674fb677dbe7dfc9142,
    type: 3}
  m_PrefabInstance: {fileID: 4507389330150524521}
  m_PrefabAsset: {fileID: 0}
--- !u!1001 &4798381166098599570
PrefabInstance:
  m_ObjectHideFlags: 0
  serializedVersion: 2
  m_Modification:
    m_TransformParent: {fileID: 1890781679189965907}
    m_Modifications:
    - target: {fileID: 4822639879976932032, guid: f09329808afa1674fb677dbe7dfc9142,
        type: 3}
      propertyPath: enemy
      value: 
      objectReference: {fileID: 895871365700523953, guid: ff960f3345bcb31438dd11de0271479c,
        type: 3}
    - target: {fileID: 4822639879976932032, guid: f09329808afa1674fb677dbe7dfc9142,
        type: 3}
      propertyPath: spawnProb
      value: 25
      objectReference: {fileID: 0}
    - target: {fileID: 5441869364026364299, guid: f09329808afa1674fb677dbe7dfc9142,
        type: 3}
      propertyPath: m_Name
      value: EnemySpawner (1)
      objectReference: {fileID: 0}
    - target: {fileID: 8343591786057426001, guid: f09329808afa1674fb677dbe7dfc9142,
        type: 3}
      propertyPath: m_RootOrder
      value: 3
      objectReference: {fileID: 0}
    - target: {fileID: 8343591786057426001, guid: f09329808afa1674fb677dbe7dfc9142,
        type: 3}
      propertyPath: m_LocalPosition.x
      value: -8.17
      objectReference: {fileID: 0}
    - target: {fileID: 8343591786057426001, guid: f09329808afa1674fb677dbe7dfc9142,
        type: 3}
      propertyPath: m_LocalPosition.y
      value: -1.95
      objectReference: {fileID: 0}
    - target: {fileID: 8343591786057426001, guid: f09329808afa1674fb677dbe7dfc9142,
        type: 3}
      propertyPath: m_LocalPosition.z
      value: -0.8768133
      objectReference: {fileID: 0}
    - target: {fileID: 8343591786057426001, guid: f09329808afa1674fb677dbe7dfc9142,
        type: 3}
      propertyPath: m_LocalRotation.w
      value: 1
      objectReference: {fileID: 0}
    - target: {fileID: 8343591786057426001, guid: f09329808afa1674fb677dbe7dfc9142,
        type: 3}
      propertyPath: m_LocalRotation.x
      value: -0
      objectReference: {fileID: 0}
    - target: {fileID: 8343591786057426001, guid: f09329808afa1674fb677dbe7dfc9142,
        type: 3}
      propertyPath: m_LocalRotation.y
      value: -0
      objectReference: {fileID: 0}
    - target: {fileID: 8343591786057426001, guid: f09329808afa1674fb677dbe7dfc9142,
        type: 3}
      propertyPath: m_LocalRotation.z
      value: -0
      objectReference: {fileID: 0}
    - target: {fileID: 8343591786057426001, guid: f09329808afa1674fb677dbe7dfc9142,
        type: 3}
      propertyPath: m_LocalEulerAnglesHint.x
      value: 0
      objectReference: {fileID: 0}
    - target: {fileID: 8343591786057426001, guid: f09329808afa1674fb677dbe7dfc9142,
        type: 3}
      propertyPath: m_LocalEulerAnglesHint.y
      value: 0
      objectReference: {fileID: 0}
    - target: {fileID: 8343591786057426001, guid: f09329808afa1674fb677dbe7dfc9142,
        type: 3}
      propertyPath: m_LocalEulerAnglesHint.z
      value: 0
      objectReference: {fileID: 0}
    m_RemovedComponents: []
  m_SourcePrefab: {fileID: 100100000, guid: f09329808afa1674fb677dbe7dfc9142, type: 3}
--- !u!4 &3557037465248901827 stripped
Transform:
  m_CorrespondingSourceObject: {fileID: 8343591786057426001, guid: f09329808afa1674fb677dbe7dfc9142,
    type: 3}
  m_PrefabInstance: {fileID: 4798381166098599570}
  m_PrefabAsset: {fileID: 0}
--- !u!1001 &7487949211024465194
PrefabInstance:
  m_ObjectHideFlags: 0
  serializedVersion: 2
  m_Modification:
    m_TransformParent: {fileID: 1890781679189965907}
    m_Modifications:
    - target: {fileID: 4822639879976932032, guid: f09329808afa1674fb677dbe7dfc9142,
        type: 3}
      propertyPath: enemy
      value: 
      objectReference: {fileID: 3705602519594052203, guid: 660b5166df6b36c41ad544d2afab1531,
        type: 3}
    - target: {fileID: 4822639879976932032, guid: f09329808afa1674fb677dbe7dfc9142,
        type: 3}
      propertyPath: spawnProb
      value: 30
      objectReference: {fileID: 0}
    - target: {fileID: 5441869364026364299, guid: f09329808afa1674fb677dbe7dfc9142,
        type: 3}
      propertyPath: m_Name
      value: CoinSpawner
      objectReference: {fileID: 0}
    - target: {fileID: 8343591786057426001, guid: f09329808afa1674fb677dbe7dfc9142,
        type: 3}
      propertyPath: m_RootOrder
      value: 6
      objectReference: {fileID: 0}
    - target: {fileID: 8343591786057426001, guid: f09329808afa1674fb677dbe7dfc9142,
        type: 3}
      propertyPath: m_LocalPosition.x
      value: -4.12
      objectReference: {fileID: 0}
    - target: {fileID: 8343591786057426001, guid: f09329808afa1674fb677dbe7dfc9142,
        type: 3}
      propertyPath: m_LocalPosition.y
      value: -3.36
      objectReference: {fileID: 0}
    - target: {fileID: 8343591786057426001, guid: f09329808afa1674fb677dbe7dfc9142,
        type: 3}
      propertyPath: m_LocalPosition.z
      value: -0.8768133
      objectReference: {fileID: 0}
    - target: {fileID: 8343591786057426001, guid: f09329808afa1674fb677dbe7dfc9142,
        type: 3}
      propertyPath: m_LocalRotation.w
      value: 1
      objectReference: {fileID: 0}
    - target: {fileID: 8343591786057426001, guid: f09329808afa1674fb677dbe7dfc9142,
        type: 3}
      propertyPath: m_LocalRotation.x
      value: -0
      objectReference: {fileID: 0}
    - target: {fileID: 8343591786057426001, guid: f09329808afa1674fb677dbe7dfc9142,
        type: 3}
      propertyPath: m_LocalRotation.y
      value: -0
      objectReference: {fileID: 0}
    - target: {fileID: 8343591786057426001, guid: f09329808afa1674fb677dbe7dfc9142,
        type: 3}
      propertyPath: m_LocalRotation.z
      value: -0
      objectReference: {fileID: 0}
    - target: {fileID: 8343591786057426001, guid: f09329808afa1674fb677dbe7dfc9142,
        type: 3}
      propertyPath: m_LocalEulerAnglesHint.x
      value: 0
      objectReference: {fileID: 0}
    - target: {fileID: 8343591786057426001, guid: f09329808afa1674fb677dbe7dfc9142,
        type: 3}
      propertyPath: m_LocalEulerAnglesHint.y
      value: 0
      objectReference: {fileID: 0}
    - target: {fileID: 8343591786057426001, guid: f09329808afa1674fb677dbe7dfc9142,
        type: 3}
      propertyPath: m_LocalEulerAnglesHint.z
      value: 0
      objectReference: {fileID: 0}
    m_RemovedComponents: []
  m_SourcePrefab: {fileID: 100100000, guid: f09329808afa1674fb677dbe7dfc9142, type: 3}
--- !u!4 &1450421483684133243 stripped
Transform:
  m_CorrespondingSourceObject: {fileID: 8343591786057426001, guid: f09329808afa1674fb677dbe7dfc9142,
    type: 3}
  m_PrefabInstance: {fileID: 7487949211024465194}
  m_PrefabAsset: {fileID: 0}
