%YAML 1.1
%TAG !u! tag:unity3d.com,2011:
--- !u!114 &11400000
MonoBehaviour:
  m_ObjectHideFlags: 0
  m_CorrespondingSourceObject: {fileID: 0}
  m_PrefabInstance: {fileID: 0}
  m_PrefabAsset: {fileID: 0}
  m_GameObject: {fileID: 0}
  m_Enabled: 1
  m_EditorHideFlags: 0
  m_Script: {fileID: 11500000, guid: 1a8e23ee89a94d342879a227bbb4dae7, type: 3}
  m_Name: 13
  m_EditorClassIdentifier: 
  title: "Ojo de halc\xF3n"
  requirements: Destruye 20 misiles
  achievementType: 3
  requiredValueType: 0
  requiredValue: 20
  reward: 80
  claimable: 0
  claimed: 0
