%YAML 1.1
%TAG !u! tag:unity3d.com,2011:
--- !u!114 &11400000
MonoBehaviour:
  m_ObjectHideFlags: 0
  m_CorrespondingSourceObject: {fileID: 0}
  m_PrefabInstance: {fileID: 0}
  m_PrefabAsset: {fileID: 0}
  m_GameObject: {fileID: 0}
  m_Enabled: 1
  m_EditorHideFlags: 0
  m_Script: {fileID: 11500000, guid: 1a8e23ee89a94d342879a227bbb4dae7, type: 3}
  m_Name: 15
  m_EditorClassIdentifier: 
  title: Daltonico experto
  requirements: Pasa 30 minutos con el estado de daltonico
  achievementType: 4
  requiredValueType: 1
  requiredValue: 1800
  reward: 200
  claimable: 0
  claimed: 0
