1; Román Espejo; 638320614; breuxovoffeyi-9936@yopmail.com; true; true; 
2; Alejo Piñeiro; 656288366; baquezadelau-1095@yopmail.com; true; false; 
3; Emilia Lorena Sala; 739129099; caffinebrusa-4247@yopmail.com; false; false; 
4; Brígida Valcárcel; 729319716; troimmeufrufranna-9001@yopmail.com; true; true; 
5; Clemente Nadal; 737096525; telleuppeubukoi-3199@yopmail.com; true; true; 
6; Trinidad Varela; 617021786; gremoubususseu-8633@yopmail.com; true; false; 
7; Heliodoro Escalona; 634339965; bruppoijoufatti-4053@yopmail.com; false; false; 
8; Mateo Ramirez; 745175924; crileumabrouji-4118@yopmail.com; true; true; 
9; León Guzmán; 701418008; yessauwoumano-2695@yopmail.com; true; false; 
10; Chita Pablo; 668127880; brahibreippauppau-9548@yopmail.com; true; false; 
11; Luisina Santamaria; 665812786; yucrogamotra-2486@yopmail.com; true; false; 
12; Aránzazu Carreras; 768734043; praddoinoprugra-3133@yopmail.com; false; false; 
13; Lisandro Coloma; 716191801; quaqueyammeigrei-5764@yopmail.com; true; true; 
14; Maximiliano Pont; 669220407; duprappulugru-5964@yopmail.com; true; true; 
15; Rosaura Costa; 633235673; lezitibafa-3132@yopmail.com; true; true; 
16; Bernardo Guadalupe; 650857146; tinnotroqueuttau-6384@yopmail.com; false; false; 
17; Evelia Franco; 736549591; cobrucogufra-9123@yopmail.com; true; true; 
18; Anunciación Pilar; 761360503; dellaveusoujo-2911@yopmail.com; true; false; 
19; Renato Ferrándiz; 603284318; vipagrouxottou-1688@yopmail.com; true; false; 
20; Evaristo Matas; 747490652; crumafasseuppau-4387@yopmail.com; true; true; 
21; Aránzazu Julie; 718861273; cretepraupreisse-2909@yopmail.com; true; true; 
22; Lilia Marco; 740833088; brauhugripreutro-7288@yopmail.com; true; true; 
23; Ruperto Porta; 719322613; fraluqueidappi-3883@yopmail.com; true; false; 
24; Teobaldo Graciano; 712470030; zugrippihiyi-2891@yopmail.com; false; false; 
25; Leoncio Diez-Matas; 731287813; frouddaxuquoca-9745@yopmail.com; true; true; 
26; Maxi Toro; 655224636; killayihizeu-1633@yopmail.com; true; true; 
27; Fabiana Diez; 783056302; vayefrecraho-9147@yopmail.com; false; false; 
28; Toni Olivé; 799147516; wommehaunuddoi-3642@yopmail.com; true; true; 
29; Lisandro Pou; 647696392; crizoufrereite-3407@yopmail.com; true; true; 
30; Anselmo Tomé; 643101763; taseuddigozou-7044@yopmail.com; false; false; 
31; Liliana Arce; 785913082; deweuneffeuze-9594@yopmail.com; true; true; 
32; Rosalva Jara; 779693624; pecaullauxaunou-8016@yopmail.com; false; false; 
33; Atilio Izquierdo; 648508516; bremmawimacra-6864@yopmail.com; true; false; 
34; Blas Borrás; 628824334; voummaucodoitteu-1217@yopmail.com; true; false; 
35; Isaías Quesada; 607668103; kefecassiffa-2120@yopmail.com; true; false; 
36; Dafne de Monreal; 759290084; meireikumopu-9337@yopmail.com; true; false; 
37; Isidoro Baró-Zapata; 714302363; reulalluprafa-7052@yopmail.com; true; true; 
38; Inmaculada Lorenzo; 672827874; troisassajaffe-7911@yopmail.com; true; true; 
39; Araceli Castellanos; 704719888; tixijuttaddi-1150@yopmail.com; true; true; 
40; Angélica Castilla; 771943524; wuwottittequo-5643@yopmail.com; true; true; 
41; Kike Oliver-Barragán; 713493771; trassoufeiquehi-5688@yopmail.com; true; true; 
42; Leonel Díaz; 669267014; kedduneuyaquo-1366@yopmail.com; true; false; 
43; Nieves Peralta; 675860422; friprauffennenni-7346@yopmail.com; false; false; 
44; Maura Chaves; 788796997; nesozuhaddei-6384@yopmail.com; false; false; 
