%YAML 1.1
%TAG !u! tag:unity3d.com,2011:
--- !u!1 &7883793352544374584
GameObject:
  m_ObjectHideFlags: 0
  m_CorrespondingSourceObject: {fileID: 0}
  m_PrefabInstance: {fileID: 0}
  m_PrefabAsset: {fileID: 0}
  serializedVersion: 6
  m_Component:
  - component: {fileID: 5902536549109602080}
  - component: {fileID: 4670545738559654967}
  m_Layer: 0
  m_Name: BossZone
  m_TagString: Untagged
  m_Icon: {fileID: 0}
  m_NavMeshLayer: 0
  m_StaticEditorFlags: 0
  m_IsActive: 1
--- !u!4 &5902536549109602080
Transform:
  m_ObjectHideFlags: 0
  m_CorrespondingSourceObject: {fileID: 0}
  m_PrefabInstance: {fileID: 0}
  m_PrefabAsset: {fileID: 0}
  m_GameObject: {fileID: 7883793352544374584}
  m_LocalRotation: {x: 0, y: 0, z: 0, w: 1}
  m_LocalPosition: {x: 15.583895, y: 1.4750813, z: -190.8051}
  m_LocalScale: {x: 1, y: 1, z: 1}
  m_Children: []
  m_Father: {fileID: 0}
  m_RootOrder: 0
  m_LocalEulerAnglesHint: {x: 0, y: 0, z: 0}
--- !u!114 &4670545738559654967
MonoBehaviour:
  m_ObjectHideFlags: 0
  m_CorrespondingSourceObject: {fileID: 0}
  m_PrefabInstance: {fileID: 0}
  m_PrefabAsset: {fileID: 0}
  m_GameObject: {fileID: 7883793352544374584}
  m_Enabled: 1
  m_EditorHideFlags: 0
  m_Script: {fileID: 11500000, guid: 6fdcba2d4519a6043a2f7cddcedb01af, type: 3}
  m_Name: 
  m_EditorClassIdentifier: 
  MetresInici: 1000
  PlataformaBase: {fileID: 6254208902450830624, guid: b317cd1cfdf546a4fb49f29008874b86,
    type: 3}
  ProbabilitatForat: 0
  MinForat: 0
  MaxForat: 0
