%YAML 1.1
%TAG !u! tag:unity3d.com,2011:
--- !u!1 &5254908589561146304
GameObject:
  m_ObjectHideFlags: 0
  m_CorrespondingSourceObject: {fileID: 0}
  m_PrefabInstance: {fileID: 0}
  m_PrefabAsset: {fileID: 0}
  serializedVersion: 6
  m_Component:
  - component: {fileID: 5254908589561146335}
  - component: {fileID: 5254908589561146334}
  m_Layer: 0
  m_Name: ZonaPredefinida1
  m_TagString: Untagged
  m_Icon: {fileID: 0}
  m_NavMeshLayer: 0
  m_StaticEditorFlags: 0
  m_IsActive: 1
--- !u!4 &5254908589561146335
Transform:
  m_ObjectHideFlags: 0
  m_CorrespondingSourceObject: {fileID: 0}
  m_PrefabInstance: {fileID: 0}
  m_PrefabAsset: {fileID: 0}
  m_GameObject: {fileID: 5254908589561146304}
  m_LocalRotation: {x: 0, y: 0, z: 0, w: 1}
  m_LocalPosition: {x: 0, y: 0, z: 0}
  m_LocalScale: {x: 1, y: 1, z: 1}
  m_Children: []
  m_Father: {fileID: 0}
  m_RootOrder: 0
  m_LocalEulerAnglesHint: {x: 0, y: 0, z: 0}
--- !u!114 &5254908589561146334
MonoBehaviour:
  m_ObjectHideFlags: 0
  m_CorrespondingSourceObject: {fileID: 0}
  m_PrefabInstance: {fileID: 0}
  m_PrefabAsset: {fileID: 0}
  m_GameObject: {fileID: 5254908589561146304}
  m_Enabled: 1
  m_EditorHideFlags: 0
  m_Script: {fileID: 11500000, guid: 6a914836463100545922843aac11caab, type: 3}
  m_Name: 
  m_EditorClassIdentifier: 
  MetresInici: 0
  CamiBase:
  - {fileID: 5494837956459343580, guid: c47559c5ae204f640be833dbc2616646, type: 3}
  - {fileID: 2571159150064086068, guid: e57ab3566f728f64bbf9156c4c28f5e4, type: 3}
  - {fileID: 6585655278310459134, guid: 0b328cfa5a416bc41a659e03196e3d78, type: 3}
  - {fileID: 2571159150064086068, guid: e57ab3566f728f64bbf9156c4c28f5e4, type: 3}
