%YAML 1.1
%TAG !u! tag:unity3d.com,2011:
--- !u!114 &11400000
MonoBehaviour:
  m_ObjectHideFlags: 0
  m_CorrespondingSourceObject: {fileID: 0}
  m_PrefabInstance: {fileID: 0}
  m_PrefabAsset: {fileID: 0}
  m_GameObject: {fileID: 0}
  m_Enabled: 1
  m_EditorHideFlags: 0
  m_Script: {fileID: 11500000, guid: 118a4c34a365f5b49a0f25a1f5b0aeba, type: 3}
  m_Name: MaxShots
  m_EditorClassIdentifier: 
  Name: Max. Shots
  Level1Count: 100
  Level2Count: 250
  Level3Count: 500
