%YAML 1.1
%TAG !u! tag:unity3d.com,2011:
--- !u!1 &1086205282039483617
GameObject:
  m_ObjectHideFlags: 0
  m_CorrespondingSourceObject: {fileID: 0}
  m_PrefabInstance: {fileID: 0}
  m_PrefabAsset: {fileID: 0}
  serializedVersion: 6
  m_Component:
  - component: {fileID: 6105678627596059798}
  - component: {fileID: 6254208902450830624}
  m_Layer: 0
  m_Name: BossPlatforms
  m_TagString: Untagged
  m_Icon: {fileID: 0}
  m_NavMeshLayer: 0
  m_StaticEditorFlags: 0
  m_IsActive: 1
--- !u!4 &6105678627596059798
Transform:
  m_ObjectHideFlags: 0
  m_CorrespondingSourceObject: {fileID: 0}
  m_PrefabInstance: {fileID: 0}
  m_PrefabAsset: {fileID: 0}
  m_GameObject: {fileID: 1086205282039483617}
  m_LocalRotation: {x: 0, y: 0, z: 0, w: 1}
  m_LocalPosition: {x: 15.583895, y: 1.4750813, z: -190.8051}
  m_LocalScale: {x: 1, y: 1, z: 1}
  m_Children: []
  m_Father: {fileID: 0}
  m_RootOrder: 0
  m_LocalEulerAnglesHint: {x: 0, y: 0, z: 0}
--- !u!114 &6254208902450830624
MonoBehaviour:
  m_ObjectHideFlags: 0
  m_CorrespondingSourceObject: {fileID: 0}
  m_PrefabInstance: {fileID: 0}
  m_PrefabAsset: {fileID: 0}
  m_GameObject: {fileID: 1086205282039483617}
  m_Enabled: 1
  m_EditorHideFlags: 0
  m_Script: {fileID: 11500000, guid: d51b82a4020346c479bbcc9d6589ced8, type: 3}
  m_Name: 
  m_EditorClassIdentifier: 
  tipus1: 0
  tipus2: 0
  MinAltura: 3
  MaxAltura: 3
  MinAmplada: 10
  MaxAmplada: 20
  TopLeft: {fileID: 8267937876495931533, guid: 6802281e5eb66d34382ca71c907202d6, type: 3}
  Top: {fileID: 4224351844971473992, guid: d1104796f70950249b23b703741e7f2d, type: 3}
  TopRight: {fileID: 6778615373713379244, guid: 668f12960e0100441a100655e1d950af,
    type: 3}
  Left: {fileID: 2857404368722433487, guid: cc789f9f697150649acd663c91e0aeda, type: 3}
  Center: {fileID: 5312361799279693240, guid: e7f23bfafac040c48b318740e9aeceaa, type: 3}
  Right: {fileID: 7230319309496221533, guid: a0fca78d0b969ce46893c542eb202d5d, type: 3}
  BottomLeft: {fileID: 0}
  Bottom: {fileID: 0}
  BottomRight: {fileID: 0}
  MinCanviAlturaAmunt: 0
  MaxCanviAlturaAmunt: 1
  MinCanviAlturaAvall: 0
  MaxCanviAlturaAvall: 5
  MinDifAlturaABase: 0
  MaxDifAlturaABase: 0
