%YAML 1.1
%TAG !u! tag:unity3d.com,2011:
--- !u!78 &1
TagManager:
  serializedVersion: 2
  tags:
  - Platform
  - DeathLimit
  - Enemy
  - Bullet
  - BorderBullets
  - Coin
  - BadCoin
  - Heart
  - Boss
  - AICollider
  - EnemyBullet
  - Glasses
  - BananaPack
  - HealthBossUI
  - BoostBullet
  - EnemyBird
  layers:
  - Default
  - TransparentFX
  - Ignore Raycast
  - 
  - Water
  - UI
  - 
  - 
  - 
  - 
  - 
  - 
  - 
  - 
  - 
  - 
  - 
  - 
  - 
  - 
  - 
  - 
  - 
  - 
  - 
  - 
  - 
  - 
  - 
  - 
  - 
  - 
  m_SortingLayers:
  - name: Default
    uniqueID: 0
    locked: 0
