%YAML 1.1
%TAG !u! tag:unity3d.com,2011:
--- !u!114 &11400000
MonoBehaviour:
  m_ObjectHideFlags: 0
  m_CorrespondingSourceObject: {fileID: 0}
  m_PrefabInstance: {fileID: 0}
  m_PrefabAsset: {fileID: 0}
  m_GameObject: {fileID: 0}
  m_Enabled: 1
  m_EditorHideFlags: 0
  m_Script: {fileID: 11500000, guid: bce2630e63eac03489e52a8b682e354d, type: 3}
  m_Name: MultiBullet
  m_EditorClassIdentifier: 
  Name: Multi Bullet
  Description: Increase effect time by
  Count: 03000000040000000500000007000000
  Cost: 140000003200000064000000
