Граськов Виктор Иванович,30-11-2000
Гридюшко Анна Анатольевна,4-12-2000
Гришкин Андрей Иванович,12-12-2000
Гузей Илья Александрович,19-7-2001
Жуковский Павел Сергеевич,3-4-2001
Кацуба Анастасия Владимировна,13-11-2000
Короткевич Константин Андреевич,4-8-2000
Лебедев Даниил Петрович,27-3-2001
Левоцкий Глеб Сергеевич,3-10-2000
Малявко Александра Витальевна,25-11-2000
Мандик Тимофей Сергеевич,12-10-2000
Мойсейчик Елизавета Сергеевна,24-10-1999
Плеско Виктор Анатольевич,7-2-2001
Погудо Николай Владимирович,24-1-2001
Салей Илья Игоревич,10-5-2001
Сецко Кирилл Станиславович,22-6-2000
Солодуха Дмитрий Владимирович,9-3-2001
Тарасенко Дмитрий Алексеевич,20-10-2000
Шилкин Егор Георгиевич,22-11-2000
