Абилова Эвелина Эльчиновна,10-04-2002
Баженов Евгений Павлович,19-12-2001
Богдан Вадим Андреевич,18-10-2002
Борсуков Арсений Алексеевич,17-06-2002
Варфоломеев Алексей Сергеевич,04-07-2002
Гиро Елизавета Олеговна,14-11-2001
Гордей Павел Дмитриевич,12-06-2002
Горшков Даниил Сергеевич,23-08-2002
Жук Евгений Владимирович,22-01-2002
Кацнельсон Матвей Александрович,07-13-2002
Колосовский Роман Евгеньевич,25-06-2002
Красовская Оля,27-09-2000
Курилович Дарья Олеговна,05-12-2001
Курьянович Валерий Александрович,26-01-2001
Мазур Владислав Сергеевич,15-05-2001
Мироевский Алексей Александрович,29-06-2001
Невар Максим Александрович,04-03-2002
Пархоменко Владимир Александрович,25-09-2001
Петров Андрей Александрович,08-07-1999
Протасеня Дмитрий Олегович,18-06-2002
Ракоть Валентин Викторович,01-07-2002
Скридлевский Алексей Александрович,08-06-2002
Филон Анна Юрьевна,30-07-2002
Щербенок Андрей Николаевич,14-12-2001
Януш Герман Сергеевич,12-06-2001
Ясинецкий Алексей Вячеславович,19-07-2002
Яхимович Егор Александрович,10-06-2002