[gd_scene load_steps=5 format=2]

[ext_resource path="res://Images/lava.png" type="Texture" id=1]
[ext_resource path="res://Fire.cs" type="Script" id=2]

[sub_resource type="RectangleShape2D" id=1]
extents = Vector2( 300.339, 208.981 )

[sub_resource type="RectangleShape2D" id=2]
extents = Vector2( 289.759, 194.992 )

[node name="HotPlatform" type="StaticBody2D"]

[node name="HotArea" type="Area2D" parent="."]
script = ExtResource( 2 )

[node name="CollisionShape2D" type="CollisionShape2D" parent="HotArea"]
position = Vector2( -1, 11 )
shape = SubResource( 1 )

[node name="Sprite" type="Sprite" parent="."]
texture = ExtResource( 1 )

[node name="CollisionShape2D" type="CollisionShape2D" parent="."]
position = Vector2( -0.360535, 12.3907 )
shape = SubResource( 2 )
[connection signal="body_entered" from="HotArea" to="HotArea" method="OnBodyEntered"]
[connection signal="body_exited" from="HotArea" to="HotArea" method="OnBodyExited"]
