[gd_scene load_steps=2 format=2]

[sub_resource type="ParticlesMaterial" id=1]
emission_shape = 1
emission_sphere_radius = 8.97
flag_disable_z = true
direction = Vector3( 0, 0, 0 )
spread = 180.0
gravity = Vector3( 0, 0, 0 )
initial_velocity = 170.0
orbit_velocity = 0.0
orbit_velocity_random = 0.0

[node name="SpawnParticles" type="Particles2D"]
emitting = false
amount = 256
one_shot = true
process_material = SubResource( 1 )
