total 104
drwxr-x--- 8 yanush13 yanush13 4096 Sep 14 14:38 .
drwxr-xr-x 3 root     root     4096 Sep  3 09:04 ..
-rw------- 1 yanush13 yanush13 6925 Sep 14 14:38 .bash_history
-rw-r--r-- 1 yanush13 yanush13  220 Mar 19 16:02 .bash_logout
-rw-r--r-- 1 yanush13 yanush13 3771 Mar 19 16:02 .bashrc
drwx------ 2 yanush13 yanush13 4096 Sep  3 09:04 .cache
drwx------ 3 yanush13 yanush13 4096 Sep  5 16:03 .config
drwxrwxr-x 2 yanush13 yanush13 4096 Sep 14 14:38 examples
-rw-rw-r-- 1 yanush13 yanush13   53 Sep 14 14:27 .gitconfig
drwxrwxr-x 5 yanush13 yanush13 4096 Sep 14 14:26 labrabota2gruppa13-jiffygist
-rw------- 1 yanush13 yanush13   79 Sep 14 14:18 .lesshst
drwxrwxr-x 3 yanush13 yanush13 4096 Sep  5 16:06 .local
-rw-rw-r-- 1 yanush13 yanush13  119 Sep 14 14:21 packages1.catfile
-rw-rw-r-- 1 yanush13 yanush13   64 Sep 14 14:24 packages1.trfile
-rw-rw-r-- 1 yanush13 yanush13   64 Sep 14 14:20 packages1.txt
-rw-rw-r-- 1 yanush13 yanush13   55 Sep 14 14:20 packages2.txt
-rw-r--r-- 1 yanush13 yanush13  807 Mar 19 16:02 .profile
drwx------ 2 yanush13 yanush13 4096 Sep  5 09:48 .ssh
-rwxrwxr-x 1 yanush13 yanush13   56 Sep 14 14:18 startlog.sh
-rw-r--r-- 1 yanush13 yanush13    0 Sep  3 09:38 .sudo_as_admin_successful
-rw-rw-r-- 1 yanush13 yanush13 3228 Sep 14 14:25 task1Yanush13u
-rw-rw-r-- 1 yanush13 yanush13    0 Sep 14 14:38 task2Yanush13u
-rw-rw-r-- 1 yanush13 yanush13 7852 Sep 14 14:25 timelog1Yanush13u
-rw-rw-r-- 1 yanush13 yanush13    0 Sep 14 14:38 timelog2Yanush13u
-rw-rw-r-- 1 yanush13 yanush13  160 Sep 14 14:23 trfile.txt
-rw------- 1 yanush13 yanush13 7638 Sep 14 14:18 .viminfo
