,Gene count
nucleus,165
integral component of membrane,137
molecular_function,118
biological_process,107
plasma membrane,101
protein binding,90
chloroplast,88
cytosol,88
extracellular region,79
cytoplasm,77
mitochondrion,74
plasmodesma,40
metal ion binding,37
membrane,36
endoplasmic reticulum,36
Golgi apparatus,36
DNA-binding transcription factor activity,30
mRNA binding,29
"regulation of transcription, DNA-templated",29
cellular_component,27
vacuole,26
cell wall,23
ATP binding,23
response to abscisic acid,18
vacuolar membrane,18
plant-type cell wall,17
plastid,17
chloroplast envelope,17
transmembrane transport,17
DNA binding,16
chloroplast stroma,15
endoplasmic reticulum membrane,15
apoplast,15
defense response,14
trans-Golgi network,14
cell wall organization,14
sequence-specific DNA binding,13
oxidation-reduction process,12
protein ubiquitination,11
copper ion binding,10
multicellular organism development,10
structural constituent of ribosome,10
ATPase activity,10
chloroplast thylakoid membrane,10
zinc ion binding,10
nucleolus,10
endosome,10
response to light stimulus,10
secretory vesicle,9
lipid binding,9
unidimensional cell growth,9
"transferase activity, transferring glycosyl groups",9
embryo development ending in seed dormancy,9
response to water deprivation,9
transcription regulatory region sequence-specific DNA binding,9
response to cold,9
oxidoreductase activity,9
RNA binding,9
kinase activity,8
vesicle-mediated transport,8
lipid catabolic process,8
response to salt stress,8
ethylene-activated signaling pathway,8
chloroplast thylakoid,8
carbohydrate metabolic process,8
anchored component of plasma membrane,8
cellular response to hypoxia,8
response to cadmium ion,8
auxin-activated signaling pathway,7
cytosolic large ribosomal subunit,7
cytosolic ribosome,7
protein phosphorylation,7
lipid transport,7
heme binding,7
cuticle development,7
Golgi membrane,7
hydrolase activity,7
response to karrikin,7
plant-type secondary cell wall biogenesis,7
thylakoid,7
defense response to fungus,7
transmembrane transporter activity,7
transferase activity,6
root development,6
water channel activity,6
leaf senescence,6
cell differentiation,6
"oxidoreductase activity, acting on the CH-OH group of donors, NAD or NADP as acceptor",6
plastoglobule,6
ATPase-coupled transmembrane transporter activity,6
calcium ion binding,6
leaf morphogenesis,6
lignin biosynthetic process,6
translation,6
iron ion binding,5
protein serine/threonine kinase activity,5
response to chitin,5
wax biosynthetic process,5
anchored component of membrane,5
intracellular anatomical structure,5
defense response to bacterium,5
carbohydrate binding,5
protein kinase activity,5
brassinosteroid mediated signaling pathway,5
ubiquitin-dependent protein catabolic process,5
endosome membrane,5
"transferase activity, transferring acyl groups other than amino-acyl groups",5
"DNA-binding transcription factor activity, RNA polymerase II-specific",5
protein homodimerization activity,4
3-oxo-cerotoyl-CoA synthase activity,4
nuclear envelope,4
flower development,4
very long-chain fatty acid biosynthetic process,4
response to osmotic stress,4
response to auxin,4
"hydrolase activity, acting on ester bonds",4
3-oxo-arachidoyl-CoA synthase activity,4
peroxisome,4
protein domain specific binding,4
"negative regulation of transcription, DNA-templated",4
plant-type vacuole membrane,4
3-oxo-lignoceronyl-CoA synthase activity,4
protein self-association,4
innate immune response,4
cutin biosynthetic process,4
fatty acid biosynthetic process,4
very-long-chain 3-ketoacyl-CoA synthase activity,4
water transport,4
calmodulin binding,4
Golgi medial cisterna,4
protein-chromophore linkage,4
response to gibberellin,3
seed germination,3
regulation of seed germination,3
response to far red light,3
cytoskeleton,3
metal ion transport,3
phospholipase activity,3
nucleic acid binding,3
response to oxidative stress,3
single-stranded DNA binding,3
response to desiccation,3
fatty acid metabolic process,3
response to ethylene,3
lipase activity,3
cellulose biosynthetic process,3
monooxygenase activity,3
plant-type vacuole,3
plant-type cell wall organization,3
plant-type cell wall loosening,3
lipid metabolic process,3
microtubule binding,3
methyltransferase activity,3
methylation,3
RNA polymerase II cis-regulatory region sequence-specific DNA binding,3
ubiquitin protein ligase activity,3
extracellular space,3
ubiquitin-protein transferase activity,3
vesicle,3
"positive regulation of transcription, DNA-templated",3
catalytic activity,3
regulation of transcription by RNA polymerase II,3
plant-type cell wall modification,3
"photosynthesis, light harvesting in photosystem I",3
cytoplasmic translation,3
nutrient reservoir activity,3
identical protein binding,3
abscisic acid-activated signaling pathway,3
chloroplast inner membrane,3
adaxial/abaxial pattern specification,3
chloroplast organization,3
response to stress,3
root hair cell tip growth,3
circadian rhythm,3
endoplasmic reticulum to Golgi vesicle-mediated transport,3
efflux transmembrane transporter activity,3
proton transmembrane transport,3
cell division,3
pollen germination,3
Golgi trans cisterna,3
posttranscriptional gene silencing,3
pectin catabolic process,3
"oxidoreductase activity, acting on paired donors, with incorporation or reduction of molecular oxygen",3
serine-type endopeptidase activity,3
hydrogen peroxide transmembrane transport,3
"4 iron, 4 sulfur cluster binding",3
chlorophyll binding,3
cell wall thickening,3
leaf development,3
ribosome,3
protein transport,3
signal transduction,3
photosystem II,3
photosystem I,3
"transferase activity, transferring acyl groups",2
cell plate,2
syncytium formation,2
very long-chain fatty acid metabolic process,2
cellular response to cold,2
prephenate dehydratase activity,2
cellular amino acid metabolic process,2
arogenate dehydratase activity,2
glucosinolate catabolic process,2
"proton-transporting V-type ATPase, V0 domain",2
proton transmembrane transporter activity,2
"proton-transporting ATPase activity, rotational mechanism",2
lyase activity,2
"hydrolase activity, hydrolyzing O-glycosyl compounds",2
regulation of circadian rhythm,2
Cul4-RING E3 ubiquitin ligase complex,2
mRNA transport,2
nuclear pore,2
response to UV-B,2
protein import into nucleus,2
galactolipase activity,2
pentose-phosphate shunt,2
endoribonuclease activity,2
regulation of salicylic acid metabolic process,2
"glucan endo-1,3-beta-D-glucosidase activity",2
fatty acid elongation,2
systemic acquired resistance,2
"positive regulation of development, heterochronic",2
abscisic acid biosynthetic process,2
protein serine/threonine kinase activator activity,2
cotyledon development,2
intracellular signal transduction,2
plant epidermal cell differentiation,2
regulation of seed dormancy process,2
aspartyl esterase activity,2
cell wall modification,2
defense response to Gram-negative bacterium,2
pectinesterase activity,2
pectinesterase inhibitor activity,2
8-oxo-dGTP phosphohydrolase activity,2
GTP phosphohydrolase activity,2
dATP phosphohydrolase activity,2
dCTP phosphohydrolase activity,2
dGTP phosphohydrolase activity,2
dTTP phosphohydrolase activity,2
dUTP phosphohydrolase activity,2
nucleoside-diphosphatase activity,2
phosphatidylcholine metabolic process,2
UDP-glucuronate 4-epimerase activity,2
Golgi cisterna membrane,2
positive regulation of abscisic acid-activated signaling pathway,2
leaf vascular tissue pattern formation,2
sterol binding,2
gravitropism,2
glycolytic process,2
response to cytokinin,2
response to heat,2
chloroplast membrane,2
enzyme regulator activity,2
thylakoid membrane organization,2
mitochondrial membrane,2
flavonoid biosynthetic process,2
triglyceride lipase activity,2
response to glucose,2
"fructose 1,6-bisphosphate metabolic process",2
fructose-bisphosphate aldolase activity,2
gluconeogenesis,2
protein import into mitochondrial matrix,2
root hair elongation,2
NAD binding,2
protein serine/threonine/tyrosine kinase activity,2
phloem development,2
fatty acid elongase activity,2
endocytosis,2
regulation of defense response,2
guanyl-nucleotide exchange factor activity,2
root hair cell development,2
electron transfer activity,2
phospholipase A1 activity,2
cortical microtubule organization,2
plastid nucleoid,2
L-phenylalanine biosynthetic process,2
cinnamyl-alcohol dehydrogenase activity,2
vegetative to reproductive phase transition of meristem,2
structural constituent of cell wall,2
quercetin 3-O-glucosyltransferase activity,2
photosystem II oxygen evolving complex,2
photosynthesis,2
extrinsic component of membrane,2
double-stranded DNA binding,2
cold acclimation,2
DNA duplex unwinding,2
"mitochondrial electron transport, succinate to ubiquinone",2
acylglycerol lipase activity,2
respiratory chain complex II,2
calcium-mediated signaling,2
GTPase activity,2
GTP binding,2
aspartic-type endopeptidase activity,2
salicylic acid mediated signaling pathway,2
xenobiotic transmembrane transporter activity,2
pollen development,2
positive regulation of seed germination,2
quercetin 7-O-glucosyltransferase activity,2
intracellular protein transport,2
auxin efflux,2
translational elongation,2
"oxidoreductase activity, acting on the CH-CH group of donors",2
regulation of root development,2
cellulose synthase (UDP-forming) activity,2
defense response to virus,2
proteasome complex,2
"mitochondrial respiratory chain complex II, succinate dehydrogenase complex (ubiquinone)",2
antiporter activity,2
export from cell,2
phosphatase activity,2
mitochondrial inner membrane,2
cellulose synthase activity,2
microtubule,2
plant-type primary cell wall biogenesis,2
succinate dehydrogenase activity,2
manganese ion binding,2
tricarboxylic acid cycle,2
extracellular matrix,2
rRNA binding,2
root morphogenesis,2
alkane 1-monooxygenase activity,2
FAD binding,2
phragmoplast,2
auxin homeostasis,2
ubiquitin protein ligase binding,2
regulation of secondary cell wall biogenesis,2
lignin catabolic process,2
flavin adenine dinucleotide binding,2
tracheary element differentiation,2
hydroquinone:oxygen oxidoreductase activity,2
spliceosomal complex,2
serine-type carboxypeptidase activity,2
"mRNA splicing, via spliceosome",2
lipid transporter activity,2
negative regulation of flower development,2
transcription regulator activity,2
mucilage pectin metabolic process,2
sinapyl alcohol dehydrogenase activity,2
cell cycle,2
protein phosphorylated amino acid binding,2
aromatase activity,2
intracellular membrane-bounded organelle,2
channel activity,2
glycerol-3-phosphate 2-O-acyltransferase activity,2
peroxidase activity,2
jasmonic acid mediated signaling pathway,2
hydrogen peroxide catabolic process,2
negative regulation of growth,2
phosphoprotein phosphatase activity,2
cellular response to sulfate starvation,2
chloroplast thylakoid lumen,2
response to brassinosteroid,2
response to blue light,2
SCF ubiquitin ligase complex,2
regulation of reactive oxygen species metabolic process,2
suberin biosynthetic process,2
protein dimerization activity,2
negative regulation of seed germination,2
oligopeptide transport,2
calcium:proton antiporter activity,1
coenzyme A metabolic process,1
calcium:sodium antiporter activity,1
hydroxymethylglutaryl-CoA reductase (NADPH) activity,1
large ribosomal subunit rRNA binding,1
large ribosomal subunit,1
sequence-specific double-stranded DNA binding,1
cellular calcium ion homeostasis,1
plant ovule development,1
regulation of protein import into nucleus,1
cellular response to abscisic acid stimulus,1
regulation of gene expression,1
chloroplast outer membrane,1
actin binding,1
petal morphogenesis,1
carboxylic ester hydrolase activity,1
pectin acetylesterase activity,1
aldose 1-epimerase activity,1
galactose catabolic process via UDP-galactose,1
glucose metabolic process,1
microgametogenesis,1
cellular response to salt stress,1
regulation of shoot system development,1
regulation of secondary shoot formation,1
"isopentenyl diphosphate biosynthetic process, mevalonate pathway",1
hexose metabolic process,1
cotyledon morphogenesis,1
DNA-binding transcription activator activity,1
acetylglucosaminyltransferase activity,1
nucleoid organization,1
chloroplast fission,1
"oxidoreductase activity, acting on CH-OH group of donors",1
photosystem II assembly,1
hydroxymethylglutaryl-CoA reductase activity,1
mitochondrial intermembrane space,1
isoprenoid biosynthetic process,1
chaperone-mediated protein folding,1
"posttranslational protein targeting to membrane, translocation",1
protein N-linked glycosylation,1
shoot system development,1
xylosyltransferase activity,1
lateral root development,1
positive regulation of cutin biosynthetic process,1
vitamin B6 catabolic process,1
positive regulation of response to water deprivation,1
regulation of abscisic acid biosynthetic process,1
regulation of plasma membrane sterol distribution,1
intracellular sterol transport,1
transpiration,1
'de novo' cotranslational protein folding,1
cortical endoplasmic reticulum,1
peptidyl-serine phosphorylation,1
calcium ion transmembrane transport,1
peptidyl-prolyl cis-trans isomerase activity,1
"long-day photoperiodism, flowering",1
protein folding chaperone,1
protein unfolding,1
ribosome binding,1
histone H2A phosphorylation,1
uridine-diphosphatase activity,1
nucleoside diphosphate catabolic process,1
guanosine-diphosphatase activity,1
nucleoside diphosphate phosphorylation,1
nucleoside diphosphate kinase activity,1
CTP biosynthetic process,1
GTP biosynthetic process,1
UTP biosynthetic process,1
glycoprotein 2-beta-D-xylosyltransferase activity,1
UDP-xylosyltransferase activity,1
regulation of organ growth,1
sphingolipid metabolic process,1
calcium ion homeostasis,1
peroxisomal membrane,1
sterol biosynthetic process,1
"induced systemic resistance, jasmonic acid mediated signaling pathway",1
xylem development,1
negative regulation of ethylene-activated signaling pathway,1
nuclear body,1
translation initiation factor activity,1
"pyrophosphate-dependent phosphofructokinase complex, alpha-subunit complex",1
phosphofructokinase activity,1
diphosphate-fructose-6-phosphate 1-phosphotransferase activity,1
6-phosphofructokinase activity,1
rhamnogalacturonan I side chain metabolic process,1
plant-type cell wall biogenesis,1
cellulose synthase complex,1
viral process,1
zinc ion transmembrane transport,1
siRNA binding,1
regulation of translation,1
miRNA binding,1
late endosome,1
late endosome membrane,1
leaf proximal/distal pattern formation,1
negative regulation of defense response,1
gene silencing by miRNA,1
auxin metabolic process,1
adventitious root development,1
RNAi-mediated antiviral immune response,1
sterol metabolic process,1
mitochondrial outer membrane translocase complex,1
metalloendopeptidase activity,1
protein storage vacuole,1
sucrose catabolic process,1
actin filament binding,1
actin filament depolymerization,1
phospholipid transfer to membrane,1
programmed cell death,1
regulation of cutin biosynthetic process,1
beta-fructofuranosidase activity,1
glycopeptide alpha-N-acetylgalactosaminidase activity,1
response to hydrogen peroxide,1
sucrose alpha-glucosidase activity,1
cellular response to potassium ion,1
unfolded protein binding,1
regulation of potassium ion transport,1
serine-type peptidase activity,1
negative regulation of endopeptidase activity,1
serine-type endopeptidase inhibitor activity,1
L-alanine transmembrane transporter activity,1
L-glutamate transmembrane transporter activity,1
L-lysine transmembrane transporter activity,1
arginine transmembrane transporter activity,1
gamma-aminobutyric acid transmembrane transporter activity,1
actin cytoskeleton,1
protein heterodimerization activity,1
coniferyl-alcohol glucosyltransferase activity,1
ubiquinone biosynthetic process,1
cGMP binding,1
lignin metabolic process,1
pollen tube,1
pollen tube growth,1
voltage-gated potassium channel activity,1
N-acyltransferase activity,1
cellular oxidant detoxification,1
"2-phytyl-1,4-naphthoquinone methyltransferase activity",1
phylloquinone biosynthetic process,1
detoxification of nitrogen compound,1
protein folding,1
indole-3-acetonitrile nitrilase activity,1
indole-3-acetonitrile nitrile hydratase activity,1
nitrilase activity,1
nitrile hydratase activity,1
histone binding,1
regulation of double-strand break repair,1
"PAM complex, Tim23 associated import motor",1
adenyl-nucleotide exchange factor activity,1
chaperone binding,1
gamma-aminobutyric acid transport,1
glyceraldehyde-3-phosphate dehydrogenase (NAD+) (non-phosphorylating) activity,1
exocytosis,1
negative regulation of endocytosis,1
peptidyl-threonine dephosphorylation,1
P-P-bond-hydrolysis-driven protein transmembrane transporter activity,1
clathrin binding,1
clathrin coat disassembly,1
phenylpropanoid biosynthetic process,1
clathrin-dependent endocytosis,1
cytoplasmic vesicle,1
negative regulation of clathrin-dependent endocytosis,1
ferulate 5-hydroxylase activity,1
sterol transporter activity,1
vesicle budding from membrane,1
receptor-mediated endocytosis,1
acyl-[acyl-carrier-protein] hydrolase activity,1
cellular response to boron-containing substance deprivation,1
cellular response to phosphate starvation,1
ferredoxin-thioredoxin reductase activity,1
anaerobic respiration,1
"oxidoreductase activity, acting on iron-sulfur proteins as donors",1
"DNA-templated transcription, termination",1
collagen catabolic process,1
cellular response to light stimulus,1
structural molecule activity,1
cellular aldehyde metabolic process,1
intercellular transport,1
peptide binding,1
UDP-glycosyltransferase activity,1
glucuronosyltransferase activity,1
negative regulation of DNA-binding transcription factor activity,1
aldehyde dehydrogenase (NAD+) activity,1
positive regulation of circadian rhythm,1
rhythmic process,1
abscisic acid transport,1
glycoside transport,1
negative regulation of post-embryonic development,1
protein targeting,1
pollen coat,1
pollen wall assembly,1
NAD(P)H dehydrogenase complex (plastoquinone),1
3-chloroallyl aldehyde dehydrogenase activity,1
photosynthetic electron transport in photosystem I,1
plasmodesmata-mediated intercellular transport,1
COPII vesicle coat,1
COPII-coated vesicle budding,1
nuclear pore outer ring,1
cAMP binding,1
early endosome,1
protein storage vacuole membrane,1
fatty acid binding,1
ER body,1
sterol transport,1
D-ribose catabolic process,1
chloroplast nucleoid,1
nucleoside metabolic process,1
ribokinase activity,1
starch biosynthetic process,1
male meiosis II,1
microsporogenesis,1
"systemic acquired resistance, salicylic acid mediated signaling pathway",1
secondary shoot formation,1
maintenance of seed dormancy,1
proanthocyanidin biosynthetic process,1
solute:proton antiporter activity,1
TRAPP complex,1
TRAPPII protein complex,1
extracellular matrix organization,1
cis-Golgi network,1
pollen tube development,1
regulation of GTPase activity,1
choline kinase activity,1
pyrophosphate hydrolysis-driven proton transmembrane transporter activity,1
pyridoxine:NADP 4-dehydrogenase activity,1
response to high light intensity,1
protein targeting to vacuole,1
minor groove of adenine-thymine-rich DNA binding,1
defense response to oomycetes,1
transmembrane receptor protein serine/threonine kinase activity,1
disordered domain specific binding,1
protein heterotrimerization,1
protein import into chloroplast thylakoid membrane,1
protein-containing complex,1
protein-macromolecule adaptor activity,1
"signal recognition particle, chloroplast targeting",1
inorganic diphosphatase activity,1
"signal recognition particle, endoplasmic reticulum targeting",1
shade avoidance,1
polyubiquitin modification-dependent protein binding,1
ligase activity,1
vacuolar lumen,1
vacuolar transport,1
response to copper ion,1
cell communication,1
Golgi cis cisterna,1
GTPase activator activity,1
pyridoxal biosynthetic process,1
pollen maturation,1
structural constituent of nuclear pore,1
cytokinin-activated signaling pathway,1
L-serine biosynthetic process,1
phosphoglycerate dehydrogenase activity,1
RNA export from nucleus,1
nuclear pore inner ring,1
nucleocytoplasmic transport,1
protein localization to nuclear inner membrane,1
coniferyl-alcohol dehydrogenase activity,1
response to toxic substance,1
transcription-dependent tethering of RNA polymerase II gene DNA at nuclear periphery,1
acropetal auxin transport,1
protein kinase activator activity,1
ribonucleoprotein complex binding,1
RNA processing,1
mRNA 3'-end processing,1
post-transcriptional gene silencing by RNA,1
cell cortex,1
mitochondrial fission,1
mitochondrion organization,1
organelle fission,1
basipetal auxin transport,1
polygalacturonase activity,1
N-acylphosphatidylethanolamine-specific phospholipase D activity,1
one-carbon metabolic process,1
clathrin-coated vesicle,1
leaf shaping,1
"phosphatidylinositol-4,5-bisphosphate binding",1
phospholipase D activity,1
phospholipid catabolic process,1
regulation of stomatal movement,1
'de novo' IMP biosynthetic process,1
formyltetrahydrofolate deformylase activity,1
"hydroxymethyl-, formyl- and related transferase activity",1
photorespiration,1
photoreceptor activity,1
pyridoxal 5'-phosphate salvage,1
tetrahydrofolate metabolic process,1
NADPH binding,1
Cdc73/Paf1 complex,1
histone H3-K36 methylation,1
polar nucleus fusion,1
histone H3-K4 methylation,1
positive regulation of wax biosynthetic process,1
Cajal body,1
primary amine oxidase activity,1
host cell nucleus,1
cytokinin metabolic process,1
regulation of flower development,1
glutamate binding,1
negative regulation of cell death,1
regulation of plant organ morphogenesis,1
lipid glycosylation,1
regulation of cell shape,1
undecaprenyldiphospho-muramoylpentapeptide beta-N-acetylglucosaminyltransferase activity,1
phospholipid biosynthetic process,1
sn-2-glycerol-3-phosphate omega-OH-C22:0-CoA acyl transferase activity,1
regulation of phosphate transport,1
pectate lyase activity,1
mRNA transcription,1
post-embryonic plant morphogenesis,1
regulation of growth,1
regulation of seedling development,1
cysteine-type peptidase activity,1
proteolysis,1
"vacuolar proton-transporting V-type ATPase, V0 domain",1
regulation of protein-containing complex assembly,1
photosystem II stabilization,1
secondary cell wall cellulose synthase complex,1
transsulfuration,1
pyridoxal phosphate binding,1
cadmium ion binding,1
heat acclimation,1
lead ion binding,1
nuclear membrane,1
anthocyanin accumulation in tissues in response to UV light,1
cuticle hydrocarbon biosynthetic process,1
root hair cell differentiation,1
cadaverine transport,1
carbohydrate transmembrane transporter activity,1
carnitine transmembrane transporter activity,1
carbon-sulfur lyase activity,1
cellular response to water deprivation,1
cystathionine gamma-lyase activity,1
cysteine biosynthetic process via cystathionine,1
methionine catabolic process via 2-oxobutanoate,1
methionine gamma-lyase activity,1
protein homotetramerization,1
protein histidine kinase binding,1
ammonium transmembrane transport,1
cytokinin dehydrogenase activity,1
G protein-coupled receptor activity,1
RNA polymerase III general transcription initiation factor activity,1
RNA polymerase III type 3 promoter sequence-specific DNA binding,1
TBP-class protein binding,1
cation:chloride symporter activity,1
transcription by RNA polymerase III,1
transcription factor TFIIIB complex,1
transcription preinitiation complex,1
transcription preinitiation complex assembly,1
adenylate cyclase-activating G protein-coupled receptor signaling pathway,1
ammonium transmembrane transporter activity,1
regulation of metabolic process,1
glucuronoxylan 4-O-methyltransferase activity,1
protein methylation,1
xylan biosynthetic process,1
xylan metabolic process,1
negative regulation of programmed cell death,1
response to red light,1
clathrin vesicle coat,1
"DNA-templated transcription, initiation",1
thiosulfate sulfurtransferase activity,1
root epidermal cell differentiation,1
response to nitrate,1
ammonium transport,1
integral component of plasma membrane,1
lateral root branching,1
lateral root formation,1
protein polymerization,1
protein monoubiquitination,1
RNA polymerase binding,1
U12-type spliceosomal complex,1
"positive regulation of mRNA splicing, via spliceosome",1
cinnamoyl-CoA reductase activity,1
cell fate specification,1
cell wall macromolecule catabolic process,1
chitin catabolic process,1
chitinase activity,1
multidimensional cell growth,1
polysaccharide binding,1
regulation of carbohydrate biosynthetic process,1
cysteine-type endopeptidase inhibitor activity,1
cellular response to heat,1
ubiquitin-like protein conjugating enzyme binding,1
nuclear speck,1
response to UV,1
defense response by callose deposition,1
glutathione metabolic process,1
glutathione transferase activity,1
indole glucosinolate catabolic process,1
toxin catabolic process,1
RNA splicing,1
"mRNA cis splicing, via spliceosome",1
"regulation of alternative mRNA splicing, via spliceosome",1
ER-associated misfolded protein catabolic process,1
cytoplasmic vesicle membrane,1
peptidyl-L-cysteine S-palmitoylation,1
protein targeting to membrane,1
protein-cysteine S-acyltransferase activity,1
protein-cysteine S-palmitoyltransferase activity,1
COPII-coated ER to Golgi transport vesicle,1
integral component of Golgi membrane,1
farnesyltranstransferase activity,1
photoreactive repair,1
isomerase activity,1
DNA repair,1
steroid biosynthetic process,1
protein import into chloroplast stroma,1
protein transmembrane transporter activity,1
carnitine racemase activity,1
dodecenoyl-CoA delta-isomerase activity,1
enoyl-CoA hydratase activity,1
fatty acid beta-oxidation,1
fatty acid catabolic process,1
cytosolic small ribosomal subunit,1
modification-dependent protein catabolic process,1
protein tag,1
UDP-3-O-[3-hydroxymyristoyl] N-acetylglucosamine deacetylase activity,1
UDP-3-O-acyl-N-acetylglucosamine deacetylase activity,1
lipid A biosynthetic process,1
lipid X metabolic process,1
proteasome assembly,1
cell-cell signaling,1
hormone activity,1
monoterpene biosynthetic process,1
prenyltransferase activity,1
thylakoid membrane,1
ubiquitin binding,1
seed development,1
stamen development,1
glucosinolate metabolic process,1
protein localization to endoplasmic reticulum exit site,1
kinesin complex,1
microtubule motor activity,1
microtubule-based movement,1
amino acid transport,1
auxin influx transmembrane transporter activity,1
root cap development,1
symporter activity,1
regulation of cell size,1
response to aluminum ion,1
response to salicylic acid,1
S-(hydroxymethyl)glutathione dehydrogenase activity,1
"alcohol dehydrogenase activity, zinc-dependent",1
formaldehyde catabolic process,1
regulation of cellular respiration,1
proteasome-mediated ubiquitin-dependent protein catabolic process,1
granum assembly,1
response to nematode,1
oxalate oxidase activity,1
glucuronoxylan biosynthetic process,1
multicellular organism reproduction,1
pectin biosynthetic process,1
polygalacturonate 4-alpha-galacturonosyltransferase activity,1
xylem and phloem pattern formation,1
arsenite transmembrane transporter activity,1
arsenite transport,1
response to arsenic-containing substance,1
tRNA processing,1
tRNA-uridine aminocarboxypropyltransferase activity,1
de-etiolation,1
double fertilization forming a zygote and endosperm,1
negative gravitropism,1
seedling development,1
"transcription, DNA-templated",1
response to fungus,1
inflorescence development,1
calcium channel activity,1
calcium import into the mitochondrion,1
negative regulation of cytokinin-activated signaling pathway,1
response to bacterium,1
cotyledon vascular tissue pattern formation,1
cutin transport,1
external side of plasma membrane,1
fatty acid transmembrane transporter activity,1
fatty acid transport,1
response to wounding,1
stem vascular tissue pattern formation,1
regulation of phenylpropanoid metabolic process,1
glycerol-3-phosphate O-acyltransferase activity,1
gibberellic acid mediated signaling pathway,1
hyperosmotic salinity response,1
meiotic cytokinesis,1
negative regulation of developmental vegetative growth,1
negative regulation of gibberellic acid mediated signaling pathway,1
negative regulation of leaf development,1
negative regulation of trichome patterning,1
positive regulation of gene expression,1
plant-type hypersensitive response,1
green leaf volatile biosynthetic process,1
response to jasmonic acid,1
nitrile biosynthetic process,1
microtubule cytoskeleton organization,1
regulation of ion transport,1
RNA catabolic process,1
aging,1
ribonuclease T2 activity,1
phosphorelay response regulator activity,1
phosphorelay signal transduction system,1
pollen exine formation,1
sporopollenin biosynthetic process,1
alpha-L-arabinofuranosidase activity,1
arabinan catabolic process,1
"xylan 1,4-beta-xylosidase activity",1
xylan catabolic process,1
negative regulation of abscisic acid-activated signaling pathway,1
response to hormone,1
response to sucrose,1
signaling receptor activity,1
promoter-specific chromatin binding,1
regulation of protein catabolic process,1
transcription coregulator activity,1
N-terminal peptidyl-glutamic acid acetylation,1
NatA complex,1
peptide-glutamate-N-acetyltransferase activity,1
peptide-serine-N-acetyltransferase activity,1
nitrate transmembrane transporter activity,1
nitrate transport,1
"electron transporter, transferring electrons within the cyclic electron transport pathway of photosynthesis activity",1
photosynthetic electron transport chain,1
thylakoid lumen,1
"N,N-dimethylaniline monooxygenase activity",1
NADP binding,1
guanylate cyclase activity,1
nitric oxide binding,1
oxygen binding,1
stomatal closure,1
negative regulation of leaf senescence,1
regulation of chlorophyll biosynthetic process,1
cytokinin catabolic process,1
N-terminal peptidyl-serine acetylation,1
N-acetyltransferase activity,1
auxin biosynthetic process,1
scopolin beta-glucosidase activity,1
positive regulation of auxin metabolic process,1
positive regulation of tryptophan metabolic process,1
tryptophan biosynthetic process,1
positive regulation of abscisic acid biosynthetic process,1
meiotic attachment of telomere to nuclear envelope,1
nuclear envelope organization,1
nuclear inner membrane,1
nucleus organization,1
protein heterooligomerization,1
protein homooligomerization,1
protein localization to nuclear envelope,1
protein-membrane adaptor activity,1
regulation of establishment or maintenance of cell polarity regulating cell shape,1
auxin efflux transmembrane transporter activity,1
auxin polar transport,1
pattern specification process,1
beta-glucosidase activity,1
sn-1-glycerol-3-phosphate C16:0-DCA-CoA acyl transferase activity,1
CDP-diacylglycerol biosynthetic process,1
integral component of mitochondrial inner membrane,1
photoprotection,1
integral component of endoplasmic reticulum membrane,1
negative regulation of developmental growth,1
negative regulation of peptidyl-tyrosine phosphorylation,1
protein tyrosine phosphatase activity,1
regulation of cell division,1
sphingolipid biosynthetic process,1
very-long-chain 3-hydroxyacyl-CoA dehydratase activity,1
PSII associated light-harvesting complex II,1
regulation of superoxide anion generation,1
NAD(P)H dehydrogenase (quinone) activity,1
xanthophyll metabolic process,1
epidermal cell differentiation,1
primary root development,1
diacylglycerol cholinephosphotransferase activity,1
abaxial cell fate specification,1
cell fate commitment,1
fruit development,1
polarity specification of adaxial/abaxial axis,1
fatty acid elongase complex,1
3R-hydroxyacyl-CoA dehydratase activity,1
3-hydroxyacyl-CoA dehydratase activity,1
3-hydroxy-lignoceroyl-CoA dehydratase activity,1
mitochondrial calcium ion homeostasis,1
uniplex complex,1
uniporter activity,1
cytidine to uridine editing,1
mRNA processing,1
mitochondrial mRNA modification,1
maturation of LSU-rRNA,1
polysomal ribosome,1
DNA replication,1
mitochondrial DNA replication,1
mitochondrial nucleoid,1
nucleoid,1
positive regulation of helicase activity,1
ferulate metabolic process,1
hydroxycinnamoyltransferase activity,1
3-hydroxy-arachidoyl-CoA dehydratase activity,1
3-hydroxy-behenoyl-CoA dehydratase activity,1
regulation of leaf development,1
regulation of shoot apical meristem development,1
NAD-dependent histone deacetylase activity (H3-K14 specific),1
phloem or xylem histogenesis,1
anisotropic cell growth,1
cortical microtubule,1
microtubule associated complex,1
NLS-bearing protein import into nucleus,1
nuclear import signal receptor activity,1
nuclear localization sequence binding,1
columella,1
water homeostasis,1
glyoxylate reductase (NADP+) activity,1
hydroxypyruvate reductase activity,1
brassinosteroid biosynthetic process,1
brassinosteroid metabolic process,1
regulation of brassinosteroid biosynthetic process,1
response to absence of light,1
abscission,1
endomembrane system organization,1
FMN binding,1
phosphatidylinositol binding,1
seed coat development,1
gene silencing,1
lipid biosynthetic process,1
histone deacetylase activity,1
histone deacetylation,1
seed maturation,1
galacturonate biosynthetic process,1
killing of cells of other organism,1
amino acid transmembrane transport,1
amino acid transmembrane transporter activity,1
aromatic amino acid transmembrane transporter activity,1
aromatic amino acid transport,1
neutral amino acid transmembrane transporter activity,1
neutral amino acid transport,1
response to nitric oxide,1
regulation of seed maturation,1
kinase inhibitor activity,1
nucleoside transmembrane transport,1
nucleoside transmembrane transporter activity,1
"nucleoside transmembrane transporter activity, against a concentration gradient",1
zinc ion transmembrane transporter activity,1
