			Case-only	Case-only	Case-only	Case-only	Case-only	Case-only	Case-only	Case-only	Case-control	Case-control	Case-control	Case-control	Case-control	Case-control	Case-control	Case-control	Case-control	Case-control	Case-control	Case-control
			dd	dd	dd_pYB1	dd_pYB1	dd_pYB1_pYB3	dd_pYB1_pYB3	dd_pYB3	dd_pYB3	dd_pYB1-dd	dd_pYB1-dd	dd_pYB1_pYB3-dd	dd_pYB1_pYB3-dd	dd_pYB3-dd	dd_pYB3-dd	dd_pYB1_pYB3-dd_pYB1	dd_pYB1_pYB3-dd_pYB1	dd_pYB3-dd_pYB1	dd_pYB3-dd_pYB1	dd_pYB3-dd_pYB1_pYB3	dd_pYB3-dd_pYB1_pYB3
			ImpulseDE	edgeR	ImpulseDE	edgeR	ImpulseDE	edgeR	ImpulseDE	edgeR	ImpulseDE	edgeR	ImpulseDE	edgeR	ImpulseDE	edgeR	ImpulseDE	edgeR	ImpulseDE	edgeR	ImpulseDE	edgeR
Case-only	dd	ImpulseDE	47.558122532534	47.37740188441279	27.3985912071897	47.50406143848767	36.080921123426236	47.50244122286487	35.42965859845682	47.47193072576503	55.70402871958516	35.96701505417585	37.12522045855379	30.341176470588234	53.11956023820431	49.293705503446716	37.198113207547166	29.202264539372102	38.98116358912499	35.167660975108	42.29163041586915	30.201977698295813
Case-only	dd	edgeR	47.37740188441279	97.67509869864016	29.691939584267985	96.85963753760363	44.7091124962897	94.55092898582654	47.03947368421053	97.31312687605242	66.64688867462732	56.58031859461069	42.76729559748428	32.7461139896373	74.69424060484768	48.96807720861173	58.585933446972504	43.63851676411812	62.84776609233982	49.00149031296572	71.91319161543589	42.57543183334569
Case-only	dd_pYB1	ImpulseDE	27.3985912071897	29.691939584267985	29.134376370814447	29.4209238525988	28.1609922794583	30.117825921702774	42.168508287292816	29.28282456785583	30.197872128865466	20.404791408508878	20.40296152445685	15.584064821066848	30.282724435469067	23.724106006249276	29.781951640759928	17.34705813545444	34.82683982683983	28.973891924711598	30.19951063429324	21.301993600787593
Case-only	dd_pYB1	edgeR	47.50406143848767	96.85963753760363	29.4209238525988	98.47930984061998	44.687915006640104	95.18673416978501	46.688422457909965	98.13296236637868	66.26656848306332	55.56945261918776	43.115273987757206	33.12675225025823	74.55215628455583	48.77958852591991	58.52004716981132	43.697540862906784	62.52870157766092	48.46045927785572	71.83700537911723	42.53500368459838
Case-only	dd_pYB1_pYB3	ImpulseDE	36.080921123426236	44.7091124962897	28.1609922794583	44.687915006640104	44.89691475361895	43.957275171795644	32.57720979765708	44.87518355359765	37.7970543055932	31.832061068702288	39.06034085674804	34.290011279608976	40.4553264604811	31.440556578678127	55.59091407878854	37.097862767154105	36.52840059790732	32.13029989658738	50.95817993014254	48.60217714002969
Case-only	dd_pYB1_pYB3	edgeR	47.50244122286487	94.55092898582654	30.117825921702774	95.18673416978501	43.957275171795644	96.00818833162744	47.44027303754266	95.71554123333821	65.98999925367565	55.16032811334824	42.32290811375681	31.89809296781883	73.958410971156	48.43247287691732	58.25670927711744	44.49634596549386	62.909063489669734	49.35025687518888	71.6868369938742	42.0966053536713
Case-only	dd_pYB3	ImpulseDE	35.42965859845682	47.03947368421053	42.168508287292816	46.688422457909965	32.57720979765708	47.44027303754266	46.11785348735195	46.273154954425166	42.93528648247729	31.000562113546938	27.61100687929956	19.859015310056176	47.03106917119202	35.520149953139644	39.70201577563541	25.558943089430898	53.984790082300236	40.13207751434448	46.517954298150165	31.052291801162042
Case-only	dd_pYB3	edgeR	47.47193072576503	97.31312687605242	29.28282456785583	98.13296236637868	44.87518355359765	95.71554123333821	46.273154954425166	99.36394209679777	66.49552589115447	55.93195483208682	43.33113117521838	33.38963137024527	74.4283201407212	48.72865831318238	58.7799148436353	44.110956189917076	62.175670709298046	48.706072636377	71.94307929289224	42.795304475421865
Case-control	dd_pYB1-dd	ImpulseDE	55.70402871958516	66.64688867462732	30.197872128865466	66.26656848306332	37.7970543055932	65.98999925367565	42.93528648247729	66.49552589115447	66.59599356631087	44.45305103709442	43.85159686364506	31.038115303581687	70.34391534391534	51.8628768964855	53.59190254389108	35.46657132642117	53.39382306752748	42.92846768336964	57.049370444002655	36.20329120829166
Case-control	dd_pYB1-dd	edgeR	35.96701505417585	56.58031859461069	20.404791408508878	55.56945261918776	31.832061068702288	55.16032811334824	31.000562113546938	55.93195483208682	44.45305103709442	56.11200467904665	34.15475603745687	32.26433430515063	49.174174174174176	43.65198281889921	38.00281046899701	42.020285655143866	40.392975134759176	33.299180327868854	44.71511147811726	29.055920739258834
Case-control	dd_pYB1_pYB3-dd	ImpulseDE	37.12522045855379	42.76729559748428	20.40296152445685	43.115273987757206	39.06034085674804	42.32290811375681	27.61100687929956	43.33113117521838	43.85159686364506	34.15475603745687	43.3908466150022	55.52760100636377	43.08633221060096	34.40723019670388	41.68525654025553	33.802345058626464	33.56818392509503	28.092520888526597	42.48961906481314	33.231776122771386
Case-control	dd_pYB1_pYB3-dd	edgeR	30.341176470588234	32.7461139896373	15.584064821066848	33.12675225025823	34.290011279608976	31.89809296781883	19.859015310056176	33.38963137024527	31.038115303581687	32.26433430515063	55.52760100636377	33.44056148559731	31.770369049741486	31.36136019564458	32.35386714240739	26.50071462601239	24.470520892959357	21.609893686266002	32.35456046981097	30.31437125748503
Case-control	dd_pYB3-dd	ImpulseDE	53.11956023820431	74.69424060484768	30.282724435469067	74.55215628455583	40.4553264604811	73.958410971156	47.03106917119202	74.4283201407212	70.34391534391534	49.174174174174176	43.08633221060096	31.770369049741486	74.63079397572744	56.727205337286875	53.65052631578947	37.556063298637554	60.68295200412868	45.57082361075101	66.92743009320905	39.54699297058058
Case-control	dd_pYB3-dd	edgeR	49.293705503446716	48.96807720861173	23.724106006249276	48.77958852591991	31.440556578678127	48.43247287691732	35.520149953139644	48.72865831318238	51.8628768964855	43.65198281889921	34.40723019670388	31.36136019564458	56.727205337286875	49.027635619242574	37.49883428145109	30.86711133914828	41.226274655749904	31.94224683544304	44.58125927866562	36.94066412629287
Case-control	dd_pYB1_pYB3-dd_pYB1	ImpulseDE	37.198113207547166	58.585933446972504	29.781951640759928	58.52004716981132	55.59091407878854	58.25670927711744	39.70201577563541	58.7799148436353	53.59190254389108	38.00281046899701	41.68525654025553	32.35386714240739	53.65052631578947	37.49883428145109	58.76590144758006	40.540810217521454	49.00279758144572	38.97149351264324	64.24570746487926	49.69866551872579
Case-control	dd_pYB1_pYB3-dd_pYB1	edgeR	29.202264539372102	43.63851676411812	17.34705813545444	43.697540862906784	37.097862767154105	44.49634596549386	25.558943089430898	44.110956189917076	35.46657132642117	42.020285655143866	33.802345058626464	26.50071462601239	37.556063298637554	30.86711133914828	40.540810217521454	44.209679777745286	32.56642015886059	28.25361512791991	43.72118253322485	36.905582356995176
Case-control	dd_pYB3-dd_pYB1	ImpulseDE	38.98116358912499	62.84776609233982	34.82683982683983	62.52870157766092	36.52840059790732	62.909063489669734	53.984790082300236	62.175670709298046	53.39382306752748	40.392975134759176	33.56818392509503	24.470520892959357	60.68295200412868	41.226274655749904	49.00279758144572	32.56642015886059	61.946190963591164	43.826749167063305	61.03884689752154	35.509163045531835
Case-control	dd_pYB3-dd_pYB1	edgeR	35.167660975108	49.00149031296572	28.973891924711598	48.46045927785572	32.13029989658738	49.35025687518888	40.13207751434448	48.706072636377	42.92846768336964	33.299180327868854	28.092520888526597	21.609893686266002	45.57082361075101	31.94224683544304	38.97149351264324	28.25361512791991	43.826749167063305	48.51586489252815	44.83000966353334	31.166107382550333
Case-control	dd_pYB3-dd_pYB1_pYB3	ImpulseDE	42.29163041586915	71.91319161543589	30.19951063429324	71.83700537911723	50.95817993014254	71.6868369938742	46.517954298150165	71.94307929289224	57.049370444002655	44.71511147811726	42.48961906481314	32.35456046981097	66.92743009320905	44.58125927866562	64.24570746487926	43.72118253322485	61.03884689752154	44.83000966353334	72.01345225910221	53.88078692375453
Case-control	dd_pYB3-dd_pYB1_pYB3	edgeR	30.201977698295813	42.57543183334569	21.301993600787593	42.53500368459838	48.60217714002969	42.0966053536713	31.052291801162042	42.795304475421865	36.20329120829166	29.055920739258834	33.231776122771386	30.31437125748503	39.54699297058058	36.94066412629287	49.69866551872579	36.905582356995176	35.509163045531835	31.166107382550333	53.88078692375453	42.9302529609592
