,Left tail,Right tail
00:20,898,377
00:40,397,1334
01:00N,2338,737
01:20,255,931
01:40,236,128
02:00,491,356
02:20,740,1215
02:40,1686,1549
03:00N,2630,1114
03:20,965,1003
03:40,802,973
04:00,658,1212
04:20,1582,497
04:40,502,2416
05:00N,2505,958
05:20,1148,899
05:40,569,579
06:00,681,640
06:20,761,726
06:40,579,1040
07:00N,1193,693
07:20,553,781
07:40,1112,506
08:00,532,825
08:20,643,384
08:40,286,1240
09:00N,2077,329
09:20,356,1565
09:40,902,343
10:00,365,921
10:20,814,428
10:40,283,1306
11:00N,1892,248
11:20,309,936
11:40,483,490
12:00,579,300
12:20,310,527
12:40,452,487
13:00N,967,444
13:20,370,681
13:40,690,575
14:00,562,701
14:20,599,366
14:40,573,941
15:00N,1125,557
15:20,395,661
15:40,521,415
16:00,517,528
16:20,842,518
16:40,484,839
17:00N,2108,1461
17:20,905,1177
17:40,1219,721
18:00,876,1107
18:20,931,1261
18:40,1103,977
19:00N,2427,1170
19:20,632,1528
19:40,905,636
20:00,765,714
20:20,674,734
20:40,1062,1006
21:00N,1888,1921
21:20,1379,873
21:40,587,1345
22:00,716,516
22:20,567,802
22:40,1201,1047
23:00N,1527,1204
23:20,628,661
