name;start_lon;start_lat;end_lon;end_lat;trolley;busses
"Московский проспект(от кольца до моста)";"80981370";"64172230";"81078250";"64179500";"4,18,21";"15,26,37"
"Улица Энтузиастов(от кольца к хлебзаводу)";"81010190";"64161290";"80960750";"64144850";"15,20,22";"37,45,46"
"Улица Калинина(от моста к Марпосадскому шоссе)";"81090940";"64178360";"81156220";"64163360";"3,18";"26,37,42,45,52"
"Улица Калинина(от Спартака до Энергозапчасти)";"81130130";"64172320";"81156220";"64163360";"2,3,6,11,15,18";"26,37,42,45,52, 101с"
"Марпасадское шоссе(от кольца к мкр. Новый город)";"81162280";"64162700";"81280330";"64157390";"3,6";"26"
"пр. Ленина - ул. Карла Маркса(от Воробьёвых до пригородного вокзала)";"81088760";"64177510";"81105660";"64144540";"1,4";"15"
"пр. Максима Горького(от Университетской к Московскому)";"80948120";"64184678";"81006840";"64178610";"1,3";"35,52"
"ул. Гагарина(от Ленина до кольца)";"81094510";"64154620";"81128100";"64171510";"2,6,11,15";""
"Эгерский бульвар(от Мира до кольца у Шупашкара)";"81124880";"64141180";"81147060";"64124860";"15,18";"15,33,45,52,262"
"Московский проспект(от моста до кольца)";"81078250";"64179500";"80981370";"64172230";"3,4,18";"15,26,37"
"Улица Энтузиастов(от хлебзавода к кольцу)";"80960750";"64144850";"81010190";"64161290";"15,20,22";"37,45,46"
"Улица Калинина(от Марпосадского шоссе к мосту)";"81156220";"64163360";"81090940";"64178360";"3,18";"26,37,42,45,52"
"Марпасадское шоссе(от мкр. Новый город до кольца)";"81280330";"64157390";"81162280";"64162700";"3,8";"26"
"пр. Ленина - ул. Карла Маркса(от пригородного вокзала к Воробьёвых)";"81105660";"64144540";"81088760";"64177510";"1,4";"15"
"пр. Максима Горького(от Московского к Университетской)";"81006840";"64178610";"80948120";"64184678";"1,3,21";"35,52"
"ул. Гагарина(от кольца до Ленина)";"81128100";"64171510";"81094510";"64154620";"2,8,11,15";""
"Эгерский бульвар(от кольца у Шупашкара до Мира)";"81147060";"64124860";"81124880";"64141180";"15,18";"15,33,45,52,262"
"Проспект Мира(от Энергозапчасть до Эгерского бульварара)";"81156300";"64162250";"81124520";"64141600";"2,11,15,18";"42,45,52"
"Проспект Мира(от Эгерского бульвара до Энергозапчасти)";"81124520";"64141600";"81156300";"64162250";"9,11,15,18";"42,45,52"
"Фучика - Гагарина(от кольца Гражданской до пр. Ленина)";"81022300";"64158830";"81091210";"64154080";"11,14,15,20";"32,45,46"
"Фучика - Гагарина(от пр. Ленина до кольца Гражданской)";"81091210";"64154080";"81022300";"64158830";"11,14,15,20";"32,45,46"
