^C:\USERS\GEORGEDRIPPER\SOURCE\REPOS\PROYECTO FINAL\PROYECTO FINAL\PROYECTO.CPP
C:\PROGRAM FILES (X86)\MICROSOFT VISUAL STUDIO\2017\COMMUNITY\VC\TOOLS\MSVC\14.16.27023\BIN\HOSTX86\X86\3082\CLUI.DLL
C:\WINDOWS\GLOBALIZATION\SORTING\SORTDEFAULT.NLS
C:\WINDOWS\SYSTEM32\TZRES.DLL
C:\PROGRAM FILES (X86)\MICROSOFT VISUAL STUDIO\2017\COMMUNITY\VC\TOOLS\MSVC\14.16.27023\INCLUDE\IOSTREAM
C:\PROGRAM FILES (X86)\MICROSOFT VISUAL STUDIO\2017\COMMUNITY\VC\TOOLS\MSVC\14.16.27023\INCLUDE\ISTREAM
C:\PROGRAM FILES (X86)\MICROSOFT VISUAL STUDIO\2017\COMMUNITY\VC\TOOLS\MSVC\14.16.27023\INCLUDE\OSTREAM
C:\PROGRAM FILES (X86)\MICROSOFT VISUAL STUDIO\2017\COMMUNITY\VC\TOOLS\MSVC\14.16.27023\INCLUDE\IOS
C:\PROGRAM FILES (X86)\MICROSOFT VISUAL STUDIO\2017\COMMUNITY\VC\TOOLS\MSVC\14.16.27023\INCLUDE\XLOCNUM
C:\PROGRAM FILES (X86)\MICROSOFT VISUAL STUDIO\2017\COMMUNITY\VC\TOOLS\MSVC\14.16.27023\INCLUDE\CLIMITS
C:\PROGRAM FILES (X86)\MICROSOFT VISUAL STUDIO\2017\COMMUNITY\VC\TOOLS\MSVC\14.16.27023\INCLUDE\YVALS.H
C:\PROGRAM FILES (X86)\MICROSOFT VISUAL STUDIO\2017\COMMUNITY\VC\TOOLS\MSVC\14.16.27023\INCLUDE\YVALS_CORE.H
C:\PROGRAM FILES (X86)\MICROSOFT VISUAL STUDIO\2017\COMMUNITY\VC\TOOLS\MSVC\14.16.27023\INCLUDE\XKEYCHECK.H
C:\PROGRAM FILES (X86)\MICROSOFT VISUAL STUDIO\2017\COMMUNITY\VC\TOOLS\MSVC\14.16.27023\INCLUDE\CRTDEFS.H
C:\PROGRAM FILES (X86)\MICROSOFT VISUAL STUDIO\2017\COMMUNITY\VC\TOOLS\MSVC\14.16.27023\INCLUDE\VCRUNTIME.H
C:\PROGRAM FILES (X86)\MICROSOFT VISUAL STUDIO\2017\COMMUNITY\VC\TOOLS\MSVC\14.16.27023\INCLUDE\SAL.H
C:\PROGRAM FILES (X86)\MICROSOFT VISUAL STUDIO\2017\COMMUNITY\VC\TOOLS\MSVC\14.16.27023\INCLUDE\CONCURRENCYSAL.H
C:\PROGRAM FILES (X86)\MICROSOFT VISUAL STUDIO\2017\COMMUNITY\VC\TOOLS\MSVC\14.16.27023\INCLUDE\VADEFS.H
C:\PROGRAM FILES (X86)\WINDOWS KITS\10\INCLUDE\10.0.17763.0\UCRT\CORECRT.H
C:\PROGRAM FILES (X86)\WINDOWS KITS\10\INCLUDE\10.0.17763.0\UCRT\CRTDBG.H
C:\PROGRAM FILES (X86)\MICROSOFT VISUAL STUDIO\2017\COMMUNITY\VC\TOOLS\MSVC\14.16.27023\INCLUDE\VCRUNTIME_NEW_DEBUG.H
C:\PROGRAM FILES (X86)\MICROSOFT VISUAL STUDIO\2017\COMMUNITY\VC\TOOLS\MSVC\14.16.27023\INCLUDE\VCRUNTIME_NEW.H
C:\PROGRAM FILES (X86)\MICROSOFT VISUAL STUDIO\2017\COMMUNITY\VC\TOOLS\MSVC\14.16.27023\INCLUDE\USE_ANSI.H
C:\PROGRAM FILES (X86)\MICROSOFT VISUAL STUDIO\2017\COMMUNITY\VC\TOOLS\MSVC\14.16.27023\INCLUDE\LIMITS.H
C:\PROGRAM FILES (X86)\MICROSOFT VISUAL STUDIO\2017\COMMUNITY\VC\TOOLS\MSVC\14.16.27023\INCLUDE\CMATH
C:\PROGRAM FILES (X86)\MICROSOFT VISUAL STUDIO\2017\COMMUNITY\VC\TOOLS\MSVC\14.16.27023\INCLUDE\CSTDLIB
C:\PROGRAM FILES (X86)\WINDOWS KITS\10\INCLUDE\10.0.17763.0\UCRT\STDLIB.H
C:\PROGRAM FILES (X86)\WINDOWS KITS\10\INCLUDE\10.0.17763.0\UCRT\CORECRT_MALLOC.H
C:\PROGRAM FILES (X86)\WINDOWS KITS\10\INCLUDE\10.0.17763.0\UCRT\CORECRT_SEARCH.H
C:\PROGRAM FILES (X86)\WINDOWS KITS\10\INCLUDE\10.0.17763.0\UCRT\STDDEF.H
C:\PROGRAM FILES (X86)\WINDOWS KITS\10\INCLUDE\10.0.17763.0\UCRT\CORECRT_WSTDLIB.H
C:\PROGRAM FILES (X86)\WINDOWS KITS\10\INCLUDE\10.0.17763.0\UCRT\MATH.H
C:\PROGRAM FILES (X86)\WINDOWS KITS\10\INCLUDE\10.0.17763.0\UCRT\CORECRT_MATH.H
C:\PROGRAM FILES (X86)\MICROSOFT VISUAL STUDIO\2017\COMMUNITY\VC\TOOLS\MSVC\14.16.27023\INCLUDE\XTGMATH.H
C:\PROGRAM FILES (X86)\MICROSOFT VISUAL STUDIO\2017\COMMUNITY\VC\TOOLS\MSVC\14.16.27023\INCLUDE\XTR1COMMON
C:\PROGRAM FILES (X86)\MICROSOFT VISUAL STUDIO\2017\COMMUNITY\VC\TOOLS\MSVC\14.16.27023\INCLUDE\CSTDIO
C:\PROGRAM FILES (X86)\WINDOWS KITS\10\INCLUDE\10.0.17763.0\UCRT\STDIO.H
C:\PROGRAM FILES (X86)\WINDOWS KITS\10\INCLUDE\10.0.17763.0\UCRT\CORECRT_WSTDIO.H
C:\PROGRAM FILES (X86)\WINDOWS KITS\10\INCLUDE\10.0.17763.0\UCRT\CORECRT_STDIO_CONFIG.H
C:\PROGRAM FILES (X86)\MICROSOFT VISUAL STUDIO\2017\COMMUNITY\VC\TOOLS\MSVC\14.16.27023\INCLUDE\STREAMBUF
C:\PROGRAM FILES (X86)\MICROSOFT VISUAL STUDIO\2017\COMMUNITY\VC\TOOLS\MSVC\14.16.27023\INCLUDE\XIOSBASE
C:\PROGRAM FILES (X86)\MICROSOFT VISUAL STUDIO\2017\COMMUNITY\VC\TOOLS\MSVC\14.16.27023\INCLUDE\XLOCALE
C:\PROGRAM FILES (X86)\MICROSOFT VISUAL STUDIO\2017\COMMUNITY\VC\TOOLS\MSVC\14.16.27023\INCLUDE\CSTRING
C:\PROGRAM FILES (X86)\WINDOWS KITS\10\INCLUDE\10.0.17763.0\UCRT\STRING.H
C:\PROGRAM FILES (X86)\WINDOWS KITS\10\INCLUDE\10.0.17763.0\UCRT\CORECRT_MEMORY.H
C:\PROGRAM FILES (X86)\WINDOWS KITS\10\INCLUDE\10.0.17763.0\UCRT\CORECRT_MEMCPY_S.H
C:\PROGRAM FILES (X86)\WINDOWS KITS\10\INCLUDE\10.0.17763.0\UCRT\ERRNO.H
C:\PROGRAM FILES (X86)\MICROSOFT VISUAL STUDIO\2017\COMMUNITY\VC\TOOLS\MSVC\14.16.27023\INCLUDE\VCRUNTIME_STRING.H
C:\PROGRAM FILES (X86)\WINDOWS KITS\10\INCLUDE\10.0.17763.0\UCRT\CORECRT_WSTRING.H
C:\PROGRAM FILES (X86)\MICROSOFT VISUAL STUDIO\2017\COMMUNITY\VC\TOOLS\MSVC\14.16.27023\INCLUDE\STDEXCEPT
C:\PROGRAM FILES (X86)\MICROSOFT VISUAL STUDIO\2017\COMMUNITY\VC\TOOLS\MSVC\14.16.27023\INCLUDE\EXCEPTION
C:\PROGRAM FILES (X86)\MICROSOFT VISUAL STUDIO\2017\COMMUNITY\VC\TOOLS\MSVC\14.16.27023\INCLUDE\TYPE_TRAITS
C:\PROGRAM FILES (X86)\MICROSOFT VISUAL STUDIO\2017\COMMUNITY\VC\TOOLS\MSVC\14.16.27023\INCLUDE\XSTDDEF
C:\PROGRAM FILES (X86)\MICROSOFT VISUAL STUDIO\2017\COMMUNITY\VC\TOOLS\MSVC\14.16.27023\INCLUDE\CSTDDEF
C:\PROGRAM FILES (X86)\MICROSOFT VISUAL STUDIO\2017\COMMUNITY\VC\TOOLS\MSVC\14.16.27023\INCLUDE\INITIALIZER_LIST
C:\PROGRAM FILES (X86)\WINDOWS KITS\10\INCLUDE\10.0.17763.0\UCRT\MALLOC.H
C:\PROGRAM FILES (X86)\MICROSOFT VISUAL STUDIO\2017\COMMUNITY\VC\TOOLS\MSVC\14.16.27023\INCLUDE\VCRUNTIME_EXCEPTION.H
C:\PROGRAM FILES (X86)\MICROSOFT VISUAL STUDIO\2017\COMMUNITY\VC\TOOLS\MSVC\14.16.27023\INCLUDE\EH.H
C:\PROGRAM FILES (X86)\WINDOWS KITS\10\INCLUDE\10.0.17763.0\UCRT\CORECRT_TERMINATE.H
C:\PROGRAM FILES (X86)\MICROSOFT VISUAL STUDIO\2017\COMMUNITY\VC\TOOLS\MSVC\14.16.27023\INCLUDE\XSTRING
C:\PROGRAM FILES (X86)\MICROSOFT VISUAL STUDIO\2017\COMMUNITY\VC\TOOLS\MSVC\14.16.27023\INCLUDE\XMEMORY0
C:\PROGRAM FILES (X86)\MICROSOFT VISUAL STUDIO\2017\COMMUNITY\VC\TOOLS\MSVC\14.16.27023\INCLUDE\CSTDINT
C:\PROGRAM FILES (X86)\MICROSOFT VISUAL STUDIO\2017\COMMUNITY\VC\TOOLS\MSVC\14.16.27023\INCLUDE\STDINT.H
C:\PROGRAM FILES (X86)\MICROSOFT VISUAL STUDIO\2017\COMMUNITY\VC\TOOLS\MSVC\14.16.27023\INCLUDE\LIMITS
C:\PROGRAM FILES (X86)\MICROSOFT VISUAL STUDIO\2017\COMMUNITY\VC\TOOLS\MSVC\14.16.27023\INCLUDE\YMATH.H
C:\PROGRAM FILES (X86)\MICROSOFT VISUAL STUDIO\2017\COMMUNITY\VC\TOOLS\MSVC\14.16.27023\INCLUDE\CFLOAT
C:\PROGRAM FILES (X86)\WINDOWS KITS\10\INCLUDE\10.0.17763.0\UCRT\FLOAT.H
C:\PROGRAM FILES (X86)\MICROSOFT VISUAL STUDIO\2017\COMMUNITY\VC\TOOLS\MSVC\14.16.27023\INCLUDE\CWCHAR
C:\PROGRAM FILES (X86)\WINDOWS KITS\10\INCLUDE\10.0.17763.0\UCRT\WCHAR.H
C:\PROGRAM FILES (X86)\WINDOWS KITS\10\INCLUDE\10.0.17763.0\UCRT\CORECRT_WCONIO.H
C:\PROGRAM FILES (X86)\WINDOWS KITS\10\INCLUDE\10.0.17763.0\UCRT\CORECRT_WCTYPE.H
C:\PROGRAM FILES (X86)\WINDOWS KITS\10\INCLUDE\10.0.17763.0\UCRT\CORECRT_WDIRECT.H
C:\PROGRAM FILES (X86)\WINDOWS KITS\10\INCLUDE\10.0.17763.0\UCRT\CORECRT_WIO.H
C:\PROGRAM FILES (X86)\WINDOWS KITS\10\INCLUDE\10.0.17763.0\UCRT\CORECRT_SHARE.H
C:\PROGRAM FILES (X86)\WINDOWS KITS\10\INCLUDE\10.0.17763.0\UCRT\CORECRT_WPROCESS.H
C:\PROGRAM FILES (X86)\WINDOWS KITS\10\INCLUDE\10.0.17763.0\UCRT\CORECRT_WTIME.H
C:\PROGRAM FILES (X86)\WINDOWS KITS\10\INCLUDE\10.0.17763.0\UCRT\SYS\STAT.H
C:\PROGRAM FILES (X86)\WINDOWS KITS\10\INCLUDE\10.0.17763.0\UCRT\SYS\TYPES.H
C:\PROGRAM FILES (X86)\MICROSOFT VISUAL STUDIO\2017\COMMUNITY\VC\TOOLS\MSVC\14.16.27023\INCLUDE\NEW
C:\PROGRAM FILES (X86)\MICROSOFT VISUAL STUDIO\2017\COMMUNITY\VC\TOOLS\MSVC\14.16.27023\INCLUDE\XUTILITY
C:\PROGRAM FILES (X86)\MICROSOFT VISUAL STUDIO\2017\COMMUNITY\VC\TOOLS\MSVC\14.16.27023\INCLUDE\UTILITY
C:\PROGRAM FILES (X86)\MICROSOFT VISUAL STUDIO\2017\COMMUNITY\VC\TOOLS\MSVC\14.16.27023\INCLUDE\IOSFWD
C:\PROGRAM FILES (X86)\MICROSOFT VISUAL STUDIO\2017\COMMUNITY\VC\TOOLS\MSVC\14.16.27023\INCLUDE\XATOMIC0.H
C:\PROGRAM FILES (X86)\MICROSOFT VISUAL STUDIO\2017\COMMUNITY\VC\TOOLS\MSVC\14.16.27023\INCLUDE\INTRIN0.H
C:\PROGRAM FILES (X86)\MICROSOFT VISUAL STUDIO\2017\COMMUNITY\VC\TOOLS\MSVC\14.16.27023\INCLUDE\TYPEINFO
C:\PROGRAM FILES (X86)\MICROSOFT VISUAL STUDIO\2017\COMMUNITY\VC\TOOLS\MSVC\14.16.27023\INCLUDE\VCRUNTIME_TYPEINFO.H
C:\PROGRAM FILES (X86)\MICROSOFT VISUAL STUDIO\2017\COMMUNITY\VC\TOOLS\MSVC\14.16.27023\INCLUDE\XLOCINFO
C:\PROGRAM FILES (X86)\MICROSOFT VISUAL STUDIO\2017\COMMUNITY\VC\TOOLS\MSVC\14.16.27023\INCLUDE\XLOCINFO.H
C:\PROGRAM FILES (X86)\WINDOWS KITS\10\INCLUDE\10.0.17763.0\UCRT\CTYPE.H
C:\PROGRAM FILES (X86)\WINDOWS KITS\10\INCLUDE\10.0.17763.0\UCRT\LOCALE.H
C:\PROGRAM FILES (X86)\MICROSOFT VISUAL STUDIO\2017\COMMUNITY\VC\TOOLS\MSVC\14.16.27023\INCLUDE\MEMORY
C:\PROGRAM FILES (X86)\MICROSOFT VISUAL STUDIO\2017\COMMUNITY\VC\TOOLS\MSVC\14.16.27023\INCLUDE\XMEMORY
C:\PROGRAM FILES (X86)\MICROSOFT VISUAL STUDIO\2017\COMMUNITY\VC\TOOLS\MSVC\14.16.27023\INCLUDE\XFACET
C:\PROGRAM FILES (X86)\MICROSOFT VISUAL STUDIO\2017\COMMUNITY\VC\TOOLS\MSVC\14.16.27023\INCLUDE\SYSTEM_ERROR
C:\PROGRAM FILES (X86)\MICROSOFT VISUAL STUDIO\2017\COMMUNITY\VC\TOOLS\MSVC\14.16.27023\INCLUDE\CERRNO
C:\PROGRAM FILES (X86)\MICROSOFT VISUAL STUDIO\2017\COMMUNITY\VC\TOOLS\MSVC\14.16.27023\INCLUDE\XCALL_ONCE.H
C:\PROGRAM FILES (X86)\MICROSOFT VISUAL STUDIO\2017\COMMUNITY\VC\TOOLS\MSVC\14.16.27023\INCLUDE\XERRC.H
C:\PROGRAM FILES (X86)\WINDOWS KITS\10\INCLUDE\10.0.17763.0\UCRT\SHARE.H
C:\PROGRAM FILES (X86)\WINDOWS KITS\10\INCLUDE\10.0.17763.0\UM\WINDOWS.H
C:\PROGRAM FILES (X86)\WINDOWS KITS\10\INCLUDE\10.0.17763.0\SHARED\WINAPIFAMILY.H
C:\PROGRAM FILES (X86)\WINDOWS KITS\10\INCLUDE\10.0.17763.0\SHARED\WINPACKAGEFAMILY.H
C:\PROGRAM FILES (X86)\WINDOWS KITS\10\INCLUDE\10.0.17763.0\SHARED\SDKDDKVER.H
C:\PROGRAM FILES (X86)\MICROSOFT VISUAL STUDIO\2017\COMMUNITY\VC\TOOLS\MSVC\14.16.27023\INCLUDE\EXCPT.H
C:\PROGRAM FILES (X86)\MICROSOFT VISUAL STUDIO\2017\COMMUNITY\VC\TOOLS\MSVC\14.16.27023\INCLUDE\STDARG.H
C:\PROGRAM FILES (X86)\WINDOWS KITS\10\INCLUDE\10.0.17763.0\SHARED\WINDEF.H
C:\PROGRAM FILES (X86)\WINDOWS KITS\10\INCLUDE\10.0.17763.0\SHARED\MINWINDEF.H
C:\PROGRAM FILES (X86)\WINDOWS KITS\10\INCLUDE\10.0.17763.0\SHARED\SPECSTRINGS.H
C:\PROGRAM FILES (X86)\WINDOWS KITS\10\INCLUDE\10.0.17763.0\SHARED\SPECSTRINGS_STRICT.H
C:\PROGRAM FILES (X86)\WINDOWS KITS\10\INCLUDE\10.0.17763.0\SHARED\SPECSTRINGS_UNDEF.H
C:\PROGRAM FILES (X86)\WINDOWS KITS\10\INCLUDE\10.0.17763.0\SHARED\DRIVERSPECS.H
C:\PROGRAM FILES (X86)\WINDOWS KITS\10\INCLUDE\10.0.17763.0\SHARED\SDV_DRIVERSPECS.H
C:\PROGRAM FILES (X86)\WINDOWS KITS\10\INCLUDE\10.0.17763.0\UM\WINNT.H
C:\PROGRAM FILES (X86)\WINDOWS KITS\10\INCLUDE\10.0.17763.0\SHARED\KERNELSPECS.H
C:\PROGRAM FILES (X86)\WINDOWS KITS\10\INCLUDE\10.0.17763.0\SHARED\BASETSD.H
C:\PROGRAM FILES (X86)\WINDOWS KITS\10\INCLUDE\10.0.17763.0\SHARED\GUIDDEF.H
C:\PROGRAM FILES (X86)\WINDOWS KITS\10\INCLUDE\10.0.17763.0\SHARED\PSHPACK4.H
C:\PROGRAM FILES (X86)\WINDOWS KITS\10\INCLUDE\10.0.17763.0\SHARED\POPPACK.H
C:\PROGRAM FILES (X86)\WINDOWS KITS\10\INCLUDE\10.0.17763.0\SHARED\PSHPACK2.H
C:\PROGRAM FILES (X86)\WINDOWS KITS\10\INCLUDE\10.0.17763.0\SHARED\PSHPACK8.H
C:\PROGRAM FILES (X86)\WINDOWS KITS\10\INCLUDE\10.0.17763.0\SHARED\PSHPACK1.H
C:\PROGRAM FILES (X86)\WINDOWS KITS\10\INCLUDE\10.0.17763.0\SHARED\APISET.H
C:\PROGRAM FILES (X86)\WINDOWS KITS\10\INCLUDE\10.0.17763.0\SHARED\KTMTYPES.H
C:\PROGRAM FILES (X86)\WINDOWS KITS\10\INCLUDE\10.0.17763.0\UM\WINBASE.H
C:\PROGRAM FILES (X86)\WINDOWS KITS\10\INCLUDE\10.0.17763.0\SHARED\APISETCCONV.H
C:\PROGRAM FILES (X86)\WINDOWS KITS\10\INCLUDE\10.0.17763.0\UM\MINWINBASE.H
C:\PROGRAM FILES (X86)\WINDOWS KITS\10\INCLUDE\10.0.17763.0\UM\APIQUERY2.H
C:\PROGRAM FILES (X86)\WINDOWS KITS\10\INCLUDE\10.0.17763.0\UM\PROCESSENV.H
C:\PROGRAM FILES (X86)\WINDOWS KITS\10\INCLUDE\10.0.17763.0\UM\FILEAPI.H
C:\PROGRAM FILES (X86)\WINDOWS KITS\10\INCLUDE\10.0.17763.0\UM\DEBUGAPI.H
C:\PROGRAM FILES (X86)\WINDOWS KITS\10\INCLUDE\10.0.17763.0\UM\UTILAPISET.H
C:\PROGRAM FILES (X86)\WINDOWS KITS\10\INCLUDE\10.0.17763.0\UM\HANDLEAPI.H
C:\PROGRAM FILES (X86)\WINDOWS KITS\10\INCLUDE\10.0.17763.0\UM\ERRHANDLINGAPI.H
C:\PROGRAM FILES (X86)\WINDOWS KITS\10\INCLUDE\10.0.17763.0\UM\FIBERSAPI.H
C:\PROGRAM FILES (X86)\WINDOWS KITS\10\INCLUDE\10.0.17763.0\UM\NAMEDPIPEAPI.H
C:\PROGRAM FILES (X86)\WINDOWS KITS\10\INCLUDE\10.0.17763.0\UM\PROFILEAPI.H
C:\PROGRAM FILES (X86)\WINDOWS KITS\10\INCLUDE\10.0.17763.0\UM\HEAPAPI.H
C:\PROGRAM FILES (X86)\WINDOWS KITS\10\INCLUDE\10.0.17763.0\UM\IOAPISET.H
C:\PROGRAM FILES (X86)\WINDOWS KITS\10\INCLUDE\10.0.17763.0\UM\SYNCHAPI.H
C:\PROGRAM FILES (X86)\WINDOWS KITS\10\INCLUDE\10.0.17763.0\UM\INTERLOCKEDAPI.H
C:\PROGRAM FILES (X86)\WINDOWS KITS\10\INCLUDE\10.0.17763.0\UM\PROCESSTHREADSAPI.H
C:\PROGRAM FILES (X86)\WINDOWS KITS\10\INCLUDE\10.0.17763.0\UM\SYSINFOAPI.H
C:\PROGRAM FILES (X86)\WINDOWS KITS\10\INCLUDE\10.0.17763.0\UM\MEMORYAPI.H
C:\PROGRAM FILES (X86)\WINDOWS KITS\10\INCLUDE\10.0.17763.0\UM\ENCLAVEAPI.H
C:\PROGRAM FILES (X86)\WINDOWS KITS\10\INCLUDE\10.0.17763.0\UM\THREADPOOLLEGACYAPISET.H
C:\PROGRAM FILES (X86)\WINDOWS KITS\10\INCLUDE\10.0.17763.0\UM\THREADPOOLAPISET.H
C:\PROGRAM FILES (X86)\WINDOWS KITS\10\INCLUDE\10.0.17763.0\UM\JOBAPI.H
C:\PROGRAM FILES (X86)\WINDOWS KITS\10\INCLUDE\10.0.17763.0\UM\JOBAPI2.H
C:\PROGRAM FILES (X86)\WINDOWS KITS\10\INCLUDE\10.0.17763.0\UM\WOW64APISET.H
C:\PROGRAM FILES (X86)\WINDOWS KITS\10\INCLUDE\10.0.17763.0\UM\LIBLOADERAPI.H
C:\PROGRAM FILES (X86)\WINDOWS KITS\10\INCLUDE\10.0.17763.0\UM\SECURITYBASEAPI.H
C:\PROGRAM FILES (X86)\WINDOWS KITS\10\INCLUDE\10.0.17763.0\UM\NAMESPACEAPI.H
C:\PROGRAM FILES (X86)\WINDOWS KITS\10\INCLUDE\10.0.17763.0\UM\SYSTEMTOPOLOGYAPI.H
C:\PROGRAM FILES (X86)\WINDOWS KITS\10\INCLUDE\10.0.17763.0\UM\PROCESSTOPOLOGYAPI.H
C:\PROGRAM FILES (X86)\WINDOWS KITS\10\INCLUDE\10.0.17763.0\UM\SECURITYAPPCONTAINER.H
C:\PROGRAM FILES (X86)\WINDOWS KITS\10\INCLUDE\10.0.17763.0\UM\REALTIMEAPISET.H
C:\PROGRAM FILES (X86)\WINDOWS KITS\10\INCLUDE\10.0.17763.0\SHARED\WINERROR.H
C:\PROGRAM FILES (X86)\WINDOWS KITS\10\INCLUDE\10.0.17763.0\UM\TIMEZONEAPI.H
C:\PROGRAM FILES (X86)\WINDOWS KITS\10\INCLUDE\10.0.17763.0\UM\WINGDI.H
C:\PROGRAM FILES (X86)\WINDOWS KITS\10\INCLUDE\10.0.17763.0\UM\WINUSER.H
C:\PROGRAM FILES (X86)\WINDOWS KITS\10\INCLUDE\10.0.17763.0\SHARED\TVOUT.H
C:\PROGRAM FILES (X86)\WINDOWS KITS\10\INCLUDE\10.0.17763.0\UM\WINNLS.H
C:\PROGRAM FILES (X86)\WINDOWS KITS\10\INCLUDE\10.0.17763.0\UM\DATETIMEAPI.H
C:\PROGRAM FILES (X86)\WINDOWS KITS\10\INCLUDE\10.0.17763.0\UM\STRINGAPISET.H
C:\PROGRAM FILES (X86)\WINDOWS KITS\10\INCLUDE\10.0.17763.0\UM\WINCON.H
C:\PROGRAM FILES (X86)\WINDOWS KITS\10\INCLUDE\10.0.17763.0\UM\WINCONTYPES.H
C:\PROGRAM FILES (X86)\WINDOWS KITS\10\INCLUDE\10.0.17763.0\UM\CONSOLEAPI.H
C:\PROGRAM FILES (X86)\WINDOWS KITS\10\INCLUDE\10.0.17763.0\UM\CONSOLEAPI2.H
C:\PROGRAM FILES (X86)\WINDOWS KITS\10\INCLUDE\10.0.17763.0\UM\CONSOLEAPI3.H
C:\PROGRAM FILES (X86)\WINDOWS KITS\10\INCLUDE\10.0.17763.0\UM\WINVER.H
C:\PROGRAM FILES (X86)\WINDOWS KITS\10\INCLUDE\10.0.17763.0\UM\VERRSRC.H
C:\PROGRAM FILES (X86)\WINDOWS KITS\10\INCLUDE\10.0.17763.0\UM\WINREG.H
C:\PROGRAM FILES (X86)\WINDOWS KITS\10\INCLUDE\10.0.17763.0\UM\REASON.H
C:\PROGRAM FILES (X86)\WINDOWS KITS\10\INCLUDE\10.0.17763.0\UM\WINNETWK.H
C:\PROGRAM FILES (X86)\WINDOWS KITS\10\INCLUDE\10.0.17763.0\SHARED\WNNC.H
C:\PROGRAM FILES (X86)\WINDOWS KITS\10\INCLUDE\10.0.17763.0\SHARED\CDERR.H
C:\PROGRAM FILES (X86)\WINDOWS KITS\10\INCLUDE\10.0.17763.0\UM\DDE.H
C:\PROGRAM FILES (X86)\WINDOWS KITS\10\INCLUDE\10.0.17763.0\UM\DDEML.H
C:\PROGRAM FILES (X86)\WINDOWS KITS\10\INCLUDE\10.0.17763.0\UM\DLGS.H
C:\PROGRAM FILES (X86)\WINDOWS KITS\10\INCLUDE\10.0.17763.0\UM\LZEXPAND.H
C:\PROGRAM FILES (X86)\WINDOWS KITS\10\INCLUDE\10.0.17763.0\UM\MMSYSTEM.H
C:\PROGRAM FILES (X86)\WINDOWS KITS\10\INCLUDE\10.0.17763.0\UM\MMSYSCOM.H
C:\PROGRAM FILES (X86)\WINDOWS KITS\10\INCLUDE\10.0.17763.0\UM\MCIAPI.H
C:\PROGRAM FILES (X86)\WINDOWS KITS\10\INCLUDE\10.0.17763.0\UM\MMISCAPI.H
C:\PROGRAM FILES (X86)\WINDOWS KITS\10\INCLUDE\10.0.17763.0\UM\MMISCAPI2.H
C:\PROGRAM FILES (X86)\WINDOWS KITS\10\INCLUDE\10.0.17763.0\UM\PLAYSOUNDAPI.H
C:\PROGRAM FILES (X86)\WINDOWS KITS\10\INCLUDE\10.0.17763.0\UM\MMEAPI.H
C:\PROGRAM FILES (X86)\WINDOWS KITS\10\INCLUDE\10.0.17763.0\UM\TIMEAPI.H
C:\PROGRAM FILES (X86)\WINDOWS KITS\10\INCLUDE\10.0.17763.0\UM\JOYSTICKAPI.H
C:\PROGRAM FILES (X86)\WINDOWS KITS\10\INCLUDE\10.0.17763.0\UM\NB30.H
C:\PROGRAM FILES (X86)\WINDOWS KITS\10\INCLUDE\10.0.17763.0\SHARED\RPC.H
C:\PROGRAM FILES (X86)\WINDOWS KITS\10\INCLUDE\10.0.17763.0\SHARED\RPCDCE.H
C:\PROGRAM FILES (X86)\WINDOWS KITS\10\INCLUDE\10.0.17763.0\SHARED\RPCDCEP.H
C:\PROGRAM FILES (X86)\WINDOWS KITS\10\INCLUDE\10.0.17763.0\UM\RPCNSI.H
C:\PROGRAM FILES (X86)\WINDOWS KITS\10\INCLUDE\10.0.17763.0\SHARED\RPCNTERR.H
C:\PROGRAM FILES (X86)\WINDOWS KITS\10\INCLUDE\10.0.17763.0\SHARED\RPCASYNC.H
C:\PROGRAM FILES (X86)\WINDOWS KITS\10\INCLUDE\10.0.17763.0\UM\SHELLAPI.H
C:\PROGRAM FILES (X86)\WINDOWS KITS\10\INCLUDE\10.0.17763.0\UM\WINPERF.H
C:\PROGRAM FILES (X86)\WINDOWS KITS\10\INCLUDE\10.0.17763.0\UM\WINSOCK.H
C:\PROGRAM FILES (X86)\WINDOWS KITS\10\INCLUDE\10.0.17763.0\SHARED\INADDR.H
C:\PROGRAM FILES (X86)\WINDOWS KITS\10\INCLUDE\10.0.17763.0\UM\WINCRYPT.H
C:\PROGRAM FILES (X86)\WINDOWS KITS\10\INCLUDE\10.0.17763.0\SHARED\BCRYPT.H
C:\PROGRAM FILES (X86)\WINDOWS KITS\10\INCLUDE\10.0.17763.0\UM\NCRYPT.H
C:\PROGRAM FILES (X86)\WINDOWS KITS\10\INCLUDE\10.0.17763.0\UM\DPAPI.H
C:\PROGRAM FILES (X86)\WINDOWS KITS\10\INCLUDE\10.0.17763.0\UM\WINEFS.H
C:\PROGRAM FILES (X86)\WINDOWS KITS\10\INCLUDE\10.0.17763.0\UM\WINSCARD.H
C:\PROGRAM FILES (X86)\WINDOWS KITS\10\INCLUDE\10.0.17763.0\SHARED\WTYPES.H
C:\PROGRAM FILES (X86)\WINDOWS KITS\10\INCLUDE\10.0.17763.0\SHARED\RPCNDR.H
C:\PROGRAM FILES (X86)\WINDOWS KITS\10\INCLUDE\10.0.17763.0\UM\RPCNSIP.H
C:\PROGRAM FILES (X86)\WINDOWS KITS\10\INCLUDE\10.0.17763.0\SHARED\RPCSAL.H
C:\PROGRAM FILES (X86)\WINDOWS KITS\10\INCLUDE\10.0.17763.0\SHARED\WTYPESBASE.H
C:\PROGRAM FILES (X86)\WINDOWS KITS\10\INCLUDE\10.0.17763.0\UM\WINIOCTL.H
C:\PROGRAM FILES (X86)\WINDOWS KITS\10\INCLUDE\10.0.17763.0\SHARED\WINSMCRD.H
C:\PROGRAM FILES (X86)\WINDOWS KITS\10\INCLUDE\10.0.17763.0\UM\WINSPOOL.H
C:\PROGRAM FILES (X86)\WINDOWS KITS\10\INCLUDE\10.0.17763.0\UM\PRSHT.H
C:\PROGRAM FILES (X86)\WINDOWS KITS\10\INCLUDE\10.0.17763.0\UM\OLE2.H
C:\PROGRAM FILES (X86)\WINDOWS KITS\10\INCLUDE\10.0.17763.0\UM\OBJBASE.H
C:\PROGRAM FILES (X86)\WINDOWS KITS\10\INCLUDE\10.0.17763.0\UM\COMBASEAPI.H
C:\PROGRAM FILES (X86)\WINDOWS KITS\10\INCLUDE\10.0.17763.0\UM\UNKNWNBASE.H
C:\PROGRAM FILES (X86)\WINDOWS KITS\10\INCLUDE\10.0.17763.0\UM\OBJIDLBASE.H
C:\PROGRAM FILES (X86)\WINDOWS KITS\10\INCLUDE\10.0.17763.0\UM\CGUID.H
C:\PROGRAM FILES (X86)\WINDOWS KITS\10\INCLUDE\10.0.17763.0\UM\COML2API.H
C:\PROGRAM FILES (X86)\WINDOWS KITS\10\INCLUDE\10.0.17763.0\UM\OBJIDL.H
C:\PROGRAM FILES (X86)\WINDOWS KITS\10\INCLUDE\10.0.17763.0\UM\UNKNWN.H
C:\PROGRAM FILES (X86)\WINDOWS KITS\10\INCLUDE\10.0.17763.0\UM\PROPIDLBASE.H
C:\PROGRAM FILES (X86)\WINDOWS KITS\10\INCLUDE\10.0.17763.0\UM\OAIDL.H
C:\PROGRAM FILES (X86)\WINDOWS KITS\10\INCLUDE\10.0.17763.0\UM\URLMON.H
C:\PROGRAM FILES (X86)\WINDOWS KITS\10\INCLUDE\10.0.17763.0\UM\OLEIDL.H
C:\PROGRAM FILES (X86)\WINDOWS KITS\10\INCLUDE\10.0.17763.0\UM\SERVPROV.H
C:\PROGRAM FILES (X86)\WINDOWS KITS\10\INCLUDE\10.0.17763.0\UM\MSXML.H
C:\PROGRAM FILES (X86)\WINDOWS KITS\10\INCLUDE\10.0.17763.0\UM\PROPIDL.H
C:\PROGRAM FILES (X86)\WINDOWS KITS\10\INCLUDE\10.0.17763.0\UM\OLEAUTO.H
C:\PROGRAM FILES (X86)\WINDOWS KITS\10\INCLUDE\10.0.17763.0\UM\COMMDLG.H
C:\PROGRAM FILES (X86)\WINDOWS KITS\10\INCLUDE\10.0.17763.0\SHARED\STRALIGN.H
C:\PROGRAM FILES (X86)\WINDOWS KITS\10\INCLUDE\10.0.17763.0\UM\WINSVC.H
C:\PROGRAM FILES (X86)\WINDOWS KITS\10\INCLUDE\10.0.17763.0\UM\MCX.H
C:\PROGRAM FILES (X86)\WINDOWS KITS\10\INCLUDE\10.0.17763.0\UM\IMM.H
C:\PROGRAM FILES (X86)\WINDOWS KITS\10\INCLUDE\10.0.17763.0\UM\IME_CMODES.H
C:\USERS\GEORGEDRIPPER\SOURCE\REPOS\PROYECTO FINAL\EXTERNAL LIBRARIES\GLEW\INCLUDE\GL\GLEW.H
C:\PROGRAM FILES (X86)\WINDOWS KITS\10\INCLUDE\10.0.17763.0\UM\GL\GLU.H
C:\PROGRAM FILES (X86)\WINDOWS KITS\10\INCLUDE\10.0.17763.0\UM\GL\GL.H
C:\USERS\GEORGEDRIPPER\SOURCE\REPOS\PROYECTO FINAL\EXTERNAL LIBRARIES\GLFW\INCLUDE\GLFW\GLFW3.H
C:\USERS\GEORGEDRIPPER\SOURCE\REPOS\PROYECTO FINAL\PROYECTO FINAL\STB_IMAGE.H
C:\USERS\GEORGEDRIPPER\SOURCE\REPOS\PROYECTO FINAL\EXTERNAL LIBRARIES\GLM\GLM\GLM.HPP
C:\USERS\GEORGEDRIPPER\SOURCE\REPOS\PROYECTO FINAL\EXTERNAL LIBRARIES\GLM\GLM\DETAIL\_FIXES.HPP
C:\USERS\GEORGEDRIPPER\SOURCE\REPOS\PROYECTO FINAL\EXTERNAL LIBRARIES\GLM\GLM\DETAIL\SETUP.HPP
C:\PROGRAM FILES (X86)\MICROSOFT VISUAL STUDIO\2017\COMMUNITY\VC\TOOLS\MSVC\14.16.27023\INCLUDE\CASSERT
C:\PROGRAM FILES (X86)\WINDOWS KITS\10\INCLUDE\10.0.17763.0\UCRT\ASSERT.H
C:\USERS\GEORGEDRIPPER\SOURCE\REPOS\PROYECTO FINAL\EXTERNAL LIBRARIES\GLM\GLM\SIMD\PLATFORM.H
C:\PROGRAM FILES (X86)\MICROSOFT VISUAL STUDIO\2017\COMMUNITY\VC\TOOLS\MSVC\14.16.27023\INCLUDE\EMMINTRIN.H
C:\PROGRAM FILES (X86)\MICROSOFT VISUAL STUDIO\2017\COMMUNITY\VC\TOOLS\MSVC\14.16.27023\INCLUDE\XMMINTRIN.H
C:\PROGRAM FILES (X86)\MICROSOFT VISUAL STUDIO\2017\COMMUNITY\VC\TOOLS\MSVC\14.16.27023\INCLUDE\MMINTRIN.H
C:\USERS\GEORGEDRIPPER\SOURCE\REPOS\PROYECTO FINAL\EXTERNAL LIBRARIES\GLM\GLM\FWD.HPP
C:\USERS\GEORGEDRIPPER\SOURCE\REPOS\PROYECTO FINAL\EXTERNAL LIBRARIES\GLM\GLM\DETAIL\QUALIFIER.HPP
C:\USERS\GEORGEDRIPPER\SOURCE\REPOS\PROYECTO FINAL\EXTERNAL LIBRARIES\GLM\GLM\VEC2.HPP
C:\USERS\GEORGEDRIPPER\SOURCE\REPOS\PROYECTO FINAL\EXTERNAL LIBRARIES\GLM\GLM\EXT\VECTOR_BOOL2.HPP
C:\USERS\GEORGEDRIPPER\SOURCE\REPOS\PROYECTO FINAL\EXTERNAL LIBRARIES\GLM\GLM\DETAIL\TYPE_VEC2.HPP
C:\USERS\GEORGEDRIPPER\SOURCE\REPOS\PROYECTO FINAL\EXTERNAL LIBRARIES\GLM\GLM\DETAIL\TYPE_VEC2.INL
C:\USERS\GEORGEDRIPPER\SOURCE\REPOS\PROYECTO FINAL\EXTERNAL LIBRARIES\GLM\GLM\DETAIL\COMPUTE_VECTOR_RELATIONAL.HPP
C:\USERS\GEORGEDRIPPER\SOURCE\REPOS\PROYECTO FINAL\EXTERNAL LIBRARIES\GLM\GLM\EXT\VECTOR_BOOL2_PRECISION.HPP
C:\USERS\GEORGEDRIPPER\SOURCE\REPOS\PROYECTO FINAL\EXTERNAL LIBRARIES\GLM\GLM\EXT\VECTOR_FLOAT2.HPP
C:\USERS\GEORGEDRIPPER\SOURCE\REPOS\PROYECTO FINAL\EXTERNAL LIBRARIES\GLM\GLM\EXT\VECTOR_FLOAT2_PRECISION.HPP
C:\USERS\GEORGEDRIPPER\SOURCE\REPOS\PROYECTO FINAL\EXTERNAL LIBRARIES\GLM\GLM\EXT\VECTOR_DOUBLE2.HPP
C:\USERS\GEORGEDRIPPER\SOURCE\REPOS\PROYECTO FINAL\EXTERNAL LIBRARIES\GLM\GLM\EXT\VECTOR_DOUBLE2_PRECISION.HPP
C:\USERS\GEORGEDRIPPER\SOURCE\REPOS\PROYECTO FINAL\EXTERNAL LIBRARIES\GLM\GLM\EXT\VECTOR_INT2.HPP
C:\USERS\GEORGEDRIPPER\SOURCE\REPOS\PROYECTO FINAL\EXTERNAL LIBRARIES\GLM\GLM\EXT\VECTOR_INT2_PRECISION.HPP
C:\USERS\GEORGEDRIPPER\SOURCE\REPOS\PROYECTO FINAL\EXTERNAL LIBRARIES\GLM\GLM\EXT\VECTOR_UINT2.HPP
C:\USERS\GEORGEDRIPPER\SOURCE\REPOS\PROYECTO FINAL\EXTERNAL LIBRARIES\GLM\GLM\EXT\VECTOR_UINT2_PRECISION.HPP
C:\USERS\GEORGEDRIPPER\SOURCE\REPOS\PROYECTO FINAL\EXTERNAL LIBRARIES\GLM\GLM\VEC3.HPP
C:\USERS\GEORGEDRIPPER\SOURCE\REPOS\PROYECTO FINAL\EXTERNAL LIBRARIES\GLM\GLM\EXT\VECTOR_BOOL3.HPP
C:\USERS\GEORGEDRIPPER\SOURCE\REPOS\PROYECTO FINAL\EXTERNAL LIBRARIES\GLM\GLM\DETAIL\TYPE_VEC3.HPP
C:\USERS\GEORGEDRIPPER\SOURCE\REPOS\PROYECTO FINAL\EXTERNAL LIBRARIES\GLM\GLM\DETAIL\TYPE_VEC3.INL
C:\USERS\GEORGEDRIPPER\SOURCE\REPOS\PROYECTO FINAL\EXTERNAL LIBRARIES\GLM\GLM\EXT\VECTOR_BOOL3_PRECISION.HPP
C:\USERS\GEORGEDRIPPER\SOURCE\REPOS\PROYECTO FINAL\EXTERNAL LIBRARIES\GLM\GLM\EXT\VECTOR_FLOAT3.HPP
C:\USERS\GEORGEDRIPPER\SOURCE\REPOS\PROYECTO FINAL\EXTERNAL LIBRARIES\GLM\GLM\EXT\VECTOR_FLOAT3_PRECISION.HPP
C:\USERS\GEORGEDRIPPER\SOURCE\REPOS\PROYECTO FINAL\EXTERNAL LIBRARIES\GLM\GLM\EXT\VECTOR_DOUBLE3.HPP
C:\USERS\GEORGEDRIPPER\SOURCE\REPOS\PROYECTO FINAL\EXTERNAL LIBRARIES\GLM\GLM\EXT\VECTOR_DOUBLE3_PRECISION.HPP
C:\USERS\GEORGEDRIPPER\SOURCE\REPOS\PROYECTO FINAL\EXTERNAL LIBRARIES\GLM\GLM\EXT\VECTOR_INT3.HPP
C:\USERS\GEORGEDRIPPER\SOURCE\REPOS\PROYECTO FINAL\EXTERNAL LIBRARIES\GLM\GLM\EXT\VECTOR_INT3_PRECISION.HPP
C:\USERS\GEORGEDRIPPER\SOURCE\REPOS\PROYECTO FINAL\EXTERNAL LIBRARIES\GLM\GLM\EXT\VECTOR_UINT3.HPP
C:\USERS\GEORGEDRIPPER\SOURCE\REPOS\PROYECTO FINAL\EXTERNAL LIBRARIES\GLM\GLM\EXT\VECTOR_UINT3_PRECISION.HPP
C:\USERS\GEORGEDRIPPER\SOURCE\REPOS\PROYECTO FINAL\EXTERNAL LIBRARIES\GLM\GLM\VEC4.HPP
C:\USERS\GEORGEDRIPPER\SOURCE\REPOS\PROYECTO FINAL\EXTERNAL LIBRARIES\GLM\GLM\EXT\VECTOR_BOOL4.HPP
C:\USERS\GEORGEDRIPPER\SOURCE\REPOS\PROYECTO FINAL\EXTERNAL LIBRARIES\GLM\GLM\DETAIL\TYPE_VEC4.HPP
C:\USERS\GEORGEDRIPPER\SOURCE\REPOS\PROYECTO FINAL\EXTERNAL LIBRARIES\GLM\GLM\DETAIL\TYPE_VEC4.INL
C:\USERS\GEORGEDRIPPER\SOURCE\REPOS\PROYECTO FINAL\EXTERNAL LIBRARIES\GLM\GLM\DETAIL\TYPE_VEC4_SIMD.INL
C:\USERS\GEORGEDRIPPER\SOURCE\REPOS\PROYECTO FINAL\EXTERNAL LIBRARIES\GLM\GLM\EXT\VECTOR_BOOL4_PRECISION.HPP
C:\USERS\GEORGEDRIPPER\SOURCE\REPOS\PROYECTO FINAL\EXTERNAL LIBRARIES\GLM\GLM\EXT\VECTOR_FLOAT4.HPP
C:\USERS\GEORGEDRIPPER\SOURCE\REPOS\PROYECTO FINAL\EXTERNAL LIBRARIES\GLM\GLM\EXT\VECTOR_FLOAT4_PRECISION.HPP
C:\USERS\GEORGEDRIPPER\SOURCE\REPOS\PROYECTO FINAL\EXTERNAL LIBRARIES\GLM\GLM\EXT\VECTOR_DOUBLE4.HPP
C:\USERS\GEORGEDRIPPER\SOURCE\REPOS\PROYECTO FINAL\EXTERNAL LIBRARIES\GLM\GLM\EXT\VECTOR_DOUBLE4_PRECISION.HPP
C:\USERS\GEORGEDRIPPER\SOURCE\REPOS\PROYECTO FINAL\EXTERNAL LIBRARIES\GLM\GLM\EXT\VECTOR_INT4.HPP
C:\USERS\GEORGEDRIPPER\SOURCE\REPOS\PROYECTO FINAL\EXTERNAL LIBRARIES\GLM\GLM\EXT\VECTOR_INT4_PRECISION.HPP
C:\USERS\GEORGEDRIPPER\SOURCE\REPOS\PROYECTO FINAL\EXTERNAL LIBRARIES\GLM\GLM\EXT\VECTOR_UINT4.HPP
C:\USERS\GEORGEDRIPPER\SOURCE\REPOS\PROYECTO FINAL\EXTERNAL LIBRARIES\GLM\GLM\EXT\VECTOR_UINT4_PRECISION.HPP
C:\USERS\GEORGEDRIPPER\SOURCE\REPOS\PROYECTO FINAL\EXTERNAL LIBRARIES\GLM\GLM\MAT2X2.HPP
C:\USERS\GEORGEDRIPPER\SOURCE\REPOS\PROYECTO FINAL\EXTERNAL LIBRARIES\GLM\GLM\EXT\MATRIX_DOUBLE2X2.HPP
C:\USERS\GEORGEDRIPPER\SOURCE\REPOS\PROYECTO FINAL\EXTERNAL LIBRARIES\GLM\GLM\DETAIL\TYPE_MAT2X2.HPP
C:\USERS\GEORGEDRIPPER\SOURCE\REPOS\PROYECTO FINAL\EXTERNAL LIBRARIES\GLM\GLM\DETAIL\TYPE_MAT2X2.INL
C:\USERS\GEORGEDRIPPER\SOURCE\REPOS\PROYECTO FINAL\EXTERNAL LIBRARIES\GLM\GLM\MATRIX.HPP
C:\USERS\GEORGEDRIPPER\SOURCE\REPOS\PROYECTO FINAL\EXTERNAL LIBRARIES\GLM\GLM\MAT2X3.HPP
C:\USERS\GEORGEDRIPPER\SOURCE\REPOS\PROYECTO FINAL\EXTERNAL LIBRARIES\GLM\GLM\EXT\MATRIX_DOUBLE2X3.HPP
C:\USERS\GEORGEDRIPPER\SOURCE\REPOS\PROYECTO FINAL\EXTERNAL LIBRARIES\GLM\GLM\DETAIL\TYPE_MAT2X3.HPP
C:\USERS\GEORGEDRIPPER\SOURCE\REPOS\PROYECTO FINAL\EXTERNAL LIBRARIES\GLM\GLM\DETAIL\TYPE_MAT2X3.INL
C:\USERS\GEORGEDRIPPER\SOURCE\REPOS\PROYECTO FINAL\EXTERNAL LIBRARIES\GLM\GLM\EXT\MATRIX_DOUBLE2X3_PRECISION.HPP
C:\USERS\GEORGEDRIPPER\SOURCE\REPOS\PROYECTO FINAL\EXTERNAL LIBRARIES\GLM\GLM\EXT\MATRIX_FLOAT2X3.HPP
C:\USERS\GEORGEDRIPPER\SOURCE\REPOS\PROYECTO FINAL\EXTERNAL LIBRARIES\GLM\GLM\EXT\MATRIX_FLOAT2X3_PRECISION.HPP
C:\USERS\GEORGEDRIPPER\SOURCE\REPOS\PROYECTO FINAL\EXTERNAL LIBRARIES\GLM\GLM\MAT2X4.HPP
C:\USERS\GEORGEDRIPPER\SOURCE\REPOS\PROYECTO FINAL\EXTERNAL LIBRARIES\GLM\GLM\EXT\MATRIX_DOUBLE2X4.HPP
C:\USERS\GEORGEDRIPPER\SOURCE\REPOS\PROYECTO FINAL\EXTERNAL LIBRARIES\GLM\GLM\DETAIL\TYPE_MAT2X4.HPP
C:\USERS\GEORGEDRIPPER\SOURCE\REPOS\PROYECTO FINAL\EXTERNAL LIBRARIES\GLM\GLM\DETAIL\TYPE_MAT2X4.INL
C:\USERS\GEORGEDRIPPER\SOURCE\REPOS\PROYECTO FINAL\EXTERNAL LIBRARIES\GLM\GLM\EXT\MATRIX_DOUBLE2X4_PRECISION.HPP
C:\USERS\GEORGEDRIPPER\SOURCE\REPOS\PROYECTO FINAL\EXTERNAL LIBRARIES\GLM\GLM\EXT\MATRIX_FLOAT2X4.HPP
C:\USERS\GEORGEDRIPPER\SOURCE\REPOS\PROYECTO FINAL\EXTERNAL LIBRARIES\GLM\GLM\EXT\MATRIX_FLOAT2X4_PRECISION.HPP
C:\USERS\GEORGEDRIPPER\SOURCE\REPOS\PROYECTO FINAL\EXTERNAL LIBRARIES\GLM\GLM\MAT3X2.HPP
C:\USERS\GEORGEDRIPPER\SOURCE\REPOS\PROYECTO FINAL\EXTERNAL LIBRARIES\GLM\GLM\EXT\MATRIX_DOUBLE3X2.HPP
C:\USERS\GEORGEDRIPPER\SOURCE\REPOS\PROYECTO FINAL\EXTERNAL LIBRARIES\GLM\GLM\DETAIL\TYPE_MAT3X2.HPP
C:\USERS\GEORGEDRIPPER\SOURCE\REPOS\PROYECTO FINAL\EXTERNAL LIBRARIES\GLM\GLM\DETAIL\TYPE_MAT3X2.INL
C:\USERS\GEORGEDRIPPER\SOURCE\REPOS\PROYECTO FINAL\EXTERNAL LIBRARIES\GLM\GLM\EXT\MATRIX_DOUBLE3X2_PRECISION.HPP
C:\USERS\GEORGEDRIPPER\SOURCE\REPOS\PROYECTO FINAL\EXTERNAL LIBRARIES\GLM\GLM\EXT\MATRIX_FLOAT3X2.HPP
C:\USERS\GEORGEDRIPPER\SOURCE\REPOS\PROYECTO FINAL\EXTERNAL LIBRARIES\GLM\GLM\EXT\MATRIX_FLOAT3X2_PRECISION.HPP
C:\USERS\GEORGEDRIPPER\SOURCE\REPOS\PROYECTO FINAL\EXTERNAL LIBRARIES\GLM\GLM\MAT3X3.HPP
C:\USERS\GEORGEDRIPPER\SOURCE\REPOS\PROYECTO FINAL\EXTERNAL LIBRARIES\GLM\GLM\EXT\MATRIX_DOUBLE3X3.HPP
C:\USERS\GEORGEDRIPPER\SOURCE\REPOS\PROYECTO FINAL\EXTERNAL LIBRARIES\GLM\GLM\DETAIL\TYPE_MAT3X3.HPP
C:\USERS\GEORGEDRIPPER\SOURCE\REPOS\PROYECTO FINAL\EXTERNAL LIBRARIES\GLM\GLM\DETAIL\TYPE_MAT3X3.INL
C:\USERS\GEORGEDRIPPER\SOURCE\REPOS\PROYECTO FINAL\EXTERNAL LIBRARIES\GLM\GLM\EXT\MATRIX_DOUBLE3X3_PRECISION.HPP
C:\USERS\GEORGEDRIPPER\SOURCE\REPOS\PROYECTO FINAL\EXTERNAL LIBRARIES\GLM\GLM\EXT\MATRIX_FLOAT3X3.HPP
C:\USERS\GEORGEDRIPPER\SOURCE\REPOS\PROYECTO FINAL\EXTERNAL LIBRARIES\GLM\GLM\EXT\MATRIX_FLOAT3X3_PRECISION.HPP
C:\USERS\GEORGEDRIPPER\SOURCE\REPOS\PROYECTO FINAL\EXTERNAL LIBRARIES\GLM\GLM\MAT3X4.HPP
C:\USERS\GEORGEDRIPPER\SOURCE\REPOS\PROYECTO FINAL\EXTERNAL LIBRARIES\GLM\GLM\EXT\MATRIX_DOUBLE3X4.HPP
C:\USERS\GEORGEDRIPPER\SOURCE\REPOS\PROYECTO FINAL\EXTERNAL LIBRARIES\GLM\GLM\DETAIL\TYPE_MAT3X4.HPP
C:\USERS\GEORGEDRIPPER\SOURCE\REPOS\PROYECTO FINAL\EXTERNAL LIBRARIES\GLM\GLM\DETAIL\TYPE_MAT3X4.INL
C:\USERS\GEORGEDRIPPER\SOURCE\REPOS\PROYECTO FINAL\EXTERNAL LIBRARIES\GLM\GLM\EXT\MATRIX_DOUBLE3X4_PRECISION.HPP
C:\USERS\GEORGEDRIPPER\SOURCE\REPOS\PROYECTO FINAL\EXTERNAL LIBRARIES\GLM\GLM\EXT\MATRIX_FLOAT3X4.HPP
C:\USERS\GEORGEDRIPPER\SOURCE\REPOS\PROYECTO FINAL\EXTERNAL LIBRARIES\GLM\GLM\EXT\MATRIX_FLOAT3X4_PRECISION.HPP
C:\USERS\GEORGEDRIPPER\SOURCE\REPOS\PROYECTO FINAL\EXTERNAL LIBRARIES\GLM\GLM\MAT4X2.HPP
C:\USERS\GEORGEDRIPPER\SOURCE\REPOS\PROYECTO FINAL\EXTERNAL LIBRARIES\GLM\GLM\EXT\MATRIX_DOUBLE4X2.HPP
C:\USERS\GEORGEDRIPPER\SOURCE\REPOS\PROYECTO FINAL\EXTERNAL LIBRARIES\GLM\GLM\DETAIL\TYPE_MAT4X2.HPP
C:\USERS\GEORGEDRIPPER\SOURCE\REPOS\PROYECTO FINAL\EXTERNAL LIBRARIES\GLM\GLM\DETAIL\TYPE_MAT4X2.INL
C:\USERS\GEORGEDRIPPER\SOURCE\REPOS\PROYECTO FINAL\EXTERNAL LIBRARIES\GLM\GLM\EXT\MATRIX_DOUBLE4X2_PRECISION.HPP
C:\USERS\GEORGEDRIPPER\SOURCE\REPOS\PROYECTO FINAL\EXTERNAL LIBRARIES\GLM\GLM\EXT\MATRIX_FLOAT4X2.HPP
C:\USERS\GEORGEDRIPPER\SOURCE\REPOS\PROYECTO FINAL\EXTERNAL LIBRARIES\GLM\GLM\EXT\MATRIX_FLOAT4X2_PRECISION.HPP
C:\USERS\GEORGEDRIPPER\SOURCE\REPOS\PROYECTO FINAL\EXTERNAL LIBRARIES\GLM\GLM\MAT4X3.HPP
C:\USERS\GEORGEDRIPPER\SOURCE\REPOS\PROYECTO FINAL\EXTERNAL LIBRARIES\GLM\GLM\EXT\MATRIX_DOUBLE4X3.HPP
C:\USERS\GEORGEDRIPPER\SOURCE\REPOS\PROYECTO FINAL\EXTERNAL LIBRARIES\GLM\GLM\DETAIL\TYPE_MAT4X3.HPP
C:\USERS\GEORGEDRIPPER\SOURCE\REPOS\PROYECTO FINAL\EXTERNAL LIBRARIES\GLM\GLM\DETAIL\TYPE_MAT4X3.INL
C:\USERS\GEORGEDRIPPER\SOURCE\REPOS\PROYECTO FINAL\EXTERNAL LIBRARIES\GLM\GLM\EXT\MATRIX_DOUBLE4X3_PRECISION.HPP
C:\USERS\GEORGEDRIPPER\SOURCE\REPOS\PROYECTO FINAL\EXTERNAL LIBRARIES\GLM\GLM\EXT\MATRIX_FLOAT4X3.HPP
C:\USERS\GEORGEDRIPPER\SOURCE\REPOS\PROYECTO FINAL\EXTERNAL LIBRARIES\GLM\GLM\EXT\MATRIX_FLOAT4X3_PRECISION.HPP
C:\USERS\GEORGEDRIPPER\SOURCE\REPOS\PROYECTO FINAL\EXTERNAL LIBRARIES\GLM\GLM\MAT4X4.HPP
C:\USERS\GEORGEDRIPPER\SOURCE\REPOS\PROYECTO FINAL\EXTERNAL LIBRARIES\GLM\GLM\EXT\MATRIX_DOUBLE4X4.HPP
C:\USERS\GEORGEDRIPPER\SOURCE\REPOS\PROYECTO FINAL\EXTERNAL LIBRARIES\GLM\GLM\DETAIL\TYPE_MAT4X4.HPP
C:\USERS\GEORGEDRIPPER\SOURCE\REPOS\PROYECTO FINAL\EXTERNAL LIBRARIES\GLM\GLM\DETAIL\TYPE_MAT4X4.INL
C:\USERS\GEORGEDRIPPER\SOURCE\REPOS\PROYECTO FINAL\EXTERNAL LIBRARIES\GLM\GLM\DETAIL\TYPE_MAT4X4_SIMD.INL
C:\USERS\GEORGEDRIPPER\SOURCE\REPOS\PROYECTO FINAL\EXTERNAL LIBRARIES\GLM\GLM\EXT\MATRIX_DOUBLE4X4_PRECISION.HPP
C:\USERS\GEORGEDRIPPER\SOURCE\REPOS\PROYECTO FINAL\EXTERNAL LIBRARIES\GLM\GLM\EXT\MATRIX_FLOAT4X4.HPP
C:\USERS\GEORGEDRIPPER\SOURCE\REPOS\PROYECTO FINAL\EXTERNAL LIBRARIES\GLM\GLM\EXT\MATRIX_FLOAT4X4_PRECISION.HPP
C:\USERS\GEORGEDRIPPER\SOURCE\REPOS\PROYECTO FINAL\EXTERNAL LIBRARIES\GLM\GLM\DETAIL\FUNC_MATRIX.INL
C:\USERS\GEORGEDRIPPER\SOURCE\REPOS\PROYECTO FINAL\EXTERNAL LIBRARIES\GLM\GLM\GEOMETRIC.HPP
C:\USERS\GEORGEDRIPPER\SOURCE\REPOS\PROYECTO FINAL\EXTERNAL LIBRARIES\GLM\GLM\DETAIL\FUNC_GEOMETRIC.INL
C:\USERS\GEORGEDRIPPER\SOURCE\REPOS\PROYECTO FINAL\EXTERNAL LIBRARIES\GLM\GLM\EXPONENTIAL.HPP
C:\USERS\GEORGEDRIPPER\SOURCE\REPOS\PROYECTO FINAL\EXTERNAL LIBRARIES\GLM\GLM\DETAIL\TYPE_VEC1.HPP
C:\USERS\GEORGEDRIPPER\SOURCE\REPOS\PROYECTO FINAL\EXTERNAL LIBRARIES\GLM\GLM\DETAIL\TYPE_VEC1.INL
C:\USERS\GEORGEDRIPPER\SOURCE\REPOS\PROYECTO FINAL\EXTERNAL LIBRARIES\GLM\GLM\DETAIL\FUNC_EXPONENTIAL.INL
C:\USERS\GEORGEDRIPPER\SOURCE\REPOS\PROYECTO FINAL\EXTERNAL LIBRARIES\GLM\GLM\VECTOR_RELATIONAL.HPP
C:\USERS\GEORGEDRIPPER\SOURCE\REPOS\PROYECTO FINAL\EXTERNAL LIBRARIES\GLM\GLM\DETAIL\FUNC_VECTOR_RELATIONAL.INL
C:\USERS\GEORGEDRIPPER\SOURCE\REPOS\PROYECTO FINAL\EXTERNAL LIBRARIES\GLM\GLM\DETAIL\FUNC_VECTOR_RELATIONAL_SIMD.INL
C:\USERS\GEORGEDRIPPER\SOURCE\REPOS\PROYECTO FINAL\EXTERNAL LIBRARIES\GLM\GLM\DETAIL\_VECTORIZE.HPP
C:\USERS\GEORGEDRIPPER\SOURCE\REPOS\PROYECTO FINAL\EXTERNAL LIBRARIES\GLM\GLM\DETAIL\FUNC_EXPONENTIAL_SIMD.INL
C:\USERS\GEORGEDRIPPER\SOURCE\REPOS\PROYECTO FINAL\EXTERNAL LIBRARIES\GLM\GLM\SIMD\EXPONENTIAL.H
C:\USERS\GEORGEDRIPPER\SOURCE\REPOS\PROYECTO FINAL\EXTERNAL LIBRARIES\GLM\GLM\COMMON.HPP
C:\USERS\GEORGEDRIPPER\SOURCE\REPOS\PROYECTO FINAL\EXTERNAL LIBRARIES\GLM\GLM\DETAIL\FUNC_COMMON.INL
C:\USERS\GEORGEDRIPPER\SOURCE\REPOS\PROYECTO FINAL\EXTERNAL LIBRARIES\GLM\GLM\DETAIL\COMPUTE_COMMON.HPP
C:\USERS\GEORGEDRIPPER\SOURCE\REPOS\PROYECTO FINAL\EXTERNAL LIBRARIES\GLM\GLM\DETAIL\FUNC_COMMON_SIMD.INL
C:\USERS\GEORGEDRIPPER\SOURCE\REPOS\PROYECTO FINAL\EXTERNAL LIBRARIES\GLM\GLM\SIMD\COMMON.H
C:\PROGRAM FILES (X86)\MICROSOFT VISUAL STUDIO\2017\COMMUNITY\VC\TOOLS\MSVC\14.16.27023\INCLUDE\IMMINTRIN.H
C:\PROGRAM FILES (X86)\MICROSOFT VISUAL STUDIO\2017\COMMUNITY\VC\TOOLS\MSVC\14.16.27023\INCLUDE\WMMINTRIN.H
C:\PROGRAM FILES (X86)\MICROSOFT VISUAL STUDIO\2017\COMMUNITY\VC\TOOLS\MSVC\14.16.27023\INCLUDE\NMMINTRIN.H
C:\PROGRAM FILES (X86)\MICROSOFT VISUAL STUDIO\2017\COMMUNITY\VC\TOOLS\MSVC\14.16.27023\INCLUDE\SMMINTRIN.H
C:\PROGRAM FILES (X86)\MICROSOFT VISUAL STUDIO\2017\COMMUNITY\VC\TOOLS\MSVC\14.16.27023\INCLUDE\TMMINTRIN.H
C:\PROGRAM FILES (X86)\MICROSOFT VISUAL STUDIO\2017\COMMUNITY\VC\TOOLS\MSVC\14.16.27023\INCLUDE\PMMINTRIN.H
C:\PROGRAM FILES (X86)\MICROSOFT VISUAL STUDIO\2017\COMMUNITY\VC\TOOLS\MSVC\14.16.27023\INCLUDE\ZMMINTRIN.H
C:\USERS\GEORGEDRIPPER\SOURCE\REPOS\PROYECTO FINAL\EXTERNAL LIBRARIES\GLM\GLM\DETAIL\FUNC_GEOMETRIC_SIMD.INL
C:\USERS\GEORGEDRIPPER\SOURCE\REPOS\PROYECTO FINAL\EXTERNAL LIBRARIES\GLM\GLM\SIMD\GEOMETRIC.H
C:\USERS\GEORGEDRIPPER\SOURCE\REPOS\PROYECTO FINAL\EXTERNAL LIBRARIES\GLM\GLM\DETAIL\FUNC_MATRIX_SIMD.INL
C:\USERS\GEORGEDRIPPER\SOURCE\REPOS\PROYECTO FINAL\EXTERNAL LIBRARIES\GLM\GLM\SIMD\MATRIX.H
C:\USERS\GEORGEDRIPPER\SOURCE\REPOS\PROYECTO FINAL\EXTERNAL LIBRARIES\GLM\GLM\EXT\MATRIX_DOUBLE2X2_PRECISION.HPP
C:\USERS\GEORGEDRIPPER\SOURCE\REPOS\PROYECTO FINAL\EXTERNAL LIBRARIES\GLM\GLM\EXT\MATRIX_FLOAT2X2.HPP
C:\USERS\GEORGEDRIPPER\SOURCE\REPOS\PROYECTO FINAL\EXTERNAL LIBRARIES\GLM\GLM\EXT\MATRIX_FLOAT2X2_PRECISION.HPP
C:\USERS\GEORGEDRIPPER\SOURCE\REPOS\PROYECTO FINAL\EXTERNAL LIBRARIES\GLM\GLM\TRIGONOMETRIC.HPP
C:\USERS\GEORGEDRIPPER\SOURCE\REPOS\PROYECTO FINAL\EXTERNAL LIBRARIES\GLM\GLM\DETAIL\FUNC_TRIGONOMETRIC.INL
C:\USERS\GEORGEDRIPPER\SOURCE\REPOS\PROYECTO FINAL\EXTERNAL LIBRARIES\GLM\GLM\DETAIL\FUNC_TRIGONOMETRIC_SIMD.INL
C:\USERS\GEORGEDRIPPER\SOURCE\REPOS\PROYECTO FINAL\EXTERNAL LIBRARIES\GLM\GLM\PACKING.HPP
C:\USERS\GEORGEDRIPPER\SOURCE\REPOS\PROYECTO FINAL\EXTERNAL LIBRARIES\GLM\GLM\DETAIL\FUNC_PACKING.INL
C:\USERS\GEORGEDRIPPER\SOURCE\REPOS\PROYECTO FINAL\EXTERNAL LIBRARIES\GLM\GLM\DETAIL\TYPE_HALF.HPP
C:\USERS\GEORGEDRIPPER\SOURCE\REPOS\PROYECTO FINAL\EXTERNAL LIBRARIES\GLM\GLM\DETAIL\TYPE_HALF.INL
C:\USERS\GEORGEDRIPPER\SOURCE\REPOS\PROYECTO FINAL\EXTERNAL LIBRARIES\GLM\GLM\DETAIL\FUNC_PACKING_SIMD.INL
C:\USERS\GEORGEDRIPPER\SOURCE\REPOS\PROYECTO FINAL\EXTERNAL LIBRARIES\GLM\GLM\INTEGER.HPP
C:\USERS\GEORGEDRIPPER\SOURCE\REPOS\PROYECTO FINAL\EXTERNAL LIBRARIES\GLM\GLM\DETAIL\FUNC_INTEGER.INL
C:\PROGRAM FILES (X86)\MICROSOFT VISUAL STUDIO\2017\COMMUNITY\VC\TOOLS\MSVC\14.16.27023\INCLUDE\INTRIN.H
C:\PROGRAM FILES (X86)\MICROSOFT VISUAL STUDIO\2017\COMMUNITY\VC\TOOLS\MSVC\14.16.27023\INCLUDE\SETJMP.H
C:\PROGRAM FILES (X86)\MICROSOFT VISUAL STUDIO\2017\COMMUNITY\VC\TOOLS\MSVC\14.16.27023\INCLUDE\AMMINTRIN.H
C:\PROGRAM FILES (X86)\MICROSOFT VISUAL STUDIO\2017\COMMUNITY\VC\TOOLS\MSVC\14.16.27023\INCLUDE\MM3DNOW.H
C:\USERS\GEORGEDRIPPER\SOURCE\REPOS\PROYECTO FINAL\EXTERNAL LIBRARIES\GLM\GLM\DETAIL\FUNC_INTEGER_SIMD.INL
C:\USERS\GEORGEDRIPPER\SOURCE\REPOS\PROYECTO FINAL\EXTERNAL LIBRARIES\GLM\GLM\SIMD\INTEGER.H
C:\USERS\GEORGEDRIPPER\SOURCE\REPOS\PROYECTO FINAL\EXTERNAL LIBRARIES\GLM\GLM\GTC\MATRIX_TRANSFORM.HPP
C:\USERS\GEORGEDRIPPER\SOURCE\REPOS\PROYECTO FINAL\EXTERNAL LIBRARIES\GLM\GLM\EXT\MATRIX_PROJECTION.HPP
C:\USERS\GEORGEDRIPPER\SOURCE\REPOS\PROYECTO FINAL\EXTERNAL LIBRARIES\GLM\GLM\GTC\CONSTANTS.HPP
C:\USERS\GEORGEDRIPPER\SOURCE\REPOS\PROYECTO FINAL\EXTERNAL LIBRARIES\GLM\GLM\EXT\SCALAR_CONSTANTS.HPP
C:\USERS\GEORGEDRIPPER\SOURCE\REPOS\PROYECTO FINAL\EXTERNAL LIBRARIES\GLM\GLM\EXT\SCALAR_CONSTANTS.INL
C:\USERS\GEORGEDRIPPER\SOURCE\REPOS\PROYECTO FINAL\EXTERNAL LIBRARIES\GLM\GLM\GTC\CONSTANTS.INL
C:\USERS\GEORGEDRIPPER\SOURCE\REPOS\PROYECTO FINAL\EXTERNAL LIBRARIES\GLM\GLM\EXT\MATRIX_PROJECTION.INL
C:\USERS\GEORGEDRIPPER\SOURCE\REPOS\PROYECTO FINAL\EXTERNAL LIBRARIES\GLM\GLM\EXT\MATRIX_CLIP_SPACE.HPP
C:\USERS\GEORGEDRIPPER\SOURCE\REPOS\PROYECTO FINAL\EXTERNAL LIBRARIES\GLM\GLM\EXT\MATRIX_CLIP_SPACE.INL
C:\USERS\GEORGEDRIPPER\SOURCE\REPOS\PROYECTO FINAL\EXTERNAL LIBRARIES\GLM\GLM\EXT\MATRIX_TRANSFORM.HPP
C:\USERS\GEORGEDRIPPER\SOURCE\REPOS\PROYECTO FINAL\EXTERNAL LIBRARIES\GLM\GLM\EXT\MATRIX_TRANSFORM.INL
C:\USERS\GEORGEDRIPPER\SOURCE\REPOS\PROYECTO FINAL\EXTERNAL LIBRARIES\GLM\GLM\GTC\MATRIX_TRANSFORM.INL
C:\USERS\GEORGEDRIPPER\SOURCE\REPOS\PROYECTO FINAL\EXTERNAL LIBRARIES\GLM\GLM\GTC\TYPE_PTR.HPP
C:\USERS\GEORGEDRIPPER\SOURCE\REPOS\PROYECTO FINAL\EXTERNAL LIBRARIES\GLM\GLM\GTC\QUATERNION.HPP
C:\USERS\GEORGEDRIPPER\SOURCE\REPOS\PROYECTO FINAL\EXTERNAL LIBRARIES\GLM\GLM\EXT\VECTOR_RELATIONAL.HPP
C:\USERS\GEORGEDRIPPER\SOURCE\REPOS\PROYECTO FINAL\EXTERNAL LIBRARIES\GLM\GLM\EXT\VECTOR_RELATIONAL.INL
C:\USERS\GEORGEDRIPPER\SOURCE\REPOS\PROYECTO FINAL\EXTERNAL LIBRARIES\GLM\GLM\DETAIL\TYPE_FLOAT.HPP
C:\USERS\GEORGEDRIPPER\SOURCE\REPOS\PROYECTO FINAL\EXTERNAL LIBRARIES\GLM\GLM\EXT\QUATERNION_COMMON.HPP
C:\USERS\GEORGEDRIPPER\SOURCE\REPOS\PROYECTO FINAL\EXTERNAL LIBRARIES\GLM\GLM\EXT\QUATERNION_GEOMETRIC.HPP
C:\USERS\GEORGEDRIPPER\SOURCE\REPOS\PROYECTO FINAL\EXTERNAL LIBRARIES\GLM\GLM\EXT\QUATERNION_GEOMETRIC.INL
C:\USERS\GEORGEDRIPPER\SOURCE\REPOS\PROYECTO FINAL\EXTERNAL LIBRARIES\GLM\GLM\EXT\QUATERNION_COMMON.INL
C:\USERS\GEORGEDRIPPER\SOURCE\REPOS\PROYECTO FINAL\EXTERNAL LIBRARIES\GLM\GLM\EXT\QUATERNION_COMMON_SIMD.INL
C:\USERS\GEORGEDRIPPER\SOURCE\REPOS\PROYECTO FINAL\EXTERNAL LIBRARIES\GLM\GLM\EXT\QUATERNION_FLOAT.HPP
C:\USERS\GEORGEDRIPPER\SOURCE\REPOS\PROYECTO FINAL\EXTERNAL LIBRARIES\GLM\GLM\DETAIL\TYPE_QUAT.HPP
C:\USERS\GEORGEDRIPPER\SOURCE\REPOS\PROYECTO FINAL\EXTERNAL LIBRARIES\GLM\GLM\EXT\QUATERNION_RELATIONAL.HPP
C:\USERS\GEORGEDRIPPER\SOURCE\REPOS\PROYECTO FINAL\EXTERNAL LIBRARIES\GLM\GLM\EXT\QUATERNION_RELATIONAL.INL
C:\USERS\GEORGEDRIPPER\SOURCE\REPOS\PROYECTO FINAL\EXTERNAL LIBRARIES\GLM\GLM\DETAIL\TYPE_QUAT.INL
C:\USERS\GEORGEDRIPPER\SOURCE\REPOS\PROYECTO FINAL\EXTERNAL LIBRARIES\GLM\GLM\DETAIL\TYPE_QUAT_SIMD.INL
C:\USERS\GEORGEDRIPPER\SOURCE\REPOS\PROYECTO FINAL\EXTERNAL LIBRARIES\GLM\GLM\EXT\QUATERNION_FLOAT_PRECISION.HPP
C:\USERS\GEORGEDRIPPER\SOURCE\REPOS\PROYECTO FINAL\EXTERNAL LIBRARIES\GLM\GLM\EXT\QUATERNION_DOUBLE.HPP
C:\USERS\GEORGEDRIPPER\SOURCE\REPOS\PROYECTO FINAL\EXTERNAL LIBRARIES\GLM\GLM\EXT\QUATERNION_DOUBLE_PRECISION.HPP
C:\USERS\GEORGEDRIPPER\SOURCE\REPOS\PROYECTO FINAL\EXTERNAL LIBRARIES\GLM\GLM\EXT\QUATERNION_TRIGONOMETRIC.HPP
C:\USERS\GEORGEDRIPPER\SOURCE\REPOS\PROYECTO FINAL\EXTERNAL LIBRARIES\GLM\GLM\EXT\QUATERNION_TRIGONOMETRIC.INL
C:\USERS\GEORGEDRIPPER\SOURCE\REPOS\PROYECTO FINAL\EXTERNAL LIBRARIES\GLM\GLM\EXT\QUATERNION_TRANSFORM.HPP
C:\USERS\GEORGEDRIPPER\SOURCE\REPOS\PROYECTO FINAL\EXTERNAL LIBRARIES\GLM\GLM\EXT\QUATERNION_TRANSFORM.INL
C:\USERS\GEORGEDRIPPER\SOURCE\REPOS\PROYECTO FINAL\EXTERNAL LIBRARIES\GLM\GLM\GTC\QUATERNION.INL
C:\USERS\GEORGEDRIPPER\SOURCE\REPOS\PROYECTO FINAL\EXTERNAL LIBRARIES\GLM\GLM\GTC\EPSILON.HPP
C:\USERS\GEORGEDRIPPER\SOURCE\REPOS\PROYECTO FINAL\EXTERNAL LIBRARIES\GLM\GLM\GTC\EPSILON.INL
C:\USERS\GEORGEDRIPPER\SOURCE\REPOS\PROYECTO FINAL\EXTERNAL LIBRARIES\GLM\GLM\GTC\QUATERNION_SIMD.INL
C:\USERS\GEORGEDRIPPER\SOURCE\REPOS\PROYECTO FINAL\EXTERNAL LIBRARIES\GLM\GLM\GTC\VEC1.HPP
C:\USERS\GEORGEDRIPPER\SOURCE\REPOS\PROYECTO FINAL\EXTERNAL LIBRARIES\GLM\GLM\EXT\VECTOR_BOOL1.HPP
C:\USERS\GEORGEDRIPPER\SOURCE\REPOS\PROYECTO FINAL\EXTERNAL LIBRARIES\GLM\GLM\EXT\VECTOR_BOOL1_PRECISION.HPP
C:\USERS\GEORGEDRIPPER\SOURCE\REPOS\PROYECTO FINAL\EXTERNAL LIBRARIES\GLM\GLM\EXT\VECTOR_FLOAT1.HPP
C:\USERS\GEORGEDRIPPER\SOURCE\REPOS\PROYECTO FINAL\EXTERNAL LIBRARIES\GLM\GLM\EXT\VECTOR_FLOAT1_PRECISION.HPP
C:\USERS\GEORGEDRIPPER\SOURCE\REPOS\PROYECTO FINAL\EXTERNAL LIBRARIES\GLM\GLM\EXT\VECTOR_DOUBLE1.HPP
C:\USERS\GEORGEDRIPPER\SOURCE\REPOS\PROYECTO FINAL\EXTERNAL LIBRARIES\GLM\GLM\EXT\VECTOR_DOUBLE1_PRECISION.HPP
C:\USERS\GEORGEDRIPPER\SOURCE\REPOS\PROYECTO FINAL\EXTERNAL LIBRARIES\GLM\GLM\EXT\VECTOR_INT1.HPP
C:\USERS\GEORGEDRIPPER\SOURCE\REPOS\PROYECTO FINAL\EXTERNAL LIBRARIES\GLM\GLM\EXT\VECTOR_INT1_PRECISION.HPP
C:\USERS\GEORGEDRIPPER\SOURCE\REPOS\PROYECTO FINAL\EXTERNAL LIBRARIES\GLM\GLM\EXT\VECTOR_UINT1.HPP
C:\USERS\GEORGEDRIPPER\SOURCE\REPOS\PROYECTO FINAL\EXTERNAL LIBRARIES\GLM\GLM\EXT\VECTOR_UINT1_PRECISION.HPP
C:\USERS\GEORGEDRIPPER\SOURCE\REPOS\PROYECTO FINAL\EXTERNAL LIBRARIES\GLM\GLM\GTC\TYPE_PTR.INL
C:\USERS\GEORGEDRIPPER\SOURCE\REPOS\PROYECTO FINAL\PROYECTO FINAL\SOIL2\SOIL2.H
C:\USERS\GEORGEDRIPPER\SOURCE\REPOS\PROYECTO FINAL\PROYECTO FINAL\SHADER.H
C:\PROGRAM FILES (X86)\MICROSOFT VISUAL STUDIO\2017\COMMUNITY\VC\TOOLS\MSVC\14.16.27023\INCLUDE\STRING
C:\PROGRAM FILES (X86)\MICROSOFT VISUAL STUDIO\2017\COMMUNITY\VC\TOOLS\MSVC\14.16.27023\INCLUDE\XSTRING_INSERT.H
C:\PROGRAM FILES (X86)\MICROSOFT VISUAL STUDIO\2017\COMMUNITY\VC\TOOLS\MSVC\14.16.27023\INCLUDE\FSTREAM
C:\PROGRAM FILES (X86)\MICROSOFT VISUAL STUDIO\2017\COMMUNITY\VC\TOOLS\MSVC\14.16.27023\INCLUDE\SSTREAM
C:\USERS\GEORGEDRIPPER\SOURCE\REPOS\PROYECTO FINAL\PROYECTO FINAL\CAMERA.H
C:\PROGRAM FILES (X86)\MICROSOFT VISUAL STUDIO\2017\COMMUNITY\VC\TOOLS\MSVC\14.16.27023\INCLUDE\VECTOR
C:\USERS\GEORGEDRIPPER\SOURCE\REPOS\PROYECTO FINAL\PROYECTO FINAL\MODEL.H
C:\PROGRAM FILES (X86)\MICROSOFT VISUAL STUDIO\2017\COMMUNITY\VC\TOOLS\MSVC\14.16.27023\INCLUDE\MAP
C:\PROGRAM FILES (X86)\MICROSOFT VISUAL STUDIO\2017\COMMUNITY\VC\TOOLS\MSVC\14.16.27023\INCLUDE\TUPLE
C:\PROGRAM FILES (X86)\MICROSOFT VISUAL STUDIO\2017\COMMUNITY\VC\TOOLS\MSVC\14.16.27023\INCLUDE\XTREE
C:\USERS\GEORGEDRIPPER\SOURCE\REPOS\PROYECTO FINAL\EXTERNAL LIBRARIES\ASSIMP\INCLUDE\ASSIMP\IMPORTER.HPP
C:\USERS\GEORGEDRIPPER\SOURCE\REPOS\PROYECTO FINAL\EXTERNAL LIBRARIES\ASSIMP\INCLUDE\ASSIMP\TYPES.H
C:\USERS\GEORGEDRIPPER\SOURCE\REPOS\PROYECTO FINAL\EXTERNAL LIBRARIES\ASSIMP\INCLUDE\ASSIMP\DEFS.H
C:\USERS\GEORGEDRIPPER\SOURCE\REPOS\PROYECTO FINAL\EXTERNAL LIBRARIES\ASSIMP\INCLUDE\ASSIMP\CONFIG.H
C:\USERS\GEORGEDRIPPER\SOURCE\REPOS\PROYECTO FINAL\EXTERNAL LIBRARIES\ASSIMP\INCLUDE\ASSIMP\VECTOR3.H
C:\USERS\GEORGEDRIPPER\SOURCE\REPOS\PROYECTO FINAL\EXTERNAL LIBRARIES\ASSIMP\INCLUDE\ASSIMP\VECTOR2.H
C:\USERS\GEORGEDRIPPER\SOURCE\REPOS\PROYECTO FINAL\EXTERNAL LIBRARIES\ASSIMP\INCLUDE\ASSIMP\COMPILER\PUSHPACK1.H
C:\USERS\GEORGEDRIPPER\SOURCE\REPOS\PROYECTO FINAL\EXTERNAL LIBRARIES\ASSIMP\INCLUDE\ASSIMP\COMPILER\POPPACK1.H
C:\USERS\GEORGEDRIPPER\SOURCE\REPOS\PROYECTO FINAL\EXTERNAL LIBRARIES\ASSIMP\INCLUDE\ASSIMP\COLOR4.H
C:\USERS\GEORGEDRIPPER\SOURCE\REPOS\PROYECTO FINAL\EXTERNAL LIBRARIES\ASSIMP\INCLUDE\ASSIMP\MATRIX3X3.H
C:\USERS\GEORGEDRIPPER\SOURCE\REPOS\PROYECTO FINAL\EXTERNAL LIBRARIES\ASSIMP\INCLUDE\ASSIMP\MATRIX4X4.H
C:\USERS\GEORGEDRIPPER\SOURCE\REPOS\PROYECTO FINAL\EXTERNAL LIBRARIES\ASSIMP\INCLUDE\ASSIMP\QUATERNION.H
C:\USERS\GEORGEDRIPPER\SOURCE\REPOS\PROYECTO FINAL\EXTERNAL LIBRARIES\ASSIMP\INCLUDE\ASSIMP\VECTOR2.INL
C:\USERS\GEORGEDRIPPER\SOURCE\REPOS\PROYECTO FINAL\EXTERNAL LIBRARIES\ASSIMP\INCLUDE\ASSIMP\VECTOR3.INL
C:\USERS\GEORGEDRIPPER\SOURCE\REPOS\PROYECTO FINAL\EXTERNAL LIBRARIES\ASSIMP\INCLUDE\ASSIMP\COLOR4.INL
C:\USERS\GEORGEDRIPPER\SOURCE\REPOS\PROYECTO FINAL\EXTERNAL LIBRARIES\ASSIMP\INCLUDE\ASSIMP\QUATERNION.INL
C:\USERS\GEORGEDRIPPER\SOURCE\REPOS\PROYECTO FINAL\EXTERNAL LIBRARIES\ASSIMP\INCLUDE\ASSIMP\MATRIX3X3.INL
C:\PROGRAM FILES (X86)\MICROSOFT VISUAL STUDIO\2017\COMMUNITY\VC\TOOLS\MSVC\14.16.27023\INCLUDE\ALGORITHM
C:\USERS\GEORGEDRIPPER\SOURCE\REPOS\PROYECTO FINAL\EXTERNAL LIBRARIES\ASSIMP\INCLUDE\ASSIMP\MATRIX4X4.INL
C:\USERS\GEORGEDRIPPER\SOURCE\REPOS\PROYECTO FINAL\EXTERNAL LIBRARIES\ASSIMP\INCLUDE\ASSIMP\SCENE.H
C:\USERS\GEORGEDRIPPER\SOURCE\REPOS\PROYECTO FINAL\EXTERNAL LIBRARIES\ASSIMP\INCLUDE\ASSIMP\TEXTURE.H
C:\USERS\GEORGEDRIPPER\SOURCE\REPOS\PROYECTO FINAL\EXTERNAL LIBRARIES\ASSIMP\INCLUDE\ASSIMP\MESH.H
C:\USERS\GEORGEDRIPPER\SOURCE\REPOS\PROYECTO FINAL\EXTERNAL LIBRARIES\ASSIMP\INCLUDE\ASSIMP\LIGHT.H
C:\USERS\GEORGEDRIPPER\SOURCE\REPOS\PROYECTO FINAL\EXTERNAL LIBRARIES\ASSIMP\INCLUDE\ASSIMP\CAMERA.H
C:\USERS\GEORGEDRIPPER\SOURCE\REPOS\PROYECTO FINAL\EXTERNAL LIBRARIES\ASSIMP\INCLUDE\ASSIMP\MATERIAL.H
C:\USERS\GEORGEDRIPPER\SOURCE\REPOS\PROYECTO FINAL\EXTERNAL LIBRARIES\ASSIMP\INCLUDE\ASSIMP\MATERIAL.INL
C:\USERS\GEORGEDRIPPER\SOURCE\REPOS\PROYECTO FINAL\EXTERNAL LIBRARIES\ASSIMP\INCLUDE\ASSIMP\ANIM.H
C:\USERS\GEORGEDRIPPER\SOURCE\REPOS\PROYECTO FINAL\EXTERNAL LIBRARIES\ASSIMP\INCLUDE\ASSIMP\METADATA.H
C:\USERS\GEORGEDRIPPER\SOURCE\REPOS\PROYECTO FINAL\EXTERNAL LIBRARIES\ASSIMP\INCLUDE\ASSIMP\POSTPROCESS.H
C:\USERS\GEORGEDRIPPER\SOURCE\REPOS\PROYECTO FINAL\PROYECTO FINAL\MESH.H
C:\USERS\GEORGEDRIPPER\SOURCE\REPOS\PROYECTO FINAL\PROYECTO FINAL\TEXTURE.H
