# This file uses meters as units for non-parametric coordinates.

mtllib pino.mtl
g default
v 190.028319 260.950874 -493.434685
v 138.649633 260.950874 -492.044603
v 73.917946 260.950874 -491.413576
v 2.169648 260.950874 -491.603372
v -69.572035 260.950874 -492.595415
v -134.284541 260.950874 -494.292595
v -185.633351 260.950874 -496.528780
v 2.237143 561.014224 -499.799004
vt 0.525000 0.500000
vt 0.550000 0.500000
vt 0.575000 0.500000
vt 0.600000 0.500000
vt 0.625000 0.500000
vt 0.650000 0.500000
vt 0.675000 0.500000
vt 0.500000 1.000000
vn 0.027026 0.038101 0.998908
vn 0.017394 0.033732 0.999279
vn -0.008232 0.031284 0.999477
vn 0.003232 0.028706 0.999583
vn -0.008233 0.027304 0.999593
vn -0.019696 0.028706 0.999394
vn -0.033852 0.033732 0.998857
vn -0.043476 0.038101 0.998328
s 1
g pCone1
usemtl lambert6SG
f 1/1/1 2/2/2 8/8/3
f 2/2/2 3/3/4 8/8/3
f 3/3/4 4/4/5 8/8/3
f 4/4/5 5/5/6 8/8/3
f 5/5/6 6/6/7 8/8/3
f 6/6/7 7/7/8 8/8/3
