# This file uses meters as units for non-parametric coordinates.

mtllib camas bien folo falta bolita de mabel.mtl
g default
v 120.374427 11.431380 111.693044
v 121.860875 11.431380 111.615143
v 121.860875 0.519857 111.615143
v 120.374427 0.519857 111.693044
v 121.909039 11.431380 112.534170
v 121.909039 0.519857 112.534170
v 120.422591 11.431380 112.612072
v 120.422591 0.519857 112.612072
vt 0.676272 0.002953
vt 0.676272 0.002953
vt 0.676272 0.002953
vt 0.676272 0.002953
vt 0.676272 0.002953
vt 0.676272 0.002953
vt 0.676272 0.002953
vt 0.676272 0.002953
vt 0.676272 0.002953
vt 0.676272 0.002953
vt 0.676272 0.002953
vt 0.676272 0.002953
vt 0.676272 0.002953
vt 0.676272 0.002953
vt 0.676272 0.002953
vt 0.676272 0.002953
vt 0.676272 0.002953
vt 0.676272 0.002953
vt 0.676272 0.002953
vt 0.676272 0.002953
vt 0.676272 0.002953
vt 0.676272 0.002953
vt 0.676272 0.002953
vt 0.676272 0.002953
vn 0.000000 -1.000000 0.000000
vn 0.000000 -1.000000 0.000000
vn 0.000000 -1.000000 0.000000
vn 0.000000 -1.000000 0.000000
vn -0.052336 0.000000 -0.998630
vn -0.052336 0.000000 -0.998630
vn -0.052336 0.000000 -0.998630
vn -0.052336 0.000000 -0.998630
vn 0.998630 0.000000 -0.052336
vn 0.998630 0.000000 -0.052336
vn 0.998630 0.000000 -0.052336
vn 0.998630 0.000000 -0.052336
vn 0.052336 -0.000000 0.998630
vn 0.052336 -0.000000 0.998630
vn 0.052336 -0.000000 0.998630
vn 0.052336 -0.000000 0.998630
vn -0.998630 0.000000 0.052336
vn -0.998630 0.000000 0.052336
vn -0.998630 0.000000 0.052336
vn -0.998630 0.000000 0.052336
vn 0.000000 1.000000 0.000000
vn 0.000000 1.000000 0.000000
vn 0.000000 1.000000 0.000000
vn 0.000000 1.000000 0.000000
s off
g polySurface12 RPG_Bed_Mesh
usemtl Material_002
f 4/1/1 3/2/2 6/3/3 8/4/4
usemtl Material_001
f 1/5/5 2/6/6 3/7/7 4/8/8
f 2/9/9 5/10/10 6/11/11 3/12/12
f 5/13/13 7/14/14 8/15/15 6/16/16
f 7/17/17 1/18/18 4/19/19 8/20/20
f 7/21/21 5/22/22 2/23/23 1/24/24
