^C:\USERS\GEORGEDRIPPER\SOURCE\REPOS\PROYECTO FINAL\PROYECTO FINAL\PROYECTO.CPP
C:\USERS\GEORGEDRIPPER\SOURCE\REPOS\PROYECTO FINAL\PROYECTO FINAL\RELEASE\VC141.PDB
C:\USERS\GEORGEDRIPPER\SOURCE\REPOS\PROYECTO FINAL\PROYECTO FINAL\RELEASE\PROYECTO.OBJ
