^C:\USERS\GEORGEDRIPPER\SOURCE\REPOS\PROYECTO FINAL\PROYECTO FINAL\RELEASE\PROYECTO.OBJ
C:\USERS\GEORGEDRIPPER\SOURCE\REPOS\PROYECTO FINAL\RELEASE\PROYECTO FINAL.EXE
C:\USERS\GEORGEDRIPPER\SOURCE\REPOS\PROYECTO FINAL\RELEASE\PROYECTO FINAL.PDB
