﻿Place,Name,Sex,BirthDate,Age,Equipment,Division,BodyweightKg,WeightClassKg,Squat1Kg,Squat2Kg,Squat3Kg,Best3SquatKg,Bench1Kg,Bench2Kg,Bench3Kg,Best3BenchKg,Deadlift1Kg,Deadlift2Kg,Deadlift3Kg,Best3DeadliftKg,TotalKg,Event,Team
2,Laura Swandel,F,1994-08-14,27,Raw,FR-O,51.5,52,47.5,52.5,57.5,57.5,57.5,-60,-60,57.5,85,95,100,100,215,SBD,Strength Coach NI
3,Eliza Solarska,F,1995-10-06,26,Raw,FR-O,67.6,69,100,110,115,115,47.5,50,52.5,52.5,130,140,-150,140,307.5,SBD,
4,Aoife O'Toole,F,,,Raw,FR-O,65,69,85,-92.5,92.5,92.5,45,47.5,50,50,110,122.5,130,130,272.5,SBD,Strength Militia
2,Lauren McAuley,F,1987-04-18,35,Raw,FR-O,75.3,76,115,127.5,132.5,132.5,60,65,70,70,155,167.5,175,175,377.5,SBD,Max Out Powerlifting
4,Aileen Burke,F,,,Raw,FR-O,74.8,76,107.5,115,-120,115,50,52.5,55,55,140,150,155,155,325,SBD,
1,Emma Willis,F,1990-05-15,32,Raw,FR-O,83.7,84,142.5,147.5,150,150,67.5,70,-72.5,70,167.5,175,182.5,182.5,402.5,SBD,Strength Coach NI
3,Stephanie Beattie,F,1986-10-10,35,Raw,FR-O,96.6,84+,130,-140,-140,130,75,80,-82.5,80,140,147.5,155,155,365,SBD,Reform
4,Leigh McMaster,F,1988-01-28,34,Raw,FR-O,91.8,84+,130,137.5,140,140,50,55,-60,55,155,162.5,-170,162.5,357.5,SBD,Strength Militia
NS,Eoghan McNicholl,M,2004-04-29,18,Raw,MR-O,,,,,,,,,,,,,,,,SBD,Max Out Powerlifting
NS,Jonathan Gorman,M,1990-12-10,31,Raw,MR-O,,,,,,,,,,,,,,,,SBD,Reform
1,Matthew Scanlan,M,2003-03-23,19,Raw,MR-O,54.8,59,-115,120,127.5,127.5,80,85,90,90,160,172.5,180,180,397.5,SBD,
2,Louis Eastwood,M,2007-10-22,14,Raw,MR-O,57.9,59,90,100,-110,100,65,70,-72.5,70,142.5,152.5,162.5,162.5,332.5,SBD,
1,Conor Gelston,M,1989-03-02,33,Raw,MR-O,65.1,66,172.5,180,185,185,107.5,112.5,115,115,190,200,210,210,510,SBD,CG Fitness Annacloy
1,Adam McAlpine,M,2001-08-23,20,Raw,MR-O,73.5,74,212.5,222.5,225,225,145,152.5,157.5,157.5,250,260,-270,260,642.5,SBD,Focus Gym
2,Patrick Mulholland,M,1998-03-25,24,Raw,MR-O,72.2,74,202.5,205,212.5,212.5,97.5,105,-110,105,242.5,255,265,265,582.5,SBD,Vici Strength
7,Casey Purcella,M,1992-08-17,29,Raw,MR-O,71.1,74,-140,140,147.5,147.5,95,-100,-100,95,160,167.5,180,180,422.5,SBD,
DQ,Jack McQuillan,M,2001-08-13,20,Raw,MR-O,73.5,74,-180,-180,-180,,80,-85,-90,80,170,190,205,205,,SBD,QUB
10,Toby Clarke,M,1994-04-08,28,Raw,MR-O,82.6,83,170,177.5,182.5,182.5,110,112.5,115,115,185,-200,207.5,207.5,505,SBD,Strength Militia
4,Andrew Fitzsimons,M,1999-03-19,23,Raw,MR-O,91.8,93,205,217.5,230,230,130,137.5,-142.5,137.5,225,242.5,-252.5,242.5,610,SBD,Max Out Powerlifting
6,Tim Higgins,M,1996-07-28,25,Raw,MR-O,92.4,93,200,210,-227.5,210,130,-135,-135,130,225,240,245,245,585,SBD,Omega Training Systems
7,Michael Dallat,M,1999-03-30,23,Raw,MR-O,92.5,93,185,192.5,200,200,95,-100,-100,95,262.5,272.5,-282.5,272.5,567.5,SBD,Omega Training Systems
13,Abhishek Biju,M,2002-01-05,20,Raw,MR-O,90.9,93,-145,150,-157.5,150,102.5,-107.5,107.5,107.5,170,-185,-185,170,427.5,SBD,QUB
14,Ryan White,M,1999-02-08,23,Raw,MR-O,86.1,93,135,145,-152.5,145,90,-95,-95,90,175,185,190,190,425,SBD,QUB
3,Jack Gilchrist,M,1999-07-15,22,Raw,MR-O,96.8,105,220,230,235,235,135,145,152.5,152.5,250,265,272.5,272.5,660,SBD,Reform
7,Aaron Ritchie,M,2001-10-05,20,Raw,MR-O,98.4,105,160,175,-185,175,100,-107.5,107.5,107.5,242.5,260,270,270,552.5,SBD,Max Out Powerlifting
8,Rory Harman,M,2002-10-16,19,Raw,MR-O,104.5,105,140,145,155,155,130,137.5,-142.5,137.5,195,207.5,217.5,217.5,510,SBD,QUB
9,Alex Armstrong,M,1999-08-25,22,Raw,MR-O,103.3,105,155,165,170,170,105,110,-112.5,110,190,200,205,205,485,SBD,QUB
2,Fiachra O'Raghallaigh,M,1996-09-07,25,Raw,MR-O,132.2,120+,207.5,-235,235,235,150,155,160,160,250,270,-290,270,665,SBD,Max Out Powerlifting
3,Brendan Conlon,M,1991-07-18,30,Raw,MR-O,141.7,120+,210,220,230,230,155,160,165,165,200,220,250,250,645,SBD,Gain Forth Gym