Division,WeightClassKg,Place,Name,Team,BodyweightKg,Best3SquatKg,Best3BenchKg,Best3DeadliftKg,TotalKg,Equipment,Event,Sex
Boys,51.71,1,Ethan Peace,Waxahachie,50.26,102.06,45.36,92.99,240.4,Single-ply,SBD,M
Boys,59.87,1,Hunter Ford,Burleson Centennial,59.87,165.56,90.72,197.31,453.59,Single-ply,SBD,M
Boys,59.87,2,Adrien Moreno,Burleson,59.69,136.08,68.04,158.76,362.87,Single-ply,SBD,M
Boys,67.13,1,Iver MaCaulay,Burleson,66.32,204.12,122.47,215.46,542.04,Single-ply,SBD,M
Boys,67.13,2,Joshua Oyewole,North Crowley,65.86,172.37,86.18,183.7,442.25,Single-ply,SBD,M
Boys,67.13,3,Braxton Dooley,Joshua,66.77,147.42,77.11,161.03,385.55,Single-ply,SBD,M
Boys,67.13,4,Robert Wheeless,Waxahachie,65.23,131.54,97.52,97.52,326.59,Single-ply,SBD,M
Boys,67.13,5,Jeremy Berstler,Burleson Centennial,65.5,120.2,65.77,120.2,306.17,Single-ply,SBD,M
Boys,67.13,6,Brady Baird,Joshua,67.13,156.49,70.31,70.31,297.1,Single-ply,SBD,M
Boys,67.13,7,Dylan Cox,Burleson Centennial,63.78,83.91,52.16,104.33,240.4,Single-ply,SBD,M
Boys,74.84,1,Zion Ababio,Burleson Centennial,73.75,190.51,99.79,208.65,498.95,Single-ply,SBD,M
Boys,74.84,2,Quincy Johnson,Waxahachie,73.21,172.37,122.47,192.78,487.61,Single-ply,SBD,M
Boys,74.84,3,Ethan Brown,Burleson,71.67,181.44,97.52,179.17,458.13,Single-ply,SBD,M
Boys,74.84,4,Alpha Taylor,Crowley,74.84,149.69,95.25,181.44,426.38,Single-ply,SBD,M
Boys,74.84,5,Kody Arsenault,Rio Vista,71.3,156.49,108.86,154.22,419.57,Single-ply,SBD,M
Boys,74.84,6,Ian Nunez,Cleburne,74.66,149.69,97.52,163.29,410.5,Single-ply,SBD,M
Boys,74.84,7,Isaac Houston,Midlothian,68.76,142.88,92.99,147.42,383.29,Single-ply,SBD,M
Boys,74.84,8,Caulan Jackson,Crowley,74.03,120.2,102.06,136.08,358.34,Single-ply,SBD,M
Boys,74.84,9,James Riley #5,Malakoff Cross Roads,73.21,122.47,77.11,149.69,349.27,Single-ply,SBD,M
Boys,74.84,10,Dagan Murdoch,Joshua,71.76,142.88,70.31,124.74,337.93,Single-ply,SBD,M
Boys,74.84,11,Jeremiah Grey,Rio Vista,72.12,127.01,74.84,133.81,335.66,Single-ply,SBD,M
Boys,82.1,1,Tyrone Pettiford,North Crowley,77.2,222.26,104.33,238.14,564.72,Single-ply,SBD,M
Boys,82.1,2,Alex Marston,Malakoff Cross Roads,81.47,226.8,97.52,215.46,539.77,Single-ply,SBD,M
Boys,82.1,3,Cedric Moore,Waxahachie,81.37,158.76,99.79,188.24,446.79,Single-ply,SBD,M
Boys,82.1,4,Ethan Lemley,Midlothian,79.02,136.08,104.33,167.83,408.23,Single-ply,SBD,M
Boys,82.1,5,Blaine Hendry,Malakoff Cross Roads,82.01,149.69,90.72,145.15,385.55,Single-ply,SBD,M
Boys,89.81,1,Nicholas Hopkins #2,North Crowley,85.73,192.78,127.01,210.92,530.7,Single-ply,SBD,M
Boys,89.81,2,Shawn Cherry,Waxahachie,89.81,181.44,113.4,197.31,492.15,Single-ply,SBD,M
Boys,89.81,3,Elias Cruz,Midlothian,89.27,188.24,104.33,197.31,489.88,Single-ply,SBD,M
Boys,89.81,4,Andrew Freese,Burleson,89.81,185.97,92.99,195.04,474,Single-ply,SBD,M
Boys,89.81,5,Hunter McDonald,Malakoff Cross Roads,85.91,151.95,83.91,170.1,405.97,Single-ply,SBD,M
Boys,89.81,6,Chance Harrah,Rio Vista,89.09,158.76,83.91,161.03,403.7,Single-ply,SBD,M
Boys,89.81,7,Logan Brazeal,Watauga Harvest Christian Academy,89.54,136.08,74.84,136.08,347,Single-ply,SBD,M
Boys,89.81,8,Dylan Wittee,Cleburne,87,113.4,63.5,124.74,301.64,Single-ply,SBD,M
Boys,89.81,9,Kendall Easley,Crowley,85.91,90.72,52.16,113.4,256.28,Single-ply,SBD,M
Boys,89.81,DQ,Dylan Meador,Crowley,88,,,,,Single-ply,SBD,M
Boys,99.79,1,Dominique Johnson,Crowley,99.16,170.1,136.08,204.12,510.29,Single-ply,SBD,M
Boys,99.79,2,Brayden Gregory,Joshua,90.81,201.85,104.33,192.78,498.95,Single-ply,SBD,M
Boys,99.79,3,River Hagan,Burleson,99.61,208.65,117.93,172.37,498.95,Single-ply,SBD,M
Boys,99.79,4,Kaden Mattingly,Malakoff Cross Roads,95.53,185.97,115.67,195.04,496.68,Single-ply,SBD,M
Boys,99.79,5,Christian Mirabal,Waxahachie,98.34,181.44,108.86,204.12,494.42,Single-ply,SBD,M
Boys,99.79,6,Preston Turner #2,Malakoff Cross Roads,97.98,170.1,111.13,174.63,455.86,Single-ply,SBD,M
Boys,99.79,7,Josh Rodriguez,Cleburne,98.61,149.69,99.79,183.7,433.18,Single-ply,SBD,M
Boys,99.79,8,Justin Cuellar,Waxahachie,99.79,158.76,97.52,158.76,415.04,Single-ply,SBD,M
Boys,99.79,9,Cooper Zelazny,Joshua,96.52,165.56,90.72,147.42,403.7,Single-ply,SBD,M
Boys,99.79,10,Alexis Hidrogo,Midlothian,93.26,138.35,97.52,165.56,401.43,Single-ply,SBD,M
Boys,99.79,11,Logan Birch,Burleson Centennial,99.79,140.61,83.91,154.22,378.75,Single-ply,SBD,M
Boys,109.77,1,Brent Batch,Rio Vista,100.43,181.44,117.93,204.12,503.49,Single-ply,SBD,M
Boys,109.77,2,Randal Tankrik,Cleburne,109.41,181.44,129.27,147.42,458.13,Single-ply,SBD,M
Boys,109.77,3,Bryden Devore,Joshua,105.14,183.7,122.47,149.69,455.86,Single-ply,SBD,M
Boys,109.77,4,Daniel Duron,Waxahachie,108.68,174.63,97.52,183.7,455.86,Single-ply,SBD,M
Boys,109.77,5,Ritthik Patel,Cleburne,101.42,195.04,104.33,154.22,453.59,Single-ply,SBD,M
Boys,109.77,6,Dylan Bueno,Crowley,101.24,181.44,95.25,170.1,446.79,Single-ply,SBD,M
Boys,109.77,7,Devin Preston,Malakoff Cross Roads,104.33,181.44,97.52,165.56,444.52,Single-ply,SBD,M
Boys,109.77,8,Fabian Baltrip,Waxahachie,102.24,174.63,111.13,151.95,437.72,Single-ply,SBD,M
Boys,109.77,9,Cole Parsons,Cleburne,106.41,165.56,108.86,151.95,426.38,Single-ply,SBD,M
Boys,109.77,10,Nico Glynn,Watauga Harvest Christian Academy,106.5,151.95,86.18,151.95,390.09,Single-ply,SBD,M
Boys,124.74,1,Jared Negrete,Burleson,119.02,222.26,133.81,204.12,560.19,Single-ply,SBD,M
Boys,124.74,2,Chandler Poggensee,Burleson,111.04,204.12,138.35,208.65,551.11,Single-ply,SBD,M
Boys,124.74,3,Trevor Marquez,Malakoff Cross Roads,112.67,204.12,108.86,181.44,494.42,Single-ply,SBD,M
Boys,124.74,4,Margarito Rojas,Cleburne,113.58,181.44,136.08,174.63,492.15,Single-ply,SBD,M
Boys,124.74,5,Angel Serrano,Cleburne,114.67,174.63,115.67,154.22,444.52,Single-ply,SBD,M
Boys,124.74+,1,Hesjar Martinez,Midlothian,130.91,206.38,149.69,199.58,555.65,Single-ply,SBD,M
Boys,124.74+,2,Ethan Cummins,Rio Vista,130.18,206.38,129.27,208.65,544.31,Single-ply,SBD,M
Boys,124.74+,3,Joseph Perez,Waxahachie,130.36,204.12,129.27,183.7,517.1,Single-ply,SBD,M
Boys,124.74+,4,Aaron Mercado,Burleson Centennial,148.69,174.63,104.33,192.78,471.74,Single-ply,SBD,M
Boys,124.74+,5,Carter Warren,Crowley,141.79,158.76,102.06,158.76,419.57,Single-ply,SBD,M
Boys,124.74+,6,Nick Ingram,Crowley,132.81,140.61,108.86,124.74,374.21,Single-ply,SBD,M
Boys,,NS,Austin Mikeska,Crowley,,,,,,Single-ply,SBD,M
Boys,,NS,Marquis Johnson,North Crowley,,,,,,Single-ply,SBD,M
