﻿Place,Name,Sex,BirthDate,Age,Equipment,Division,BodyweightKg,WeightClassKg,Squat1Kg,Squat2Kg,Squat3Kg,Best3SquatKg,Bench1Kg,Bench2Kg,Bench3Kg,Best3BenchKg,Deadlift1Kg,Deadlift2Kg,Deadlift3Kg,Best3DeadliftKg,TotalKg,Event,Team
NS,Alexandra Kapka,F,1983-04-14,39,Raw,F-O,,,,,,,,,,,,,,,,SBD,
NS,Chloe Furley,F,2000-09-23,21,Raw,F-O,,,,,,,,,,,,,,,,SBD,Odyssey Strength
NS,Kotchaphan Mai-On,F,1995-02-10,27,Raw,F-O,,,,,,,,,,,,,,,,SBD,Flexx Training Systems
NS,Rebekah Wilson,F,1994-11-17,27,Raw,F-O,,,,,,,,,,,,,,,,SBD,Strength Militia
1,Marica Mullan,F,1994-08-14,27,Raw,F-O,50.7,52,97.5,102.5,107.5,107.5,65,67.5,-70,67.5,125,132.5,140,140,315,SBD,Evolution Strength Systems
2,Laura Swandel,F,1994-08-14,27,Raw,F-O,51.5,52,47.5,52.5,57.5,57.5,57.5,-60,-60,57.5,85,95,100,100,215,SBD,Strength Coach NI
1,Amelia Crook,F,1981-04-21,41,Raw,F-O,56.7,57,130,137.5,142.5,142.5,87.5,92.5,97.5,97.5,150,160,-162.5,160,400,SBD,
2,Ellen O'Leary,F,2002-09-14,19,Raw,F-O,56,57,107.5,115,120,120,55,60,62.5,62.5,130,140,147.5,147.5,330,SBD,A.B.S. Powerlifting
3,Hollie Doherty,F,1993-07-18,28,Raw,F-O,56.4,57,95,102.5,-107.5,102.5,47.5,52.5,-55,52.5,105,-110,110,110,265,SBD,
1,Sunita Raja,F,1989-05-21,33,Raw,F-O,62.5,63,-135,135,145,145,95,101,105,105,147.5,160,-177.5,160,410,SBD,Strength Militia
1,Laura McGoran,F,1991-07-23,30,Raw,F-O,66.1,69,100,107.5,110,110,67.5,72.5,-75,72.5,130,140,-150,140,322.5,SBD,FITT Conditioning
2,Louise O'Doherty,F,1980-04-14,42,Raw,F-O,67.6,69,100,110,115,115,67.5,72.5,-75,72.5,117.5,125,132.5,132.5,320,SBD,Max Out Powerlifting
4,Aoife O'Toole,F,,,Raw,F-O,65,69,85,-92.5,92.5,92.5,45,47.5,50,50,110,122.5,130,130,272.5,SBD,Strength Militia
1,Katie Clarke,F,,,Raw,F-O,73.2,76,135,142.5,150,150,60,65,67.5,67.5,165,172.5,180,180,397.5,SBD,A.B.S. Powerlifting
2,Lauren McAuley,F,1987-04-18,35,Raw,F-O,75.3,76,115,127.5,132.5,132.5,60,65,70,70,155,167.5,175,175,377.5,SBD,Max Out Powerlifting
3,Karla O'Boyle,F,1996-05-22,26,Raw,F-O,70.7,76,105,110,112.5,112.5,60,62.5,-65,62.5,140,150,160,160,335,SBD,
4,Aileen Burke,F,,,Raw,F-O,74.8,76,107.5,115,-120,115,50,52.5,55,55,140,150,155,155,325,SBD,
5,Hannah Rodgers,F,1993-11-20,28,Raw,F-O,75.2,76,80,85,90,90,55,60,-65,60,110,122.5,132.5,132.5,282.5,SBD,
6,Jenny M Wilson,F,1984-09-20,37,Raw,F-O,72.8,76,85,92.5,97.5,97.5,42.5,47.5,-50,47.5,120,127.5,135,135,280,SBD,Strength Militia
DQ,Orla McGurk,F,1993-11-22,28,Raw,F-O,76,76,-137.5,-140,-140,,-62.5,-62.5,-62.5,,-147.5,-147.5,-147.5,,,SBD,Strength Coach NI
2,Hannah Mullan,F,1994-10-16,27,Raw,F-O,78.3,84,-112.5,120,-122.5,120,57.5,60,-62.5,60,140,150,155,155,335,SBD,Strength Coach NI
3,Kearstyn Takemoto,F,1989-01-17,33,Raw,F-O,81.5,84,100,110,-120,110,40,45,50,50,110,120,130,130,290,SBD,
1,Hannah McKee,F,1990-12-01,31,Raw,F-O,139.4,84+,135,142.5,147.5,147.5,85,90,92.5,92.5,135,150,162.5,162.5,402.5,SBD,Strength Militia
2,Regina Myler,F,1979-03-28,43,Raw,F-O,99.4,84+,-135,135,-140,135,60,65,-70,65,150,160,170,170,370,SBD,Conor Byrne Fitness
5,Kristine Kazimiri,F,1986-03-13,36,Raw,F-O,102.5,84+,130,137.5,-145,137.5,70,-72.5,72.5,72.5,130,135,-137.5,135,345,SBD,Conor Byrne Fitness
6,Jennifer Tierney,F,1991-07-01,30,Raw,F-O,141.3,84+,105,-110,110,110,90,95,-100,95,120,127.5,135,135,340,SBD,EQ Strength & Conditioning
NS,Gavin Hamilton,M,2000-06-23,21,Raw,M-O,,,,,,,,,,,,,,,,SBD,
NS,Jonathan Gorman,M,1990-12-10,31,Raw,M-O,,,,,,,,,,,,,,,,SBD,Reform
1,Conor Gelston,M,1989-03-02,33,Raw,M-O,65.1,66,172.5,180,185,185,107.5,112.5,115,115,190,200,210,210,510,SBD,CG Fitness Annacloy
2,Cahir McGrory,M,1998-03-05,24,Raw,M-O,65.4,66,-165,170,175,175,110,117.5,-120,117.5,190,205,-210,205,497.5,SBD,
3,James Moan,M,2002-12-09,19,Raw,M-O,65.4,66,170,182.5,-187.5,182.5,97.5,-102.5,-102.5,97.5,180,190,-200,190,470,SBD,
1,Adam McAlpine,M,2001-08-23,20,Raw,M-O,73.5,74,212.5,222.5,225,225,145,152.5,157.5,157.5,250,260,-270,260,642.5,SBD,Focus Gym
3,Adam Hamilton,M,1998-09-16,23,Raw,M-O,73.6,74,210,212.5,-222.5,212.5,-125,-125,125,125,230,240,-247.5,240,577.5,SBD,
4,Damian Maguire,M,1991-06-17,30,Raw,M-O,72.6,74,175,185,195,195,112.5,115,120,120,230,245,257.5,257.5,572.5,SBD,Evolution Strength Systems
5,David Walsh,M,1985-05-10,37,Raw,M-O,73.4,74,170,172.5,-180,172.5,102.5,110,-117.5,110,190,205,215,215,497.5,SBD,CityGym Limerick
6,Matthew Butler,M,2001-04-08,21,Raw,M-O,72.2,74,170,180,190,190,95,100,105,105,180,190,200,200,495,SBD,KAOS
DQ,Daniel Blake,M,2005-02-24,17,Raw,M-O,73.5,74,-130,-130,-130,,50,65,85,85,155,170,190,190,,SBD,
1,Jordan Konczak,M,1998-12-23,23,Raw,M-O,82.6,83,210,222.5,-230,222.5,150,160,-167.5,160,245,257.5,-270,257.5,640,SBD,The Strength Guys
2,Philip Barr,M,1993-06-30,28,Raw,M-O,81.6,83,207.5,222.5,232.5,232.5,155,162.5,167.5,167.5,220,237.5,-245,237.5,637.5,SBD,Max Out Powerlifting
3,Thomas McCarthy #4,M,2004-07-04,17,Raw,M-O,82.5,83,215,225,235,235,105,112.5,-115,112.5,245,260,275,275,622.5,SBD,Odyssey Strength
4,Johnson Ewulonu,M,1998-06-17,23,Raw,M-O,81.8,83,200,210,220,220,137.5,145,-150,145,230,240,250,250,615,SBD,Odyssey Strength
5,Paul Hennessy,M,1988-08-17,33,Raw,M-O,82.1,83,190,200,-202.5,200,122.5,130,-135,130,230,240,247.5,247.5,577.5,SBD,FITT Conditioning
6,Rian Collins,M,1998-07-17,23,Raw,M-O,81.9,83,195,210,215,215,110,120,-125,120,215,235,-240,235,570,SBD,Kingpin Strength Systems
7,Michael Ranaghan,M,2004-10-26,17,Raw,M-O,75.2,83,190,200,207.5,207.5,107.5,115,-117.5,115,225,-240,-250,225,547.5,SBD,Odyssey Strength
8,Tony Green,M,1995-08-12,26,Raw,M-O,80.4,83,180,190,200,200,127.5,130,-135,130,190,200,212.5,212.5,542.5,SBD,
9,Ben Doherty,M,1999-03-25,23,Raw,M-O,82,83,180,-187.5,187.5,187.5,120,125,127.5,127.5,190,-200,-200,190,505,SBD,
11,Jack Conroy,M,1998-12-01,23,Raw,M-O,80.6,83,167.5,-177.5,177.5,177.5,97.5,102.5,105,105,197.5,212.5,220,220,502.5,SBD,Odyssey Strength
12,Luke Fitzgerald,M,1996-03-08,26,Raw,M-O,80.3,83,185,195,-205,195,105,110,-115,110,185,192.5,-210,192.5,497.5,SBD,A.B.S. Powerlifting
13,Alfie Johnson,M,2002-07-01,19,Raw,M-O,82.7,83,150,157.5,165,165,120,125,130,130,172.5,185,200,200,495,SBD,Odyssey Strength
14,Adam Lloyd,M,1999-03-11,23,Raw,M-O,77.7,83,165,172.5,177.5,177.5,92.5,97.5,-102.5,97.5,-185,192.5,-200,192.5,467.5,SBD,Odyssey Strength
1,Matthew Henry #1,M,1994-02-24,28,Raw,M-O,92.6,93,260,280,300,300,155,162.5,167.5,167.5,262.5,282.5,305,305,772.5,SBD,A.B.S. Powerlifting
2,Adam Joy,M,1992-05-12,30,Raw,M-O,90,93,205,220,227.5,227.5,135,142.5,147.5,147.5,210,232.5,247.5,247.5,622.5,SBD,KAOS
3,Luke Kelly #1,M,2000-05-20,22,Raw,M-O,92,93,-220,225,-230,225,125,135,-140,135,245,260,262.5,262.5,622.5,SBD,O Flaherty Fitness and Performance
5,Peter Coyle,M,1980-07-07,41,Raw,M-O,92.5,93,217.5,227.5,-232.5,227.5,135,140,-145,140,235,242.5,-250,242.5,610,SBD,Strength Coach NI
8,Jack Brennan #2,M,2004-04-03,18,Raw,M-O,91.9,93,-192.5,192.5,-200,192.5,-115,117.5,-122.5,117.5,220,230,235,235,545,SBD,
9,Austin Doherty,M,1998-06-26,23,Raw,M-O,87.1,93,185,195,202.5,202.5,100,107.5,112.5,112.5,212.5,225,-232.5,225,540,SBD,
10,Jack Brennan #3,M,2001-09-10,20,Raw,M-O,91.1,93,175,185,-190,185,90,100,102.5,102.5,180,195,-200,195,482.5,SBD,Odyssey Strength
11,Sam Decker,M,1994-03-17,28,Raw,M-O,89.4,93,140,147.5,157.5,157.5,107.5,-117.5,117.5,117.5,165,175,177.5,177.5,452.5,SBD,Odyssey Strength
12,Peter Carroll,M,2002-02-03,20,Raw,M-O,93,93,140,152.5,157.5,157.5,90,97.5,-102.5,97.5,170,185,-195,185,440,SBD,Odyssey Strength
14,Ryan White,M,1999-02-08,23,Raw,M-O,86.1,93,135,145,-152.5,145,90,-95,-95,90,175,185,190,190,425,SBD,QUB
1,Scott Dean,M,1997-11-29,24,Raw,M-O,104.6,105,255,280,-290,280,150,170,-180,170,290,310,-330,310,760,SBD,KAOS
2,Jack Skelton,M,1999-03-15,23,Raw,M-O,102.3,105,215,230,240,240,145,155,-160,155,247.5,265,280,280,675,SBD,Odyssey Strength
4,Ethan McLaughlin,M,2000-11-01,21,Raw,M-O,102.5,105,-220,230,240,240,137.5,145,-150,145,235,250,-265,250,635,SBD,MK Strength and Fitness
5,Kenneth Pollin,M,1990-07-25,31,Raw,M-O,103,105,225,235,250,250,120,-125,-125,120,235,-247.5,260,260,630,SBD,
6,James Rutledge,M,1996-02-19,26,Raw,M-O,98.9,105,185,200,212.5,212.5,147.5,155,162.5,162.5,195,215,225,225,600,SBD,Max Out Powerlifting
10,Michael Dunne,M,1985-06-24,36,Raw,M-O,102.8,105,-140,140,150,150,100,-107.5,107.5,107.5,175,190,197.5,197.5,455,SBD,A.B.S. Powerlifting
11,Cian Robinson,M,1998-03-06,24,Raw,M-O,101.3,105,137.5,150,155,155,92.5,97.5,100,100,170,185,192.5,192.5,447.5,SBD,KAOS
1,Nathan Neville,M,2000-02-16,22,Raw,M-O,116,120,250,270,-285,270,155,162.5,-167.5,162.5,250,265,275,275,707.5,SBD,Omega Training Systems
2,Andrew Ryan #1,M,2000-07-11,21,Raw,M-O,114.2,120,215,230,235,235,137.5,142.5,145,145,250,265,275,275,655,SBD,Odyssey Strength
3,Jordan Voss,M,1998-05-23,24,Raw,M-O,116.7,120,220,230,240,240,127.5,135,-140,135,245,257.5,-262.5,257.5,632.5,SBD,Odyssey Strength
4,Kane Kavanagh-Baer,M,2000-08-15,21,Raw,M-O,119,120,210,220,,220,125,-132.5,-132.5,125,240,260,265,265,610,SBD,Odyssey Strength
1,Isaiah Isijola,M,2000-09-05,21,Raw,M-O,132.2,120+,-220,220,270,270,160,170,-180,170,280,305,325,325,765,SBD,Odyssey Strength
2,Fiachra O'Raghallaigh,M,1996-09-07,25,Raw,M-O,132.2,120+,207.5,-235,235,235,150,155,160,160,250,270,-290,270,665,SBD,Max Out Powerlifting
3,Brendan Conlon,M,1991-07-18,30,Raw,M-O,141.7,120+,210,220,230,230,155,160,165,165,200,220,250,250,645,SBD,Gain Forth Gym
