Place,Name,Sex,BirthDate,Age,Country,State,Equipment,Division,BodyweightKg,WeightClassKg,Squat1Kg,Squat2Kg,Squat3Kg,Squat4Kg,Best3SquatKg,Bench1Kg,Bench2Kg,Bench3Kg,Best3BenchKg,Deadlift1Kg,Deadlift2Kg,Deadlift3Kg,Best3DeadliftKg,TotalKg,Event
1,Alisha Luna,F,1994-12-06,26,USA,HI,Raw,Open,51.4,52,137.5,147.5,155,,155,85,95,97.5,97.5,182.5,192.5,-202.5,192.5,445,SBD
2,Jenn Rotsinger,F,1978-03-27,43,USA,FL,Raw,Open,51,52,147.5,155,162.5,,162.5,82.5,-87.5,87.5,87.5,182.5,192.5,-205.5,192.5,442.5,SBD
1,Angelina Bennett,F,1993-06-19,28,USA,MD,Raw,Open,55,56,152.5,162.5,167.5,,167.5,95,100,102.5,102.5,190,-202.5,-202.5,190,460,SBD
1,Susan Salazar,F,1976-01-17,45,USA,CA,Raw,Open,59.5,60,177.5,187.5,-197.5,,187.5,82.5,87.5,92.5,92.5,205,217.5,222.5,222.5,502.5,SBD
2,Whitney Baxley,F,1988-11-18,32,USA,NV,Raw,Open,58.6,60,165,-177.5,-177.5,,165,-87.5,-87.5,87.5,87.5,227.5,-235.5,-235.5,227.5,480,SBD
3,Julia Williams #1,F,1990-05-19,31,USA,CA,Raw,Open,59.8,60,155,-162.5,-162.5,,155,105,112.5,-117.5,112.5,180,187.5,-190,187.5,455,SBD
4,Tsukiko Fredette,F,1997-10-22,23,USA,CA,Raw,Open,59.7,60,-172.5,172.5,-182.5,,172.5,85,90,-92.5,90,172.5,182.5,-192.5,182.5,445,SBD
DQ,Ayngelia Ara,F,1981-12-02,39,USA,IN,Raw,Open,60,60,142.5,-150,-150,,142.5,-100,-100,100,100,-195,-195,-195,,,SBD
1,Bria Robinson,F,1993-05-18,28,USA,CA,Raw,Open,66.5,67.5,190,-200,200,,200,95,102.5,-105,102.5,200,210,-217.5,210,512.5,SBD
2,Barbara Lee #1,F,1982-03-28,39,USA,TX,Raw,Open,67.4,67.5,165,177.5,182.5,,182.5,100,107.5,110,110,210,-222.5,-222.5,210,502.5,SBD
3,Cora Mecum,F,2000-04-28,21,USA,CA,Raw,Open,61.1,67.5,165,170,-180,,170,-110,117.5,-120,117.5,200,-205,-207.5,200,487.5,SBD
4,Elizabeth Ribaudo,F,1989-03-15,32,USA,FL,Raw,Open,66,67.5,155,165,170,,170,85,90,-95,90,195,207.5,-215,207.5,467.5,SBD
5,Riley Presnell,F,1993-05-30,28,USA,FL,Raw,Open,65.9,67.5,162.5,-170,-170,,162.5,90,95,97.5,97.5,205,-217.5,-217.5,205,465,SBD
6,Diamond Volk,F,1994-05-26,27,USA,VA,Raw,Open,66.6,67.5,170,177.5,-182.5,,177.5,82.5,87.5,90,90,170,180,-190,180,447.5,SBD
7,Caitlyn Dunlap,F,1991-01-22,30,USA,WV,Raw,Open,67,67.5,-150,150,157.5,,157.5,-107.5,-112.5,120,120,155,165,-172.5,165,442.5,SBD
1,Kristy Hawkins,F,1980-08-28,41,USA,CA,Raw,Open,74,75,240,255,262.5,,262.5,140,145,147.5,147.5,267.5,275,,275,685,SBD
2,Ashley Contorno,F,1988-10-14,32,USA,CA,Raw,Open,74.6,75,202.5,215,-227.5,,215,145,152.5,-160,152.5,215,230,237.5,237.5,605,SBD
3,Kelsey Paskert,F,1990-09-16,31,USA,IA,Raw,Open,68.6,75,170,-182.5,182.5,,182.5,115,-127.5,-127.5,115,207.5,220,227.5,227.5,525,SBD
1,Brianny Terry,F,1996-07-10,25,USA,NV,Raw,Open,75.8,82.5,215,-227.5,-227.5,,215,125,132.5,-137.5,132.5,257.5,272.5,-275,272.5,620,SBD
2,Terri Ashley,F,1982-06-21,39,USA,CA,Raw,Open,79.5,82.5,210,220,227.5,,227.5,107.5,-112.5,-117.5,107.5,-240,250,260,260,595,SBD
3,Sarah Lanzillo,F,1988-09-07,33,USA,FL,Raw,Open,81.3,82.5,205,217.5,-227.5,,217.5,115,125,130,130,205,215,-227.5,215,562.5,SBD
4,Erika Stevens,F,1990-10-14,30,USA,OH,Raw,Open,76.2,82.5,185,-200,200,,200,127.5,-132.5,-132.5,127.5,185,200,-207.5,200,527.5,SBD
5,Taylor Ball #2,F,1994-01-21,27,USA,KY,Raw,Open,79,82.5,200,212.5,-217.5,,212.5,100,105,-110,105,205,210,-215,210,527.5,SBD
6,Brittainy Chown,F,1990-12-12,30,USA,CA,Raw,Open,82,82.5,185,-197.5,-197.5,,185,90,92.5,97.5,97.5,212.5,220,-227.5,220,502.5,SBD
DQ,Amanda Fiatoa,F,1993-11-04,27,USA,FL,Raw,Open,75.8,82.5,182.5,192.5,-205,,192.5,132.5,-137.5,-140,132.5,,,,,,SBD
1,Amber Hansen,F,1989-04-04,32,USA,VA,Raw,Open,89.2,90,205,217.5,-227.5,,217.5,140,150,-155,150,227.5,235,240,240,607.5,SBD
2,Kheycie Romero,F,1993-06-17,28,USA,FL,Raw,Open,89.8,90,185,,,,185,110,115,120,120,255,265,-273.5,265,570,SBD
3,Karrie Macknair,F,1989-07-15,32,USA,PA,Raw,Open,89.8,90,200,210,,,210,112.5,122.5,-127.5,122.5,210,225,-230,225,557.5,SBD
4,Kelsey Hirte,F,1992-10-29,28,USA,CA,Raw,Open,88.8,90,172.5,180,,,180,102.5,110,115,115,220,230,,230,525,SBD
1,Tamara Walcott,F,1983-12-03,37,USA,MD,Raw,Open,136.7,90+,250,265,-282.5,,265,150,157.5,165,165,-265,265,288.5,288.5,718.5,SBD
2,Kiersten Scurlock,F,1992-09-12,29,USA,IL,Raw,Open,105.5,90+,245,257.5,262.5,,262.5,142.5,150,157.5,157.5,245,257.5,-262.5,257.5,677.5,SBD
3,Carina Davis,F,1983-05-09,38,USA,CA,Raw,Open,124.6,90+,212.5,232.5,245,,245,155,170,180,180,210,235,-245,235,660,SBD
4,Tenaya Tuteur,F,1989-07-14,32,USA,CA,Raw,Open,104.7,90+,200,215,225,,225,125,132.5,137.5,137.5,220,235,-240,235,597.5,SBD
DQ,Zac Kann,M,1991-08-27,30,USA,TX,Raw,Open,74.7,75,-252.5,-252.5,-252.5,,,-162.5,-162.5,-162.5,,-280,280,-290,280,,SBD
1,Blake Lehew,M,1995-07-25,26,USA,TX,Raw,Open,82.2,82.5,290,305,-315,,305,215,-227.5,-227.5,215,-340,340,-365,340,860,SBD
2,Geramy Alexander,M,1991-01-20,30,USA,TX,Raw,Open,82.3,82.5,265,287.5,-295,,287.5,167.5,185,200,200,312.5,330,-347.5,330,817.5,SBD
3,Trevor Jaffe,M,1979-11-02,41,USA,FL,Raw,Open,82.5,82.5,260,-275,275,,275,147.5,155,157.5,157.5,337.5,-350,350,350,782.5,SBD
4,Wyatt Trevithick,M,1995-08-08,26,USA,SC,Raw,Open,81.9,82.5,270,282.5,-290,,282.5,-185,185,192.5,192.5,285,302.5,-317.5,302.5,777.5,SBD
1,John Haack,M,1993-02-01,28,USA,CA,Raw,Open,89.5,90,322.5,340,-347.5,,340,235,250,263,263,365,385,402.5,402.5,1005.5,SBD
2,Chad Penson,M,1992-06-13,29,USA,CA,Raw,Open,90,90,342.5,-357.5,-357.5,,342.5,220,235,-240,235,-347.5,347.5,-365,347.5,925,SBD
3,Drake Stephens #1,M,1990-07-25,31,USA,WV,Raw,Open,89.2,90,-270,270,-280,,270,220,227.5,-230,227.5,317.5,330,340,340,837.5,SBD
4,Austin Dodd #1,M,1993-04-13,28,USA,AR,Raw,Open,90,90,295,-315,-315,,295,192.5,212.5,-222.5,212.5,287.5,-315,-315,287.5,795,SBD
5,Cole Gau,M,1996-10-25,24,USA,ND,Raw,Open,88.1,90,265,277.5,-290,,277.5,142.5,150,157.5,157.5,277.5,-305,-305,277.5,712.5,SBD
1,Joe Sullivan,M,1993-06-01,28,USA,OH,Raw,Open,99.6,100,355,373.5,380,,380,190,202.5,-205,202.5,315,-330,-330,315,897.5,SBD
2,Jordan Wong,M,1991-04-10,30,USA,FL,Raw,Open,99.4,100,337.5,355,375,-380.5,375,167.5,177.5,185,185,-300,300,322.5,322.5,882.5,SBD
3,Jake Benson,M,,27,USA,UT,Raw,Open,97.1,100,312.5,330,-340,,330,182.5,195,-197.5,195,325,342.5,350,350,875,SBD
4,Jordan Jarrell,M,1989-05-10,32,USA,KY,Raw,Open,99.5,100,272.5,290,305,,305,210,225,237.5,237.5,305,325,-355,325,867.5,SBD
5,Dawson Windham #1,M,1998-01-09,23,USA,SC,Raw,Open,98.9,100,295,315,,,315,210,220,-230,220,310,325,-340,325,860,SBD
6,Blaine Houck,M,1992-01-09,29,USA,FL,Raw,Open,99.9,100,280,290,-292.5,,290,220,235,-245,235,300,320,-337.5,320,845,SBD
7,Jad Alame,M,1993-02-10,28,USA,UT,Raw,Open,97.9,100,292.5,305,,,305,187.5,192.5,200,200,337.5,-350,-350,337.5,842.5,SBD
8,Ronald Tarvin,M,1989-05-31,32,USA,AL,Raw,Open,98.3,100,297.5,315,325,,325,192.5,202.5,207.5,207.5,287.5,305,-320,305,837.5,SBD
9,Xavier Burse,M,1998-05-04,23,USA,CA,Raw,Open,99.5,100,287.5,302.5,-317.5,,302.5,172.5,182.5,190,190,307.5,330,342.5,342.5,835,SBD
10,Houston Sullivan,M,1985-07-10,36,USA,CA,Raw,Open,99.5,100,300,-317.5,-317.5,,300,182.5,-192.5,-192.5,182.5,305,327.5,-340,327.5,810,SBD
11,Thomas Van Boven,M,1989-10-26,31,USA,OR,Raw,Open,99.8,100,270,282.5,295,,295,185,192.5,-202.5,192.5,310,320,-332.5,320,807.5,SBD
1,Jamal Browner,M,1994-10-11,26,USA,GA,Raw,Open,107.8,110,332.5,365,,,365,195,215,-227.5,215,-392.5,420,-455,420,1000,SBD
2,Maxavier Jean-Philippe,M,1993-03-04,28,USA,NY,Raw,Open,109.5,110,330,-350,-350,,330,225,235,-240,235,375,395,-410,395,960,SBD
3,Carlos Reyes #1,M,1992-02-27,29,USA,CT,Raw,Open,108.5,110,325,337.5,355,,355,220,240,247.5,247.5,310,335,-350,335,937.5,SBD
4,Ronnell Leftwich,M,1989-01-04,32,USA,GA,Raw,Open,109,110,325,332.5,-335,,332.5,210,215,220,220,342.5,367.5,-372.5,367.5,920,SBD
5,Nick Forte,M,1993-07-18,28,USA,PA,Raw,Open,109.1,110,312.5,325,-330,,325,222.5,232.5,-235,232.5,342.5,355,-365,355,912.5,SBD
6,Brandon Striegel,M,1999-07-19,22,USA,IN,Raw,Open,108,110,300,317.5,327.5,,327.5,195,210,-217.5,210,365,-400,-400,365,902.5,SBD
7,Donovan Parker Aleem,M,1993-08-26,28,USA,MD,Raw,Open,108.5,110,282.5,305,320,,320,185,197.5,205,205,302.5,322.5,337.5,337.5,862.5,SBD
8,Aaron Chapple,M,1984-01-29,37,USA,PA,Raw,Open,107.3,110,-292.5,292.5,310,,310,217.5,232.5,-237.5,232.5,305,-330,-345,305,847.5,SBD
9,Chico Cloyne,M,1991-08-09,30,USA,OH,Raw,Open,109.3,110,295,300,,,300,215,227.5,232.5,232.5,300,-307.5,-307.5,300,832.5,SBD
10,Kevin Oak,M,1986-03-30,35,USA,NY,Raw,Open,109.4,110,355,377.5,-390.5,,377.5,75,,,75,75,,,75,527.5,SBD
1,Zac Meyers,M,1994-01-21,27,USA,MD,Raw,Open,124.3,125,377.5,-395,395,,395,255,272.5,-280,272.5,345,367.5,-380,367.5,1035,SBD
2,Andy Huang #1,M,1984-08-02,37,USA,CA,Raw,Open,123.2,125,337.5,362.5,380,,380,212.5,225,235,235,325,350,370,370,985,SBD
3,Kade Proctor,M,1995-09-16,26,USA,MO,Raw,Open,123.9,125,337.5,367.5,-377.5,,367.5,222.5,235,240,240,350,-367.5,367.5,367.5,975,SBD
4,Danny Grigsby,M,1994-01-12,27,USA,VA,Raw,Open,121.8,125,312.5,332.5,,,332.5,-175,-187.5,187.5,187.5,417.5,440,-455,440,960,SBD
5,Josh Spaeth,M,1982-04-15,39,USA,WA,Raw,Open,123,125,347.5,372.5,380,,380,200,220,227.5,227.5,327.5,352.5,-365,352.5,960,SBD
6,Shane Hunt,M,1997-03-01,24,USA,FL,Raw,Open,119.7,125,320,340,-352.5,,340,205,215,,215,365,-387.5,-387.5,365,920,SBD
7,Dustin Kueck,M,1987-08-25,34,USA,TX,Raw,Open,124.2,125,320,-335,335,,335,247.5,262.5,-272.5,262.5,310,320,-322.5,320,917.5,SBD
1,Shane Haller,M,1993-01-30,28,USA,CT,Raw,Open,138.8,140,375,400,410,-420,410,227.5,245,-250,245,365,390,-400,390,1045,SBD
2,Luke Nall,M,1995-10-07,25,USA,IL,Raw,Open,139,140,-365,375,-395,,375,265,277.5,287.5,287.5,350,372.5,-385,372.5,1035,SBD
3,Shawn Doyle,M,1985-06-05,36,USA,OR,Raw,Open,138.9,140,-325,325,345,,345,235,250,-257.5,250,370,390,-410,390,985,SBD
4,Rondell Kelley,M,1990-11-01,30,USA,VA,Raw,Open,139.8,140,-342.5,352.5,-375,,352.5,250,-265,-265,250,365,-382.5,,365,967.5,SBD
5,Laken Fluegel,M,1994-05-11,27,USA,IA,Raw,Open,126.1,140,-342.5,342.5,-375,,342.5,225,240,247.5,247.5,340,365,-377.5,365,955,SBD
6,Ryan Barletto,M,1987-10-30,33,USA,PA,Raw,Open,138.5,140,330,-347.5,347.5,,347.5,242.5,257.5,-272.5,257.5,317.5,-347.5,-347.5,317.5,922.5,SBD
7,Tyler Obringer,M,1991-10-17,29,USA,OH,Raw,Open,139.8,140,320,342.5,-365,,342.5,192.5,205,,205,320,342.5,-350,342.5,890,SBD
1,Thomas Davis #1,M,1992-07-21,29,USA,IN,Raw,Open,196.9,140+,-365,365,-387.5,,365,290,-325,325,325,365,387.5,-410,387.5,1077.5,SBD
2,Craig Foster,M,1988-10-05,32,USA,FL,Raw,Open,167.5,140+,415,-445,457.5,,457.5,250,267.5,272.5,272.5,-295,-310,310,310,1040,SBD
3,Jackson Powell,M,2002-08-29,19,USA,GA,Raw,Open,154,140+,382.5,400,-412.5,,400,200,210,,210,317.5,332.5,345,345,955,SBD
