Division,WeightClassKg,Place,Name,Team,BodyweightKg,Best3SquatKg,Best3BenchKg,Best3DeadliftKg,TotalKg,Equipment,Event,Sex,BirthDate
Boys,51.71,1,Deandre Moody,Donna North,50.35,163.29,104.33,158.76,426.38,Single-ply,SBD,M,
Boys,51.71,2,Fabian Solis,Edinburg Idea College Prep,48.08,151.95,90.72,163.29,405.97,Single-ply,SBD,M,
Boys,51.71,3,Jacob Martinez,Donna North,51.26,151.95,74.84,174.63,401.43,Single-ply,SBD,M,
Boys,51.71,4,Marcos Salinas,Weslaco,50.35,124.74,68.04,142.88,335.66,Single-ply,SBD,M,
Boys,51.71,5,Julian Betancourt,Lyford,50.8,129.27,68.04,138.35,335.66,Single-ply,SBD,M,
Boys,51.71,DQ,Ethan Hernandez,Harlingen South,51.26,165.56,90.72,,,Single-ply,SBD,M,
Boys,51.71,DQ,Israel Juarez,San Benito,49.9,,,,,Single-ply,SBD,M,
Boys,55.79,1,Louie Cavazos,Donna North,55.79,199.58,127.01,210.92,537.51,Single-ply,SBD,M,
Boys,59.87,1,Gabriel Chavez,Lyford,59.87,201.85,95.25,199.58,496.68,Single-ply,SBD,M,
Boys,59.87,2,Matthew Elizondo,Harlingen,58.97,174.63,133.81,174.63,483.08,Single-ply,SBD,M,
Boys,59.87,3,Eric Gonzalez #2,Weslaco,58.97,188.24,106.59,188.24,483.08,Single-ply,SBD,M,
Boys,59.87,4,Jason Duarte,Weslaco,59.87,172.37,106.59,181.44,460.4,Single-ply,SBD,M,
Boys,59.87,5,Jeremy Salazar,Donna North,58.97,161.03,104.33,167.83,433.18,Single-ply,SBD,M,
Boys,59.87,6,Miguel Lerma,Weslaco,59.42,185.97,74.84,165.56,426.38,Single-ply,SBD,M,
Boys,59.87,7,Darren Perez,Harlingen South,59.42,163.29,81.65,163.29,408.23,Single-ply,SBD,M,
Boys,59.87,8,Jaden Delarosa,San Benito,59.87,142.88,86.18,147.42,376.48,Single-ply,SBD,M,
Boys,59.87,9,Giovanni Pacheco,Edinburg Idea College Prep,59.87,140.61,74.84,138.35,353.8,Single-ply,SBD,M,
Boys,59.87,10,Emiliano Longoria,Harlingen,56.7,102.06,52.16,106.59,260.82,Single-ply,SBD,M,
Boys,67.13,1,Marcus Saenz,Weslaco,66.22,215.46,142.88,195.04,553.38,Single-ply,SBD,M,
Boys,67.13,2,Oscar Garza,Edinburg Idea College Prep,66.22,185.97,145.15,213.19,544.31,Single-ply,SBD,M,
Boys,67.13,3,Isaiah Perales,Harlingen,65.32,204.12,129.27,206.38,539.77,Single-ply,SBD,M,
Boys,67.13,4,Dylan Ybarra,San Benito,65.77,208.65,127.01,199.58,535.24,Single-ply,SBD,M,
Boys,67.13,5,Evan Zamora,Weslaco,67.13,199.58,117.93,204.12,521.63,Single-ply,SBD,M,
Boys,67.13,6,Noah Guzman,Lyford,66.22,167.83,81.65,167.83,417.3,Single-ply,SBD,M,
Boys,67.13,7,Rick De Luna,Lyford,67.13,158.76,79.38,161.03,399.16,Single-ply,SBD,M,
Boys,67.13,8,Damian Rangel,Lyford,65.77,138.35,77.11,163.29,378.75,Single-ply,SBD,M,
Boys,74.84,1,Harley Rios,Weslaco,72.57,233.6,138.35,226.8,598.74,Single-ply,SBD,M,
Boys,74.84,2,Edgar Duran,PSJA North,72.12,233.6,129.27,213.19,576.06,Single-ply,SBD,M,
Boys,74.84,3,Brandon Compian,San Benito,74.84,226.8,136.08,181.44,544.31,Single-ply,SBD,M,
Boys,74.84,4,Robert Gomez,Donna North,73.48,206.38,102.06,233.6,542.04,Single-ply,SBD,M,
Boys,74.84,5,Victor Rubalcaba,Lyford,74.39,210.92,113.4,215.46,539.77,Single-ply,SBD,M,
Boys,74.84,6,Ethan Moreno,Lyford,74.39,192.78,115.67,206.38,514.83,Single-ply,SBD,M,
Boys,74.84,7,Adrian Gonzalez,Harlingen,74.39,158.76,117.93,190.51,467.2,Single-ply,SBD,M,
Boys,74.84,8,August Wilson,Harlingen South,72.57,158.76,97.52,179.17,435.45,Single-ply,SBD,M,
Boys,74.84,DQ,Luis Sanchez,PSJA North,74.39,,,,,Single-ply,SBD,M,
Boys,82.1,1,Izaac Parra,Harlingen South,81.74,256.28,129.27,224.53,610.08,Single-ply,SBD,M,
Boys,82.1,2,Ethan Soto,PSJA North,77.11,231.33,122.47,224.53,578.33,Single-ply,SBD,M,
Boys,82.1,3,Kian Torres,Harlingen,81.19,219.99,124.74,224.53,569.26,Single-ply,SBD,M,
Boys,82.1,4,Jesus Benavides,Donna North,80.74,219.99,131.54,197.31,548.85,Single-ply,SBD,M,
Boys,82.1,5,Naven Ledesma,PSJA North,82.1,192.78,138.35,174.63,505.76,Single-ply,SBD,M,
Boys,82.1,6,Edgardo Duran,PSJA North,79.38,195.04,97.52,192.78,485.34,Single-ply,SBD,M,
Boys,82.1,7,Alex Rosas,Lyford,82.1,183.7,106.59,188.24,478.54,Single-ply,SBD,M,
Boys,82.1,DQ,Alex Castro,Lyford,79.38,165.56,102.06,,,Single-ply,SBD,M,
Boys,82.1,DQ,Atticus Deleion,San Benito,79.38,215.46,,,,Single-ply,SBD,M,
Boys,89.81,1,Robert Trevino,San Benito,88.54,244.94,136.08,249.48,630.49,Single-ply,SBD,M,
Boys,89.81,2,Tyler Hite,San Benito,87.54,233.6,147.42,199.58,580.6,Single-ply,SBD,M,
Boys,89.81,3,Luis Esquivel,Weslaco,84.37,215.46,136.08,204.12,555.65,Single-ply,SBD,M,
Boys,89.81,4,Alfredo Mendoza,San Benito,88.63,204.12,108.86,242.67,555.65,Single-ply,SBD,M,
Boys,89.81,5,Caleb Anaya,Harlingen South,85.28,217.72,127.01,204.12,548.85,Single-ply,SBD,M,
Boys,89.81,6,Nathan Ledesma,PSJA North,83.91,192.78,142.88,174.63,510.29,Single-ply,SBD,M,
Boys,89.81,7,Thomas Larios,Harlingen,89.36,192.78,111.13,167.83,471.74,Single-ply,SBD,M,
Boys,89.81,8,Andres Garza,PSJA North,86.18,188.24,108.86,172.37,469.47,Single-ply,SBD,M,
Boys,89.81,DQ,Angel Sanchez #7,Donna North,87.09,,,,,Single-ply,SBD,M,
Boys,99.79,1,Nova Bajaran,San Benito,94.71,249.48,147.42,210.92,607.81,Single-ply,SBD,M,
Boys,99.79,2,Javier Garcia #14,Donna North,97.98,242.67,113.4,238.14,594.21,Single-ply,SBD,M,
Boys,99.79,3,Omar Guerrero,Donna North,99.34,231.33,147.42,183.7,562.45,Single-ply,SBD,M,
Boys,99.79,4,Gilbert Lerma,Harlingen South,93.89,208.65,127.01,222.26,557.92,Single-ply,SBD,M,
Boys,99.79,5,Diego Salazar,Weslaco,91.63,219.99,124.74,183.7,528.44,Single-ply,SBD,M,
Boys,99.79,6,Tomas Mendez,PSJA North,92.53,192.78,124.74,161.03,478.54,Single-ply,SBD,M,
Boys,99.79,7,Keller Busse,Lyford,97.98,165.56,68.04,165.56,399.16,Single-ply,SBD,M,
Boys,99.79,8,Damian Santana,Edinburg Idea College Prep,92.08,113.4,61.23,120.2,294.84,Single-ply,SBD,M,
Boys,99.79,DQ,Tyson Tatum,Harlingen South,98.88,,,,,Single-ply,SBD,M,
Boys,99.79,DQ,Lorenzo Cantu,Lyford,97.52,167.83,,,,Single-ply,SBD,M,
Boys,109.77,1,Nate Garcia,San Benito,109.41,249.48,145.15,254.01,648.64,Single-ply,SBD,M,
Boys,109.77,2,Carlos Martinez #25,Lyford,103.42,244.94,145.15,254.01,644.1,Single-ply,SBD,M,
Boys,109.77,3,Adaen Sanchez,PSJA North,106.14,276.69,149.69,215.46,641.83,Single-ply,SBD,M,
Boys,109.77,4,Ramzi Memik,Harlingen,109.77,260.82,156.49,206.38,623.69,Single-ply,SBD,M,
Boys,109.77,5,Ezra Echavarria,Harlingen South,107.95,226.8,131.54,210.92,569.26,Single-ply,SBD,M,
Boys,109.77,6,Carlos Salazar,Weslaco,109.77,208.65,127.01,224.53,560.19,Single-ply,SBD,M,
Boys,109.77,7,Dante Matamoros,Edinburg Idea College Prep,104.78,151.95,97.52,158.76,408.23,Single-ply,SBD,M,
Boys,109.77,8,Joel Villafuerte,Edinburg Idea College Prep,109.32,163.29,90.72,147.42,401.43,Single-ply,SBD,M,
Boys,124.74,1,Julian Moreno,Santa Rosa,120.2,229.06,163.29,226.8,619.15,Single-ply,SBD,M,
Boys,124.74,2,Angel Rodriguez #14,Donna North,116.12,226.8,120.2,204.12,551.11,Single-ply,SBD,M,
Boys,124.74,DQ,Jose Guzman,Santa Rosa,118.39,133.81,,,,Single-ply,SBD,M,
Boys,139.71,1,Thomas Santillan,Weslaco,135.62,328.85,163.29,240.4,732.55,Single-ply,SBD,M,
Boys,139.71,2,Jose Martinez #3,San Benito,133.72,263.08,158.76,233.6,655.44,Single-ply,SBD,M,
Boys,139.71,3,Frank Medina,San Benito,132.81,263.08,149.69,235.87,648.64,Single-ply,SBD,M,
Boys,139.71,4,Gerardo Rios,Santa Rosa,128.82,272.16,145.15,224.53,641.83,Single-ply,SBD,M,
Boys,139.71,5,Isaiah Loya,Donna North,128.82,274.42,147.42,210.92,632.76,Single-ply,SBD,M,
Boys,139.71,6,Marcus Hernandez #4,PSJA North,129.73,235.87,151.95,195.04,582.87,Single-ply,SBD,M,
Boys,139.71,7,Derrick Perez,Harlingen,137.89,233.6,151.95,197.31,582.87,Single-ply,SBD,M,
Boys,139.71,8,Roy Reyna,Harlingen,133.81,229.06,142.88,197.31,569.26,Single-ply,SBD,M,
Boys,139.71,9,Eloy Molina,Weslaco,126.1,222.26,154.22,183.7,560.19,Single-ply,SBD,M,
Boys,139.71,10,Nelson Quintero,Edinburg Idea College Prep,133.81,183.7,131.54,195.04,510.29,Single-ply,SBD,M,
Boys,139.71,DQ,Salvador Sachez,PSJA North,125.19,,,,,Single-ply,SBD,M,
Boys,139.71,DQ,Anthony Johnson,Harlingen,134.26,,,,,Single-ply,SBD,M,
Boys,139.71+,1,Caleb Davis,Harlingen South,157.85,347,210.92,249.48,807.39,Single-ply,SBD,M,
Boys,139.71+,2,Ty Mattingly,Harlingen South,149.69,188.24,122.47,185.97,496.68,Single-ply,SBD,M,
Boys,139.71+,DQ,Dexter Delgado,Harlingen South,172.91,294.84,,,,Single-ply,SBD,M,
Boys,,NS,Aaron Munoz,Harlingen,,,,,,Single-ply,SBD,M,
Boys,,NS,Izaiah Bell,Harlingen,,,,,,Single-ply,SBD,M,
Boys,,NS,Uziel Vazquez,Edinburg Idea College Prep,,,,,,Single-ply,SBD,M,
Boys,,NS,Rafael Oyervides,Edinburg Idea College Prep,,,,,,Single-ply,SBD,M,
Boys,,NS,Alexis Guzman #4,Donna North,,,,,,Single-ply,SBD,M,
