Division,Name,State,Sex,WeightClassKg,BodyweightKg,Best3SquatKg,Best3BenchKg,TotalKg,Equipment,Event,Age,Best3DeadliftKg,Place
M-O,Michael Anderson,VT,M,67.5,65.14,165.56,113.4,489.88,Single-ply,SBD,20,210.92,1
M-O,Michael Anderson,VT,M,67.5,65.14,165.56,113.4,489.88,Single-ply,SBD,20,210.92,2
M-O,Luke Badaracco,CT,M,125+,133.58,231.33,195.04,682.66,Single-ply,SBD,20,256.28,8
M-O,Steve Beaupre,ME,M,75,74.03,272.16,,,Single-ply,SBD,34,,DQ
M-O,Steve Beaupre,ME,M,75,74.03,272.16,,,Single-ply,SBD,34,,DQ
M-O,Kevin Beauregard,RI,M,82.5,80.56,210.92,131.54,569.26,Single-ply,SBD,30,226.8,8
M-O,Kevin Beauregard,RI,M,82.5,80.56,210.92,131.54,569.26,Single-ply,SBD,30,226.8,9
F-O,Allison Bradshaw,MA,F,90,83.91,156.49,95.25,412.77,Single-ply,SBD,24,161.03,1
FR-O,Allison Bradshaw,MA,F,90,83.91,156.49,95.25,412.77,Raw,SBD,24,161.03,1
MR-O,Jeff Brono,MA,M,90,87.09,192.78,140.61,578.33,Raw,SBD,20,244.94,2
MR-O,Benjamin W Brown,MA,M,82.5,80.74,172.37,115.67,535.24,Raw,SBD,34,247.21,4
MR-O,Benjamin W Brown,MA,M,82.5,80.74,172.37,115.67,535.24,Raw,SBD,34,247.21,5
M-O,Mark Bruno,MA,M,90,86.86,192.78,133.81,598.74,Single-ply,SBD,20,272.16,1
MR-O,Mark Bruno,MA,M,90,86.86,192.78,133.81,598.74,Raw,SBD,20,272.16,1
MR-O,Jeffrey Burke,RI,M,90,86.86,127.01,111.13,399.16,Raw,SBD,55,161.03,5
MR-O,Jeffrey Burke,RI,M,90,86.86,127.01,111.13,399.16,Raw,SBD,55,161.03,6
M-O,Terry Butler,NY,M,82.5,80.65,299.37,192.78,739.36,Single-ply,SBD,30,247.21,1
M-O,Terry Butler,NY,M,82.5,80.65,299.37,192.78,739.36,Single-ply,SBD,30,247.21,2
M-O,Dennis P. Chervenak,NJ,M,100,97.75,133.81,81.65,392.36,Single-ply,SBD,59,176.9,18
M-O,Dennis P. Chervenak,NJ,M,100,97.75,133.81,81.65,392.36,Single-ply,SBD,59,176.9,19
MR-O,Chris Collins #6,MA,M,100,96.39,181.44,151.95,539.77,Raw,SBD,26,206.38,1
MR-O,Chris Collins #6,MA,M,100,96.39,181.44,151.95,539.77,Raw,SBD,26,206.38,2
M-O,Kevin J. Conroy,MA,M,90,87.54,172.37,140.61,517.1,Single-ply,SBD,59,204.12,6
M-O,Kevin J. Conroy,MA,M,90,87.54,172.37,140.61,517.1,Single-ply,SBD,59,204.12,7
F-O,Rebecca Crapo,ME,F,75,68.04,,104.33,,Single-ply,SBD,32,,DQ
F-O,Rebecca Crapo,ME,F,75,68.04,,104.33,,Single-ply,SBD,32,,DQ
M-O,Pat Davitt,MA,M,75,74.21,145.15,131.54,478.54,Single-ply,SBD,21,201.85,5
M-O,Sean Davitt,MA,M,90,87.54,158.76,124.74,498.95,Single-ply,SBD,22,215.46,8
M-O,Pat Davitt,MA,M,75,74.21,145.15,131.54,478.54,Single-ply,SBD,21,201.85,6
M-O,Sean Davitt,MA,M,90,87.54,158.76,124.74,498.95,Single-ply,SBD,22,215.46,9
F-O,Ranata DeGennaro,NY,F,60,57.52,54.43,45.36,197.31,Single-ply,SBD,15,97.52,3
F-O,Ranata DeGennaro,NY,F,60,57.52,54.43,45.36,197.31,Single-ply,SBD,15,97.52,4
MR-O,Rick Depalma,CT,M,90,86.86,158.76,117.93,469.47,Raw,SBD,22,192.78,3
M-O,Rick Depalma,CT,M,90,86.86,158.76,117.93,469.47,Single-ply,SBD,22,192.78,10
MR-O,Eric Discko,MA,M,110,104.55,210.92,142.88,589.67,Raw,SBD,20,235.87,1
M-O,Douglas Emar,MA,M,90,85.09,190.51,145.15,544.31,Single-ply,SBD,24,208.65,4
M-O,Douglas Emar,MA,M,90,85.09,190.51,145.15,544.31,Single-ply,SBD,24,208.65,5
M-O,Curt Farrison,CT,M,110,107.27,183.7,65.77,312.98,Single-ply,SBD,64,63.5,3
M-O,Curt Farrison,CT,M,110,107.27,183.7,65.77,312.98,Single-ply,SBD,64,63.5,4
M-O,Louis Fiorenzano,RI,M,82.5,81.1,195.04,136.08,514.83,Single-ply,SBD,24,183.7,19
M-O,Louis Fiorenzano,RI,M,82.5,81.1,195.04,136.08,514.83,Single-ply,SBD,24,183.7,20
M-O,Edward Gasinowski,MA,M,82.5,80.74,215.46,140.61,591.94,Single-ply,SBD,36,235.87,4
M-O,Edward Gasinowski,MA,M,82.5,80.74,215.46,140.61,591.94,Single-ply,SBD,36,235.87,5
M-O,Pat Gorman,MA,M,82.5,80.1,204.12,113.4,544.31,Single-ply,SBD,25,226.8,17
M-O,Pat Gorman,MA,M,82.5,80.1,204.12,113.4,544.31,Single-ply,SBD,25,226.8,18
M-O,Evan Gross,MA,M,82.5,80.51,161.03,127.01,487.61,Single-ply,SBD,19,199.58,21
MR-O,Evan Gross,MA,M,82.5,80.51,161.03,127.01,487.61,Raw,SBD,19,199.58,6
M-O,Jeffrey Hadad,NH,M,67.5,66.68,124.74,170.1,453.59,Single-ply,SBD,42,158.76,5
M-O,Jeffrey Hadad,NH,M,67.5,66.68,124.74,170.1,453.59,Single-ply,SBD,42,158.76,6
M-O,Jeffrey Hadad,NH,M,67.5,66.68,124.74,170.1,453.59,Single-ply,SBD,42,158.76,7
M-O,Daniel Jaffe,ME,M,82.5,79.15,172.37,147.42,546.58,Single-ply,SBD,23,226.8,16
MR-O,Daniel Jaffe,ME,M,82.5,79.15,172.37,147.42,546.58,Raw,SBD,23,226.8,3
M-O,Luis Jaimes,MA,M,82.5,81.19,210.92,158.76,603.28,Single-ply,SBD,19,233.6,3
M-O,Rick Johnson,MA,M,90,89.36,217.72,122.47,591.94,Single-ply,SBD,45,251.74,2
M-O,Rick Johnson,MA,M,90,89.36,217.72,122.47,591.94,Single-ply,SBD,44,251.74,3
M-O,Frank Juszynski,MA,M,100,92.99,192.78,131.54,573.79,Single-ply,SBD,38,249.48,7
M-O,Frank Juszynski,MA,M,100,92.99,192.78,131.54,573.79,Single-ply,SBD,38,249.48,8
F-O,Shannon Kane,NY,F,60,57.52,79.38,47.63,235.87,Single-ply,SBD,17,108.86,1
F-O,Shannon Kane,NY,F,60,57.52,79.38,47.63,235.87,Single-ply,SBD,17,108.86,2
M-O,Matthew Kardok,MA,M,82.5,82.33,120.2,86.18,349.27,Single-ply,SBD,29,142.88,22
M-O,Matthew Kardok,MA,M,82.5,82.33,120.2,86.18,349.27,Single-ply,SBD,29,142.88,23
M-O,Wayne Lacy,VT,M,90,89.36,192.78,,,Single-ply,SBD,42,,DQ
M-O,Wayne Lacy,VT,M,90,89.36,192.78,,,Single-ply,SBD,42,,DQ
M-O,Eli Laipson-Williams,MA,M,100,95.89,249.48,127.01,603.28,Single-ply,SBD,20,226.8,5
M-O,Eli Laipson-Williams,MA,M,100,95.89,249.48,127.01,603.28,Single-ply,SBD,20,226.8,6
F-O,Dara Lehans,NH,F,67.5,67.13,136.08,65.77,349.27,Single-ply,SBD,56,147.42,1
F-O,Dara Lehans,NH,F,67.5,67.13,136.08,65.77,349.27,Single-ply,SBD,56,147.42,2
M-O,Michael Lund,MA,M,110,101.42,267.62,,,Single-ply,SBD,26,,DQ
M-O,Michael Lund,MA,M,110,101.42,267.62,,,Single-ply,SBD,26,,DQ
M-O,Mario Mai,MA,M,82.5,80.29,142.88,,,Single-ply,SBD,24,,DQ
MR-O,Jonathan Maneen,MA,M,75,72.57,115.67,147.42,439.98,Raw,SBD,19,176.9,3
M-O,Jonathan Maneen,MA,M,75,72.57,115.67,147.42,439.98,Single-ply,SBD,19,176.9,7
M-O,Andrew Mangan,RI,M,110,105.14,242.67,,,Single-ply,SBD,21,,DQ
M-O,Andrew Mangan,RI,M,110,105.14,242.67,,,Single-ply,SBD,21,,DQ
M-O,Kevin Manning,MA,M,82.5,76.2,206.38,158.76,562.45,Single-ply,SBD,46,197.31,10
M-O,Kevin Manning,MA,M,82.5,76.2,206.38,158.76,562.45,Single-ply,SBD,46,197.31,11
M-O,Geoffrey Marston,RI,M,100,95.16,215.46,122.47,555.65,Single-ply,SBD,21,217.72,11
M-O,Geoffrey Marston,RI,M,100,95.16,215.46,122.47,555.65,Single-ply,SBD,21,217.72,12
FR-O,Deborah Mason,RI,F,75,73.21,108.86,63.5,308.44,Raw,SBD,52,136.08,1
M-O,R Nathan Mason,RI,M,100,98.25,204.12,131.54,562.45,Single-ply,SBD,28,226.8,9
F-O,Deborah Mason,RI,F,75,73.21,108.86,63.5,308.44,Single-ply,SBD,52,136.08,1
M-O,R Nathan Mason,RI,M,100,98.25,204.12,131.54,562.45,Single-ply,SBD,28,226.8,10
M-O,Adam Matson,MA,M,67.5,66.95,174.63,106.59,480.81,Single-ply,SBD,21,199.58,3
M-O,Adam Matson,MA,M,67.5,66.95,174.63,106.59,480.81,Single-ply,SBD,21,199.58,4
M-O,Ryan Moore,MA,M,110,104.78,260.82,136.08,662.24,Single-ply,SBD,17,265.35,1
M-O,Ryan Moore,MA,M,110,104.78,260.82,136.08,662.24,Single-ply,SBD,17,265.35,2
M-O,Jason Muccono,RI,M,82.5,80.74,197.31,145.15,551.11,Single-ply,SBD,21,208.65,14
M-O,Jason Muccono,RI,M,82.5,80.74,197.31,145.15,551.11,Single-ply,SBD,21,208.65,15
F-O,Stephanie Nappa,RI,F,67.5,63.41,113.4,49.9,281.23,Single-ply,SBD,15,117.93,3
F-O,Stephanie Nappa,RI,F,67.5,63.41,113.4,49.9,281.23,Single-ply,SBD,15,117.93,4
M-O,Joseph Nappa Jr,RI,M,100,91.53,272.16,174.63,703.07,Single-ply,SBD,21,256.28,3
M-O,Joseph Nappa Jr,RI,M,100,91.53,272.16,174.63,703.07,Single-ply,SBD,21,256.28,4
MR-O,Chad Nelson,MA,M,75,72.8,145.15,108.86,446.79,Raw,SBD,32,192.78,1
MR-O,Chad Nelson,MA,M,75,72.8,145.15,108.86,446.79,Raw,SBD,32,192.78,2
MR-O,Brent Pendleton,MA,M,125,123.15,238.14,165.56,680.39,Raw,SBD,36,276.69,1
MR-O,Brent Pendleton,MA,M,125,123.15,238.14,165.56,680.39,Raw,SBD,36,276.69,2
M-O,Andrew Poland,RI,M,82.5,76.84,201.85,136.08,555.65,Single-ply,SBD,25,217.72,12
M-O,Andrew Poland,RI,M,82.5,76.84,201.85,136.08,555.65,Single-ply,SBD,25,217.72,13
M-O,Joseph Puleo,RI,M,67.5,66.22,149.69,104.33,408.23,Single-ply,SBD,19,154.22,8
M-O,Joseph Puleo,RI,M,67.5,66.22,149.69,104.33,408.23,Single-ply,SBD,19,154.22,9
MR-O,Michael Repetto,MA,M,100,96.62,61.23,172.37,399.16,Raw,SBD,20,165.56,3
M-O,Michael Repetto,MA,M,100,96.62,61.23,172.37,399.16,Single-ply,SBD,20,165.56,17
M-O,Steven Ritucci Jr,MA,M,82.5,78.29,183.7,170.1,580.6,Single-ply,SBD,30,226.8,6
M-O,Steven Ritucci Jr,MA,M,82.5,78.29,183.7,170.1,580.6,Single-ply,SBD,30,226.8,7
M-O,Justin Rolfe,ME,M,125+,138.71,272.16,190.51,700.8,Single-ply,SBD,17,238.14,5
M-O,Justin Rolfe,ME,M,125+,138.71,272.16,190.51,700.8,Single-ply,SBD,17,238.14,6
M-O,Justin Rolfe,ME,M,125+,138.71,272.16,190.51,700.8,Single-ply,SBD,17,238.14,7
M-O,Kevin Rossi,RI,M,100,97.61,260.82,199.58,709.87,Single-ply,SBD,47,249.48,1
M-O,Kevin Rossi,RI,M,100,97.61,260.82,199.58,709.87,Single-ply,SBD,47,249.48,2
MR-O,Dennis Schuman,MA,M,82.5,81.87,213.19,131.54,553.38,Raw,SBD,52,208.65,1
MR-O,Dennis Schuman,MA,M,82.5,81.87,213.19,131.54,553.38,Raw,SBD,52,208.65,2
F-O,Jessica Scofield,CT,F,75,69.85,61.23,61.23,251.74,Single-ply,SBD,26,129.27,2
F-O,Jessica Scofield,CT,F,75,69.85,61.23,61.23,251.74,Single-ply,SBD,25,129.27,3
F-O,Nicole Simonis,NY,F,44,43.82,58.97,34.02,183.7,Single-ply,SBD,17,90.72,1
F-O,Nicole Simonis,NY,F,44,43.82,58.97,34.02,183.7,Single-ply,SBD,17,90.72,2
M-O,George Sousa,MA,M,100,93.67,233.6,167.83,492.15,Single-ply,SBD,35,90.72,13
M-O,George Sousa,MA,M,100,93.67,233.6,167.83,492.15,Single-ply,SBD,35,90.72,14
F-O,Jennifer Stone,MA,F,56,54.43,74.84,47.63,206.38,Single-ply,SBD,35,83.91,1
M-O,Brendan Stote,CT,M,125+,128.64,251.74,195.04,718.94,Single-ply,SBD,22,272.16,3
M-O,Brendan Stote,CT,M,125+,128.64,251.74,195.04,718.94,Single-ply,SBD,22,272.16,4
M-O,Ken Takahashi,MA,M,125+,136.3,120.2,104.33,367.41,Single-ply,SBD,18,142.88,9
MR-O,Ken Takahashi,MA,M,125+,136.3,120.2,104.33,367.41,Raw,SBD,18,142.88,1
M-O,Edwin Urrutia,NY,M,100,97.7,181.44,102.06,426.38,Single-ply,SBD,20,142.88,15
M-O,Edwin Urrutia,NY,M,100,97.7,181.44,102.06,426.38,Single-ply,SBD,20,142.88,16
M-O,Matt Waters,MA,M,90,83.23,106.59,108.86,412.77,Single-ply,SBD,18,197.31,11
MR-O,Matt Waters,MA,M,90,83.23,106.59,108.86,412.77,Raw,SBD,18,197.31,4
M-O,Lloyd Weinstein,CT,M,75,68.72,231.33,129.27,601.01,Single-ply,SBD,49,240.4,3
M-O,Lloyd Weinstein,CT,M,75,68.72,231.33,129.27,601.01,Single-ply,SBD,49,240.4,4
M-O,Tom West,CT,M,125,124.28,197.31,199.58,639.57,Single-ply,SBD,37,242.67,1
M-O,Michael York,ME,M,75,74.48,219.99,170.1,628.23,Single-ply,SBD,20,238.14,1
M-O,Michael York,ME,M,75,74.48,219.99,170.1,628.23,Single-ply,SBD,20,238.14,2
M-O,Michael Zawilinski,MA,M,125+,164.38,306.17,238.14,796.05,Single-ply,SBD,28,251.74,1
M-O,Michael Zawilinski,MA,M,125+,164.38,306.17,238.14,796.05,Single-ply,SBD,28,251.74,2
