Division,WeightClassKg,Place,Name,Team,BodyweightKg,Best3SquatKg,Best3BenchKg,Best3DeadliftKg,TotalKg,Equipment,Event,Sex
Boys,51.71,1,Juan Duran #2,Lubbock Cooper,49.99,117.93,74.84,149.69,342.46,Single-ply,SBD,M
Boys,51.71,2,Israel Hernandez,Lubbock Cooper,46.54,106.59,58.97,113.4,278.96,Single-ply,SBD,M
Boys,51.71,3,Derek Tovar,Sudan,49.08,95.25,65.77,115.67,276.69,Single-ply,SBD,M
Boys,51.71,4,Alex Urbano,Meadow,48.63,63.5,54.43,106.59,224.53,Single-ply,SBD,M
Boys,51.71,5,Daniel Denton,Wolfforth Frenship,44.72,65.77,43.09,90.72,199.58,Single-ply,SBD,M
Boys,55.79,1,Mathew Morado,Meadow,55.7,92.99,47.63,113.4,254.01,Single-ply,SBD,M
Boys,59.87,2,Teaguen Nolte,Sudan,55.97,86.18,52.16,111.13,249.48,Single-ply,SBD,M
Boys,55.79,DQ,Arturo Rodriguez,Meadow,53.52,127.01,,,,Single-ply,SBD,M
Boys,55.79,DQ,Adrian Perez,Meadow,55.43,,,,,Single-ply,SBD,M
Boys,55.79,DQ,Gage Rigdon,Meadow,52.25,104.33,,,,Single-ply,SBD,M
Boys,55.79,DQ,Gavon Gardner,Meadow,52.53,136.08,,,,Single-ply,SBD,M
Boys,67.13,1,Adam Martin,Sudan,60.01,183.7,88.45,190.51,462.66,Single-ply,SBD,M
Boys,59.87,2,JD Rojas,Lubbock Roosevelt,59.42,154.22,99.79,165.56,419.57,Single-ply,SBD,M
Boys,67.13,3,Jeremy Reeves,Lubbock Cooper,60.06,158.76,83.91,165.56,408.23,Single-ply,SBD,M
Boys,59.87,4,Johnny Hernandez,Sundown,59.33,149.69,74.84,154.22,378.75,Single-ply,SBD,M
Boys,59.87,5,David Casteneda,Tahoka,59.06,131.54,77.11,163.29,371.95,Single-ply,SBD,M
Boys,67.13,6,Dillon Smith,Lubbock Cooper,60.06,120.2,92.99,147.42,360.61,Single-ply,SBD,M
Boys,59.87,7,Justin Rodriguez,Lubbock Cooper,59.15,102.06,74.84,145.15,322.05,Single-ply,SBD,M
Boys,59.87,8,Kobe Young,Wolfforth Frenship,57.7,115.67,65.77,136.08,317.51,Single-ply,SBD,M
Boys,59.87,9,Marco Godinez,Sudan,59.6,117.93,65.77,133.81,317.51,Single-ply,SBD,M
Boys,59.87,10,Gabe Rodriguez,Lubbock Cooper,58.97,104.33,56.7,117.93,278.96,Single-ply,SBD,M
Boys,59.87,11,Christian Rodriguez #8,Brownfield,57.97,102.06,54.43,104.33,260.82,Single-ply,SBD,M
Boys,59.87,DQ,Marcus Gonzales,Brownfield,56.97,104.33,63.5,,,Single-ply,SBD,M
Boys,59.87,DQ,Angel Rodríguez #6,Meadow,58.51,120.2,,,,Single-ply,SBD,M
Boys,67.13,1,Joseph Hernandez,Sundown,66.77,188.24,113.4,181.44,483.08,Single-ply,SBD,M
Boys,67.13,2,Ethan Mullins,Meadow,66.68,158.76,81.65,185.97,426.38,Single-ply,SBD,M
Boys,67.13,3,Hadley Reynolds,Tahoka,62.41,136.08,79.38,158.76,374.21,Single-ply,SBD,M
Boys,67.13,4,Blake Allen,Lubbock Roosevelt,61.69,111.13,81.65,142.88,335.66,Single-ply,SBD,M
Boys,74.84,5,Alex Rodriguez #7,Sudan,67.31,124.74,72.57,138.35,335.66,Single-ply,SBD,M
Boys,67.13,6,Gary Duran,Brownfield,62.23,122.47,68.04,117.93,308.44,Single-ply,SBD,M
Boys,67.13,7,Chris Montemayor,Tahoka,61.14,65.77,38.56,90.72,195.04,Single-ply,SBD,M
Boys,67.13,DQ,Robert Smith,Wolfforth Frenship,64.14,,,,,Single-ply,SBD,M
Boys,67.13,DQ,Cayden Melton,Meadow,61.96,65.77,,,,Single-ply,SBD,M
Boys,74.84,1,Jon Chavez,Sundown,71.76,204.12,92.99,199.58,496.68,Single-ply,SBD,M
Boys,74.84,2,Bj Trevino,Lubbock Cooper,74.57,192.78,97.52,181.44,471.74,Single-ply,SBD,M
Boys,74.84,3,Xavier Baker,Sudan,71.3,167.83,92.99,192.78,453.59,Single-ply,SBD,M
Boys,74.84,4,Brandon Morris,Lubbock Cooper,71.67,176.9,92.99,183.7,453.59,Single-ply,SBD,M
Boys,74.84,5,Daniel Aleman,Tahoka,73.12,140.61,86.18,149.69,376.48,Single-ply,SBD,M
Boys,74.84,6,Quince Workman,Wolfforth Frenship,70.22,113.4,81.65,172.37,367.41,Single-ply,SBD,M
Boys,74.84,7,Preston Bradley,Sudan,74.57,131.54,79.38,154.22,365.14,Single-ply,SBD,M
Boys,74.84,8,Miguel Garza,Brownfield,69.67,108.86,63.5,124.74,297.1,Single-ply,SBD,M
Boys,74.84,DQ,Sebastion Martinez,Brownfield,73.48,113.4,63.5,,,Single-ply,SBD,M
Boys,74.84,DQ,Cameron McQueen,Meadow,68.67,,,,,Single-ply,SBD,M
Boys,74.84,DQ,Paul Varner,Sundown,73.84,,,,,Single-ply,SBD,M
Boys,82.1,1,Ricky Mendez,Lubbock Cooper,78.65,181.44,133.81,219.99,535.24,Single-ply,SBD,M
Boys,82.1,2,Sito Torres,Meadow,81.92,219.99,127.01,185.97,532.97,Single-ply,SBD,M
Boys,82.1,3,Christian Silva,Lubbock Roosevelt,79.2,167.83,115.67,172.37,455.86,Single-ply,SBD,M
Boys,82.1,4,Brody Schleeter,Lubbock Cooper,78.47,165.56,99.79,188.24,453.59,Single-ply,SBD,M
Boys,82.1,5,Nathan Besler,Brownfield,81.19,158.76,102.06,192.78,453.59,Single-ply,SBD,M
Boys,82.1,6,Steven Sanchez,Meadow,77.2,156.49,99.79,190.51,446.79,Single-ply,SBD,M
Boys,82.1,7,Aaron Aguirre,Brownfield,80.65,145.15,95.25,149.69,390.09,Single-ply,SBD,M
Boys,82.1,8,Nathan Little,Brownfield,76.29,147.42,79.38,156.49,383.29,Single-ply,SBD,M
Boys,82.1,9,Justyn McCarty,Tahoka,75.84,131.54,77.11,138.35,347,Single-ply,SBD,M
Boys,82.1,10,Stevie Gomez,Brownfield,77.84,102.06,56.7,129.27,288.03,Single-ply,SBD,M
Boys,89.81,1,Xavier Garza,Sundown,88.18,231.33,122.47,231.33,585.13,Single-ply,SBD,M
Boys,89.81,2,Ladd Wilkes,Sundown,84.14,185.97,113.4,195.04,494.42,Single-ply,SBD,M
Boys,89.81,3,Garrett McKinney,Lubbock Cooper,83.01,158.76,127.01,190.51,476.27,Single-ply,SBD,M
Boys,89.81,4,Isaia Montgomery,Lubbock Roosevelt,84.01,167.83,106.59,188.24,462.66,Single-ply,SBD,M
Boys,89.81,5,Josh Acevedo,Wolfforth Frenship,83.19,163.29,102.06,185.97,451.32,Single-ply,SBD,M
Boys,89.81,6,Dilyn Castle,Lubbock Roosevelt,86.36,158.76,97.52,181.44,437.72,Single-ply,SBD,M
Boys,89.81,7,Christian Martha,Sudan,85.91,149.69,95.25,190.51,435.45,Single-ply,SBD,M
Boys,89.81,8,Ethan Moseley,Wolfforth Frenship,84.82,140.61,81.65,161.03,383.29,Single-ply,SBD,M
Boys,99.79,1,Roy Rodriguez,Sundown,94.35,204.12,102.06,206.38,512.56,Single-ply,SBD,M
Boys,99.79,2,Dimitri Gomez,Lubbock Roosevelt,97.7,161.03,138.35,176.9,476.27,Single-ply,SBD,M
Boys,99.79,3,Christian Rodriguez #8,Wolfforth Frenship,95.25,170.1,92.99,197.31,460.4,Single-ply,SBD,M
Boys,99.79,4,Ross Steadman,Sudan,93.26,129.27,92.99,188.24,410.5,Single-ply,SBD,M
Boys,99.79,5,Seth Cruz,Brownfield,97.7,151.95,90.72,167.83,410.5,Single-ply,SBD,M
Boys,99.79,6,Zach Weller,Lubbock Roosevelt,97.98,136.08,97.52,163.29,396.89,Single-ply,SBD,M
Boys,109.77,1,Matthew Cardenas,Wolfforth Frenship,106.14,233.6,145.15,213.19,591.94,Single-ply,SBD,M
Boys,109.77,2,Sebastian Lopez,Lubbock Cooper,103.69,195.04,151.95,226.8,573.79,Single-ply,SBD,M
Boys,109.77,3,Justin Chavez,Sundown,107.95,226.8,133.81,208.65,569.26,Single-ply,SBD,M
Boys,109.77,4,Jackson Stevens,Lubbock Cooper,108.14,208.65,142.88,185.97,537.51,Single-ply,SBD,M
Boys,124.74,5,Roman Alvarado,Brownfield,109.86,204.12,127.01,181.44,512.56,Single-ply,SBD,M
Boys,109.77,6,Dayton Heath,Lubbock Cooper,108.59,142.88,129.27,181.44,453.59,Single-ply,SBD,M
Boys,124.74,1,Jeremiah DeLeon,Tahoka,116.21,272.16,176.9,199.58,648.64,Single-ply,SBD,M
Boys,124.74,2,Marquise Nelson,Wolfforth Frenship,122.47,235.87,117.93,210.92,564.72,Single-ply,SBD,M
Boys,124.74,3,Jet Grant,Sundown,111.22,226.8,129.27,204.12,560.19,Single-ply,SBD,M
Boys,124.74,4,Dayton Smith,Lubbock Cooper,110.4,161.03,104.33,142.88,408.23,Single-ply,SBD,M
Boys,124.74,5,Nick Jiou,Lubbock Cooper,112.49,165.56,61.23,165.56,392.36,Single-ply,SBD,M
Boys,124.74,6,Kevin Shoemaker,Lubbock Roosevelt,121.2,131.54,102.06,131.54,365.14,Single-ply,SBD,M
Boys,124.74,DQ,Jericho Garcia,Brownfield,115.67,136.08,90.72,,,Single-ply,SBD,M
Boys,124.74+,1,Joseph Villarreal,Lubbock Roosevelt,139.07,244.94,136.08,238.14,619.15,Single-ply,SBD,M
Boys,124.74+,2,Vincent Mendoza,Wolfforth Frenship,126.64,272.16,111.13,222.26,605.55,Single-ply,SBD,M
Boys,124.74+,3,Jonathan Aguilar,Lubbock Roosevelt,128.19,226.8,136.08,204.12,566.99,Single-ply,SBD,M
Boys,124.74+,4,Alexander Dimba,Wolfforth Frenship,199.58,192.78,111.13,172.37,476.27,Single-ply,SBD,M
Boys,124.74+,DQ,Tony Garcia,Tahoka,165.2,,,,,Single-ply,SBD,M
Boys,,NS,Roland Zamora,Meadow,,,,,,Single-ply,SBD,M
Boys,,NS,Michael Flores #6,Brownfield,,,,,,Single-ply,SBD,M
Boys,,NS,Matthew Duenes,Lubbock Roosevelt,,,,,,Single-ply,SBD,M
Boys,,NS,Andrew Waters,Lubbock Roosevelt,,,,,,Single-ply,SBD,M
Boys,,NS,Ryan Punchard,Lubbock Cooper,,,,,,Single-ply,SBD,M
Boys,,NS,Isaac Ramirez,Lubbock Roosevelt,,,,,,Single-ply,SBD,M
