Division,WeightClassKg,Place,Name,Team,BodyweightKg,Best3SquatKg,Best3BenchKg,Best3DeadliftKg,TotalKg,Equipment,Event,Sex,BirthDate
Boys,51.71,1,Dustin Bland,Orange Little Cypress-Mauriceville,51.71,102.06,99.79,154.22,356.07,Single-ply,SBD,M,
Boys,55.79,1,Kenson Dubois,Orangefield,54.43,102.06,70.31,104.33,276.69,Single-ply,SBD,M,
Boys,55.79,2,Braxton Rambo,Orange Little Cypress-Mauriceville,53.07,83.91,54.43,97.52,235.87,Single-ply,SBD,M,
Boys,55.79,3,Landon Thompson,Orange Little Cypress-Mauriceville,55.34,65.77,52.16,70.31,188.24,Single-ply,SBD,M,
Boys,59.87,1,Chapa Joseph,West Orange-Stark,59.42,167.83,97.52,185.97,451.32,Single-ply,SBD,M,
Boys,59.87,2,David Daleo,Orange Little Cypress-Mauriceville,59.87,151.95,68.04,161.03,381.02,Single-ply,SBD,M,
Boys,59.87,3,Mark Vickery,Silsbee,58.06,140.61,83.91,154.22,378.75,Single-ply,SBD,M,
Boys,59.87,4,Landen Talley,Silsbee,59.42,120.2,77.11,133.81,331.12,Single-ply,SBD,M,
Boys,59.87,DQ,Seth Williamson,Orangefield,58.97,136.08,,,,Single-ply,SBD,M,
Boys,67.13,1,Hayden Dwyer,Orangefield,64.86,163.29,92.99,165.56,421.84,Single-ply,SBD,M,
Boys,67.13,2,Kevin Luong,Orangefield,60.33,136.08,83.91,190.51,410.5,Single-ply,SBD,M,
Boys,67.13,3,Tahj Amerson,West Orange-Stark,65.32,151.95,92.99,165.56,410.5,Single-ply,SBD,M,
Boys,67.13,4,Colt Longren,Orangefield,66.68,140.61,79.38,161.03,381.02,Single-ply,SBD,M,
Boys,67.13,5,Blaine Leonard,Orangefield,64.41,145.15,88.45,133.81,367.41,Single-ply,SBD,M,
Boys,67.13,6,Layne Reed,Silsbee,65.77,120.2,92.99,151.95,365.14,Single-ply,SBD,M,
Boys,67.13,7,Daegan Vaughn,Orangefield,66.68,117.93,77.11,115.67,310.71,Single-ply,SBD,M,
Boys,67.13,8,Major Copeland,Orangefield,63.96,92.99,74.84,120.2,288.03,Single-ply,SBD,M,
Boys,74.84,1,Kaden Baugh,Orange Little Cypress-Mauriceville,74.39,226.8,106.59,204.12,537.51,Single-ply,SBD,M,
Boys,74.84,2,Gunner Grimes,Orangefield,73.94,188.24,108.86,229.06,526.17,Single-ply,SBD,M,
Boys,74.84,3,Nicholas Sparks,Orangefield,74.39,158.76,102.06,181.44,442.25,Single-ply,SBD,M,
Boys,74.84,4,Demarcus Warren,West Orange-Stark,74.84,156.49,102.06,181.44,439.98,Single-ply,SBD,M,
Boys,74.84,5,Trevor Williams,Silsbee,70.31,147.42,74.84,172.37,394.63,Single-ply,SBD,M,
Boys,74.84,DQ,Leonardo Frias,Orangefield,72.57,,,,,Single-ply,SBD,M,
Boys,82.1,1,Jayden Smart,Silsbee,82.1,188.24,108.86,204.12,501.22,Single-ply,SBD,M,
Boys,82.1,2,Pablo Lorenzi,Silsbee,77.11,163.29,115.67,176.9,455.86,Single-ply,SBD,M,
Boys,82.1,3,Cameron Scales,Orangefield,80.74,149.69,106.59,176.9,433.18,Single-ply,SBD,M,
Boys,82.1,DQ,Jacob Unangst,Orangefield,81.19,,,,,Single-ply,SBD,M,
Boys,89.81,1,Akilles Garcia,Orangefield,88,249.48,149.69,240.4,639.57,Single-ply,SBD,M,
Boys,89.81,2,Josh Miller,West Orange-Stark,89.81,176.9,117.93,185.97,480.81,Single-ply,SBD,M,
Boys,89.81,3,Ethan Blackburn,Orangefield,86.18,165.56,120.2,188.24,474,Single-ply,SBD,M,
Boys,89.81,4,Andrew Leblanc,Silsbee,88.9,151.95,88.45,151.95,392.36,Single-ply,SBD,M,
Boys,89.81,DQ,Eddie Winters,Orange Little Cypress-Mauriceville,84.37,151.95,,,,Single-ply,SBD,M,
Boys,99.79,1,Antonio Bolton,Silsbee,96.16,229.06,145.15,226.8,601.01,Single-ply,SBD,M,
Boys,99.79,2,Cutler Hubbard,Orangefield,97.98,254.01,131.54,208.65,594.21,Single-ply,SBD,M,
Boys,99.79,3,Jan Nazario,Orange Little Cypress-Mauriceville,95.71,204.12,106.59,197.31,508.02,Single-ply,SBD,M,
Boys,99.79,4,Ashton Childress,West Orange-Stark,99.79,179.17,108.86,188.24,476.27,Single-ply,SBD,M,
Boys,99.79,5,Jeyovannie Golden,Silsbee,97.98,167.83,99.79,181.44,449.06,Single-ply,SBD,M,
Boys,99.79,6,Kade Bryant,Orangefield,99.79,163.29,113.4,163.29,439.98,Single-ply,SBD,M,
Boys,99.79,DQ,Ransom Gibson,Orangefield,99.34,,,,,Single-ply,SBD,M,
Boys,99.79,DQ,Owen Dolbear,Orange Little Cypress-Mauriceville,99.79,156.49,,,,Single-ply,SBD,M,
Boys,99.79,DQ,Josh Sterling,West Orange-Stark,97.07,,102.06,179.17,,Single-ply,SBD,M,
Boys,109.77,1,Hunter Ashworth,Orangefield,104.33,254.01,142.88,240.4,637.3,Single-ply,SBD,M,
Boys,109.77,2,Ethan Meads,Orangefield,107.95,226.8,147.42,215.46,589.67,Single-ply,SBD,M,
Boys,109.77,3,Amier Washington,Orange Little Cypress-Mauriceville,109.32,217.72,142.88,201.85,562.45,Single-ply,SBD,M,
Boys,109.77,4,Andrew Wilson,West Orange-Stark,109.77,217.72,122.47,190.51,530.7,Single-ply,SBD,M,
Boys,109.77,5,Jeterious Brown,West Orange-Stark,104.33,165.56,124.74,183.7,474,Single-ply,SBD,M,
Boys,109.77,6,Judah Huerta,West Orange-Stark,109.77,170.1,108.86,192.78,471.74,Single-ply,SBD,M,
Boys,109.77,7,Devin Dunmon,Orange Little Cypress-Mauriceville,101.6,142.88,83.91,147.42,374.21,Single-ply,SBD,M,
Boys,124.74,1,Coby Coulter,Orangefield,122.47,281.23,183.7,240.4,705.34,Single-ply,SBD,M,
Boys,124.74,2,Carson Phelps,Orange Little Cypress-Mauriceville,117.93,188.24,120.2,188.24,496.68,Single-ply,SBD,M,
Boys,124.74,3,JaKalen Jenkins,West Orange-Stark,124.74,156.49,108.86,167.83,433.18,Single-ply,SBD,M,
Boys,124.74,4,Brenner Portie,Orange Little Cypress-Mauriceville,113.4,142.88,92.99,167.83,403.7,Single-ply,SBD,M,
Boys,124.74,5,Elijah Miller,Silsbee,116.57,138.35,79.38,140.61,358.34,Single-ply,SBD,M,
Boys,124.74,DQ,Dylan Whitman,Orangefield,110.22,226.8,117.93,,,Single-ply,SBD,M,
Boys,139.71,1,Dominick Sposato,Silsbee,131.09,226.8,154.22,215.46,596.47,Single-ply,SBD,M,
Boys,139.71,2,Jose Molina #6,Orange Little Cypress-Mauriceville,137.44,215.46,111.13,176.9,503.49,Single-ply,SBD,M,
Boys,139.71,3,Octavious Tyler,Silsbee,130.63,145.15,65.77,113.4,324.32,Single-ply,SBD,M,
Boys,139.71+,1,Corben McKinney,Silsbee,140.16,219.99,113.4,197.31,530.7,Single-ply,SBD,M,
