Division,WeightClassKg,Place,Name,Team,BodyweightKg,Best3SquatKg,Best3BenchKg,Best3DeadliftKg,TotalKg,Equipment,Event,Sex
Boys,51.71,1,Eli DeHoyos,Brady,50.17,145.15,81.65,156.49,383.29,Single-ply,SBD,M
Boys,51.71,2,Preston Fox,Lampasas,51.44,136.08,95.25,149.69,381.02,Single-ply,SBD,M
Boys,51.71,3,Kade Pace,Lago Vista,51.44,129.27,68.04,131.54,328.85,Single-ply,SBD,M
Boys,51.71,4,Luke Keller,Llano,48.99,90.72,58.97,113.4,263.08,Single-ply,SBD,M
Boys,51.71,5,Mark Valdez,Brady,44.72,90.72,52.16,117.93,260.82,Single-ply,SBD,M
Boys,51.71,6,Cody McBee,Brady,45.36,72.57,38.56,86.18,197.31,Single-ply,SBD,M
Boys,55.79,1,Xavier Nava,Brownwood,54.61,156.49,83.91,147.42,387.82,Single-ply,SBD,M
Boys,55.79,2,Marshall Schmitz,Brady,55.43,142.88,79.38,154.22,376.48,Single-ply,SBD,M
Boys,55.79,3,Kyle Arriola,Lampasas,55.52,133.81,88.45,147.42,369.68,Single-ply,SBD,M
Boys,55.79,4,Hunter McCoy,Burnet,54.88,115.67,58.97,131.54,306.17,Single-ply,SBD,M
Boys,55.79,5,Luis Ortiz,Brownwood,54.07,115.67,58.97,104.33,278.96,Single-ply,SBD,M
Boys,55.79,6,Kyler Pitre,Brady,53.34,95.25,56.7,117.93,269.89,Single-ply,SBD,M
Boys,55.79,DQ,Zach Warden,Burnet,55.61,117.93,,,,Single-ply,SBD,M
Boys,59.87,1,Marcus Escamilla,Burnet,59.87,127.01,92.99,158.76,378.75,Single-ply,SBD,M
Boys,59.87,2,Devon Bandow,Lago Vista,58.6,136.08,86.18,145.15,367.41,Single-ply,SBD,M
Boys,59.87,3,Patrick Almond,Comal Canyon Lake,59.69,104.33,58.97,115.67,278.96,Single-ply,SBD,M
Boys,67.13,1,Ryan Jackson,Burnet,64.23,183.7,111.13,172.37,467.2,Single-ply,SBD,M
Boys,67.13,2,Koby Allen,Lampasas,67.04,158.76,97.52,170.1,426.38,Single-ply,SBD,M
Boys,67.13,3,Quint Pincelli,Llano,65.32,149.69,97.52,176.9,424.11,Single-ply,SBD,M
Boys,67.13,4,Anthony Larrea,Brownwood,66.5,158.76,97.52,165.56,421.84,Single-ply,SBD,M
Boys,67.13,5,Sergio Flores,Comfort,66.68,147.42,88.45,183.7,419.57,Single-ply,SBD,M
Boys,67.13,6,Kelton Bernard,Brady,62.51,154.22,92.99,165.56,412.77,Single-ply,SBD,M
Boys,67.13,7,Drake Martinez,Junction,61.42,151.95,99.79,147.42,399.16,Single-ply,SBD,M
Boys,67.13,8,Noel Outlaw,Brownwood,66.68,142.88,97.52,158.76,399.16,Single-ply,SBD,M
Boys,67.13,9,Gerardo Murillo,Burnet,66.59,154.22,92.99,149.69,396.89,Single-ply,SBD,M
Boys,67.13,10,Caleb Almond,Comal Canyon Lake,67.04,142.88,102.06,149.69,394.63,Single-ply,SBD,M
Boys,67.13,11,Jett Huffman,Marble Falls,65.5,142.88,81.65,142.88,367.41,Single-ply,SBD,M
Boys,67.13,12,Garrett Dixon,Llano,65.14,113.4,74.84,124.74,312.98,Single-ply,SBD,M
Boys,67.13,13,Derek Wiatrek,Comal Canyon Lake,67.04,102.06,74.84,127.01,303.91,Single-ply,SBD,M
Boys,67.13,14,Slade Robeson,Comfort,60.6,102.06,61.23,131.54,294.84,Single-ply,SBD,M
Boys,74.84,1,Sean Williams,Lampasas,70.76,226.8,145.15,240.4,612.35,Single-ply,SBD,M
Boys,74.84,2,Landry Bolin,Liberty Hill,74.57,174.63,113.4,210.92,498.95,Single-ply,SBD,M
Boys,74.84,3,Eloy Castillo,Brownwood,72.94,163.29,120.2,204.12,487.61,Single-ply,SBD,M
Boys,74.84,4,Michael Cornish,Lampasas,72.03,185.97,102.06,197.31,485.34,Single-ply,SBD,M
Boys,74.84,5,Moe Bryson,Lago Vista,73.66,181.44,90.72,188.24,460.4,Single-ply,SBD,M
Boys,74.84,6,Hayden McAffee,Brownwood,73.39,172.37,92.99,170.1,435.45,Single-ply,SBD,M
Boys,74.84,7,Dylan Stroh,Burnet,69.4,170.1,90.72,163.29,424.11,Single-ply,SBD,M
Boys,74.84,8,Jaxson Denton,Burnet,70.49,158.76,102.06,161.03,421.84,Single-ply,SBD,M
Boys,74.84,9,Nicholas Miller,Liberty Hill,71.76,158.76,79.38,165.56,403.7,Single-ply,SBD,M
Boys,74.84,10,Gavin Aniceto,Marble Falls,69.22,142.88,83.91,142.88,369.68,Single-ply,SBD,M
Boys,74.84,11,Zachary Aiken,Liberty Hill,73.48,142.88,72.57,151.95,367.41,Single-ply,SBD,M
Boys,74.84,12,Jake Self,Llano,70.94,122.47,95.25,142.88,360.61,Single-ply,SBD,M
Boys,74.84,13,Jacob Honea,Lago Vista,68.04,113.4,70.31,106.59,290.3,Single-ply,SBD,M
Boys,74.84,DQ,Derek Cook,Burnet,72.39,102.06,,,,Single-ply,SBD,M
Boys,74.84,DQ,Kade Schrader,Burnet,72.67,142.88,,,,Single-ply,SBD,M
Boys,82.1,1,Luis Coronado,Llano,80.38,233.6,120.2,192.78,546.58,Single-ply,SBD,M
Boys,82.1,2,Nolan Keller,Llano,80.74,199.58,120.2,199.58,519.36,Single-ply,SBD,M
Boys,82.1,3,Daunte Cuffie,Lampasas,79.74,183.7,127.01,195.04,505.76,Single-ply,SBD,M
Boys,82.1,4,Logan Duggar,Llano,79.11,192.78,104.33,195.04,492.15,Single-ply,SBD,M
Boys,82.1,5,John Esparza,Lampasas,80.2,172.37,122.47,197.31,492.15,Single-ply,SBD,M
Boys,82.1,6,Mason Baker,Llano,80.56,174.63,102.06,185.97,462.66,Single-ply,SBD,M
Boys,82.1,7,Jacob Ruff,Comal Canyon Lake,77.38,161.03,99.79,183.7,444.52,Single-ply,SBD,M
Boys,82.1,8,Grishma Pun,Burnet,78.02,163.29,97.52,170.1,430.91,Single-ply,SBD,M
Boys,82.1,9,Blake Estes,Burnet,82.05,163.29,111.13,151.95,426.38,Single-ply,SBD,M
Boys,82.1,10,Javier Saucedo,Comal Canyon Lake,78.38,142.88,83.91,170.1,396.89,Single-ply,SBD,M
Boys,82.1,11,Damian Cunningham,Marble Falls,81.28,142.88,97.52,156.49,396.89,Single-ply,SBD,M
Boys,82.1,12,Alex Hardin,Comal Canyon Lake,76.29,142.88,92.99,142.88,378.75,Single-ply,SBD,M
Boys,82.1,13,Jacob Wright,Lago Vista,78.2,133.81,90.72,149.69,374.21,Single-ply,SBD,M
Boys,82.1,14,Braden Howell,Burnet,78.93,138.35,86.18,138.35,362.87,Single-ply,SBD,M
Boys,82.1,15,Adrian Canchola,Marble Falls,75.93,131.54,77.11,136.08,344.73,Single-ply,SBD,M
Boys,89.81,1,Michael Nguyen,Lampasas,85.82,226.8,149.69,240.4,616.89,Single-ply,SBD,M
Boys,89.81,2,Lakota Lawrence,Liberty Hill,86.73,183.7,129.27,199.58,512.56,Single-ply,SBD,M
Boys,89.81,3,Cristian Keizer,Liberty Hill,85.18,192.78,111.13,176.9,480.81,Single-ply,SBD,M
Boys,89.81,4,Reece Van Hoose,Marble Falls,83.73,147.42,92.99,172.37,412.77,Single-ply,SBD,M
Boys,89.81,5,Joshua Conn,Brownwood,89.72,142.88,92.99,165.56,401.43,Single-ply,SBD,M
Boys,89.81,6,Tyler Vaughn,Brady,82.83,142.88,92.99,158.76,394.63,Single-ply,SBD,M
Boys,89.81,7,Jace Maynard,Burnet,86.64,138.35,106.59,147.42,392.36,Single-ply,SBD,M
Boys,89.81,8,Josh Moreno,Brady,82.83,106.59,68.04,140.61,315.25,Single-ply,SBD,M
Boys,89.81,DQ,Rodney Dotson,Burnet,88,,,,,Single-ply,SBD,M
Boys,99.79,1,Matthew Carter,Liberty Hill,93.08,249.48,147.42,240.4,637.3,Single-ply,SBD,M
Boys,99.79,2,Glenn Thomas,Marble Falls,91.9,201.85,111.13,192.78,505.76,Single-ply,SBD,M
Boys,99.79,3,Braden Hodge,Comal Canyon Lake,92.99,136.08,113.4,154.22,403.7,Single-ply,SBD,M
Boys,99.79,4,Garreth Corley,Marble Falls,90.17,142.88,92.99,161.03,396.89,Single-ply,SBD,M
Boys,99.79,5,Genaro Arreguin,Marble Falls,95.8,147.42,86.18,151.95,385.55,Single-ply,SBD,M
Boys,99.79,6,Zack Menkin,Lago Vista,90.54,229.06,124.74,,353.8,Single-ply,SB,M
Boys,99.79,7,Jose Vasquez,Marble Falls,92.99,129.27,68.04,136.08,333.39,Single-ply,SBD,M
Boys,99.79,8,Tucker Stephenson,Liberty Hill,93.44,142.88,61.23,124.74,328.85,Single-ply,SBD,M
Boys,99.79,9,Mathew Kloepper,Llano,94.44,117.93,70.31,122.47,310.71,Single-ply,SBD,M
Boys,109.77,1,Roger Craig,Burnet,109.63,249.48,176.9,256.28,682.66,Single-ply,SBD,M
Boys,109.77,2,Ray Dixon,Llano,107.86,210.92,156.49,240.4,607.81,Single-ply,SBD,M
Boys,109.77,3,Rudy Esparza,Lampasas,106.14,213.19,133.81,238.14,585.13,Single-ply,SBD,M
Boys,109.77,4,Jeremy Rodgers,Lampasas,105.69,204.12,124.74,235.87,564.72,Single-ply,SBD,M
Boys,109.77,5,Brady Herbst,Junction,102.69,204.12,149.69,188.24,542.04,Single-ply,SBD,M
Boys,109.77,6,Josh Almond,Comal Canyon Lake,103.87,188.24,136.08,213.19,537.51,Single-ply,SBD,M
Boys,109.77,7,Genaro Hernandez,Comfort,107.5,181.44,120.2,181.44,483.08,Single-ply,SBD,M
Boys,109.77,8,Christian Molina,Brady,106.59,188.24,120.2,172.37,480.81,Single-ply,SBD,M
Boys,109.77,9,Isiah Mason,Liberty Hill,104.78,158.76,129.27,190.51,478.54,Single-ply,SBD,M
Boys,109.77,10,Drake Truitt,Liberty Hill,100.79,195.04,92.99,163.29,451.32,Single-ply,SBD,M
Boys,109.77,11,Jonathan Nandin,Burnet,105.32,174.63,90.72,172.37,437.72,Single-ply,SBD,M
Boys,109.77,12,Trey Ford,Burnet,105.87,161.03,106.59,170.1,437.72,Single-ply,SBD,M
Boys,109.77,13,Jamie Herrera,Burnet,102.97,163.29,99.79,158.76,421.84,Single-ply,SBD,M
Boys,109.77,14,Nate Richards,Marble Falls,108.86,154.22,95.25,154.22,403.7,Single-ply,SBD,M
Boys,109.77,15,Brandon Farrow #2,Brownwood,101.06,158.76,102.06,136.08,396.89,Single-ply,SBD,M
Boys,109.77,DQ,Tyler Patterson,Burnet,102.51,,,,,Single-ply,SBD,M
Boys,124.74,1,Dakoda Trull,Llano,117.3,340.19,190.51,272.16,802.86,Single-ply,SBD,M
Boys,124.74,2,Justin Montgomery,Liberty Hill,114.4,272.16,151.95,240.4,664.51,Single-ply,SBD,M
Boys,124.74,3,Brandon Webb,Lago Vista,117.93,290.3,142.88,231.33,664.51,Single-ply,SBD,M
Boys,124.74,4,Zac Hudgins,Burnet,113.4,235.87,145.15,226.8,607.81,Single-ply,SBD,M
Boys,124.74,5,Theo Bryant,Brownwood,121.2,249.48,113.4,204.12,566.99,Single-ply,SBD,M
Boys,124.74,6,Luke Williams,Llano,114.31,215.46,136.08,197.31,548.85,Single-ply,SBD,M
Boys,124.74,7,Griffin Beard,Lago Vista,118.39,226.8,97.52,199.58,523.9,Single-ply,SBD,M
Boys,124.74,8,Hayden Henry,Burnet,113.85,206.38,102.06,190.51,498.95,Single-ply,SBD,M
Boys,124.74,9,Heath Godfrey,Llano,118.39,183.7,104.33,195.04,483.08,Single-ply,SBD,M
Boys,124.74,10,Jacob Ruiz,Brownwood,114.58,172.37,113.4,172.37,458.13,Single-ply,SBD,M
Boys,124.74,DQ,Ernesto Castaneda,Marble Falls,117.21,201.85,,,,Single-ply,SBD,M
Boys,124.74+,1,Tony Melendez,Comfort,158.39,199.58,136.08,217.72,553.38,Single-ply,SBD,M
Boys,124.74+,2,Brody Adams,Junction,137.98,217.72,113.4,217.72,548.85,Single-ply,SBD,M
Boys,124.74+,3,Tyler Johnson,Lampasas,142.7,213.19,106.59,201.85,521.63,Single-ply,SBD,M
Boys,124.74+,4,Seth Carpenter,Burnet,128.91,188.24,136.08,195.04,519.36,Single-ply,SBD,M
Boys,124.74+,DQ,Jayln Jones,Brownwood,129.27,192.78,,,,Single-ply,SBD,M
Boys,124.74+,DQ,Jared Tippie,Burnet,133.36,238.14,,,,Single-ply,SBD,M
