{
  "contractName": "ERC20Detailed",
  "abi": [
    {
      "constant": false,
      "inputs": [
        {
          "name": "spender",
          "type": "address"
        },
        {
          "name": "amount",
          "type": "uint256"
        }
      ],
      "name": "approve",
      "outputs": [
        {
          "name": "",
          "type": "bool"
        }
      ],
      "payable": false,
      "stateMutability": "nonpayable",
      "type": "function"
    },
    {
      "constant": true,
      "inputs": [],
      "name": "totalSupply",
      "outputs": [
        {
          "name": "",
          "type": "uint256"
        }
      ],
      "payable": false,
      "stateMutability": "view",
      "type": "function"
    },
    {
      "constant": false,
      "inputs": [
        {
          "name": "sender",
          "type": "address"
        },
        {
          "name": "recipient",
          "type": "address"
        },
        {
          "name": "amount",
          "type": "uint256"
        }
      ],
      "name": "transferFrom",
      "outputs": [
        {
          "name": "",
          "type": "bool"
        }
      ],
      "payable": false,
      "stateMutability": "nonpayable",
      "type": "function"
    },
    {
      "constant": true,
      "inputs": [
        {
          "name": "account",
          "type": "address"
        }
      ],
      "name": "balanceOf",
      "outputs": [
        {
          "name": "",
          "type": "uint256"
        }
      ],
      "payable": false,
      "stateMutability": "view",
      "type": "function"
    },
    {
      "constant": false,
      "inputs": [
        {
          "name": "recipient",
          "type": "address"
        },
        {
          "name": "amount",
          "type": "uint256"
        }
      ],
      "name": "transfer",
      "outputs": [
        {
          "name": "",
          "type": "bool"
        }
      ],
      "payable": false,
      "stateMutability": "nonpayable",
      "type": "function"
    },
    {
      "constant": true,
      "inputs": [
        {
          "name": "owner",
          "type": "address"
        },
        {
          "name": "spender",
          "type": "address"
        }
      ],
      "name": "allowance",
      "outputs": [
        {
          "name": "",
          "type": "uint256"
        }
      ],
      "payable": false,
      "stateMutability": "view",
      "type": "function"
    },
    {
      "inputs": [
        {
          "name": "name",
          "type": "string"
        },
        {
          "name": "symbol",
          "type": "string"
        },
        {
          "name": "decimals",
          "type": "uint8"
        }
      ],
      "payable": false,
      "stateMutability": "nonpayable",
      "type": "constructor"
    },
    {
      "anonymous": false,
      "inputs": [
        {
          "indexed": true,
          "name": "from",
          "type": "address"
        },
        {
          "indexed": true,
          "name": "to",
          "type": "address"
        },
        {
          "indexed": false,
          "name": "value",
          "type": "uint256"
        }
      ],
      "name": "Transfer",
      "type": "event"
    },
    {
      "anonymous": false,
      "inputs": [
        {
          "indexed": true,
          "name": "owner",
          "type": "address"
        },
        {
          "indexed": true,
          "name": "spender",
          "type": "address"
        },
        {
          "indexed": false,
          "name": "value",
          "type": "uint256"
        }
      ],
      "name": "Approval",
      "type": "event"
    },
    {
      "constant": true,
      "inputs": [],
      "name": "name",
      "outputs": [
        {
          "name": "",
          "type": "string"
        }
      ],
      "payable": false,
      "stateMutability": "view",
      "type": "function"
    },
    {
      "constant": true,
      "inputs": [],
      "name": "symbol",
      "outputs": [
        {
          "name": "",
          "type": "string"
        }
      ],
      "payable": false,
      "stateMutability": "view",
      "type": "function"
    },
    {
      "constant": true,
      "inputs": [],
      "name": "decimals",
      "outputs": [
        {
          "name": "",
          "type": "uint8"
        }
      ],
      "payable": false,
      "stateMutability": "view",
      "type": "function"
    }
  ],
  "metadata": "{\"compiler\":{\"version\":\"0.5.8+commit.23d335f2\"},\"language\":\"Solidity\",\"output\":{\"abi\":[{\"constant\":true,\"inputs\":[],\"name\":\"name\",\"outputs\":[{\"name\":\"\",\"type\":\"string\"}],\"payable\":false,\"stateMutability\":\"view\",\"type\":\"function\"},{\"constant\":false,\"inputs\":[{\"name\":\"spender\",\"type\":\"address\"},{\"name\":\"amount\",\"type\":\"uint256\"}],\"name\":\"approve\",\"outputs\":[{\"name\":\"\",\"type\":\"bool\"}],\"payable\":false,\"stateMutability\":\"nonpayable\",\"type\":\"function\"},{\"constant\":true,\"inputs\":[],\"name\":\"totalSupply\",\"outputs\":[{\"name\":\"\",\"type\":\"uint256\"}],\"payable\":false,\"stateMutability\":\"view\",\"type\":\"function\"},{\"constant\":false,\"inputs\":[{\"name\":\"sender\",\"type\":\"address\"},{\"name\":\"recipient\",\"type\":\"address\"},{\"name\":\"amount\",\"type\":\"uint256\"}],\"name\":\"transferFrom\",\"outputs\":[{\"name\":\"\",\"type\":\"bool\"}],\"payable\":false,\"stateMutability\":\"nonpayable\",\"type\":\"function\"},{\"constant\":true,\"inputs\":[],\"name\":\"decimals\",\"outputs\":[{\"name\":\"\",\"type\":\"uint8\"}],\"payable\":false,\"stateMutability\":\"view\",\"type\":\"function\"},{\"constant\":true,\"inputs\":[{\"name\":\"account\",\"type\":\"address\"}],\"name\":\"balanceOf\",\"outputs\":[{\"name\":\"\",\"type\":\"uint256\"}],\"payable\":false,\"stateMutability\":\"view\",\"type\":\"function\"},{\"constant\":true,\"inputs\":[],\"name\":\"symbol\",\"outputs\":[{\"name\":\"\",\"type\":\"string\"}],\"payable\":false,\"stateMutability\":\"view\",\"type\":\"function\"},{\"constant\":false,\"inputs\":[{\"name\":\"recipient\",\"type\":\"address\"},{\"name\":\"amount\",\"type\":\"uint256\"}],\"name\":\"transfer\",\"outputs\":[{\"name\":\"\",\"type\":\"bool\"}],\"payable\":false,\"stateMutability\":\"nonpayable\",\"type\":\"function\"},{\"constant\":true,\"inputs\":[{\"name\":\"owner\",\"type\":\"address\"},{\"name\":\"spender\",\"type\":\"address\"}],\"name\":\"allowance\",\"outputs\":[{\"name\":\"\",\"type\":\"uint256\"}],\"payable\":false,\"stateMutability\":\"view\",\"type\":\"function\"},{\"inputs\":[{\"name\":\"name\",\"type\":\"string\"},{\"name\":\"symbol\",\"type\":\"string\"},{\"name\":\"decimals\",\"type\":\"uint8\"}],\"payable\":false,\"stateMutability\":\"nonpayable\",\"type\":\"constructor\"},{\"anonymous\":false,\"inputs\":[{\"indexed\":true,\"name\":\"from\",\"type\":\"address\"},{\"indexed\":true,\"name\":\"to\",\"type\":\"address\"},{\"indexed\":false,\"name\":\"value\",\"type\":\"uint256\"}],\"name\":\"Transfer\",\"type\":\"event\"},{\"anonymous\":false,\"inputs\":[{\"indexed\":true,\"name\":\"owner\",\"type\":\"address\"},{\"indexed\":true,\"name\":\"spender\",\"type\":\"address\"},{\"indexed\":false,\"name\":\"value\",\"type\":\"uint256\"}],\"name\":\"Approval\",\"type\":\"event\"}],\"devdoc\":{\"details\":\"Optional functions from the ERC20 standard.\",\"methods\":{\"allowance(address,address)\":{\"details\":\"Returns the remaining number of tokens that `spender` will be allowed to spend on behalf of `owner` through `transferFrom`. This is zero by default.     * This value changes when `approve` or `transferFrom` are called.\"},\"approve(address,uint256)\":{\"details\":\"Sets `amount` as the allowance of `spender` over the caller's tokens.     * Returns a boolean value indicating whether the operation succeeded.     * > Beware that changing an allowance with this method brings the risk that someone may use both the old and the new allowance by unfortunate transaction ordering. One possible solution to mitigate this race condition is to first reduce the spender's allowance to 0 and set the desired value afterwards: https://github.com/ethereum/EIPs/issues/20#issuecomment-263524729     * Emits an `Approval` event.\"},\"balanceOf(address)\":{\"details\":\"Returns the amount of tokens owned by `account`.\"},\"constructor\":{\"details\":\"Sets the values for `name`, `symbol`, and `decimals`. All three of these values are immutable: they can only be set once during construction.\"},\"decimals()\":{\"details\":\"Returns the number of decimals used to get its user representation. For example, if `decimals` equals `2`, a balance of `505` tokens should be displayed to a user as `5,05` (`505 / 10 ** 2`).     * Tokens usually opt for a value of 18, imitating the relationship between Ether and Wei.     * > Note that this information is only used for _display_ purposes: it in no way affects any of the arithmetic of the contract, including `IERC20.balanceOf` and `IERC20.transfer`.\"},\"name()\":{\"details\":\"Returns the name of the token.\"},\"symbol()\":{\"details\":\"Returns the symbol of the token, usually a shorter version of the name.\"},\"totalSupply()\":{\"details\":\"Returns the amount of tokens in existence.\"},\"transfer(address,uint256)\":{\"details\":\"Moves `amount` tokens from the caller's account to `recipient`.     * Returns a boolean value indicating whether the operation succeeded.     * Emits a `Transfer` event.\"},\"transferFrom(address,address,uint256)\":{\"details\":\"Moves `amount` tokens from `sender` to `recipient` using the allowance mechanism. `amount` is then deducted from the caller's allowance.     * Returns a boolean value indicating whether the operation succeeded.     * Emits a `Transfer` event.\"}}},\"userdoc\":{\"methods\":{}}},\"settings\":{\"compilationTarget\":{\"/C/Users/robin/code/rebalance/packages/contracts/node_modules/@openzeppelin/contracts/token/ERC20/ERC20Detailed.sol\":\"ERC20Detailed\"},\"evmVersion\":\"petersburg\",\"libraries\":{},\"optimizer\":{\"enabled\":false,\"runs\":200},\"remappings\":[]},\"sources\":{\"/C/Users/robin/code/rebalance/packages/contracts/node_modules/@openzeppelin/contracts/token/ERC20/ERC20Detailed.sol\":{\"keccak256\":\"0xc61b3603089b09a730d8ca72e9133a496cc4405da40e9b87c12f073245d774bf\",\"urls\":[\"bzzr://f280f38d5ab6e1b89fd898ccd3901054a56572c141d91d30302e2db1db4cc6ff\"]},\"/C/Users/robin/code/rebalance/packages/contracts/node_modules/@openzeppelin/contracts/token/ERC20/IERC20.sol\":{\"keccak256\":\"0x90e8c2521653bbb1768b05889c5760031e688d9cd361f167489b89215e201b95\",\"urls\":[\"bzzr://aa8b45b57edafc3d67bc5d916327ea16807fae33f753ca163ae0c4061b789766\"]}},\"version\":1}",
  "bytecode": "0x",
  "deployedBytecode": "0x",
  "sourceMap": "",
  "deployedSourceMap": "",
  "source": "pragma solidity ^0.5.0;\n\nimport \"./IERC20.sol\";\n\n/**\n * @dev Optional functions from the ERC20 standard.\n */\ncontract ERC20Detailed is IERC20 {\n    string private _name;\n    string private _symbol;\n    uint8 private _decimals;\n\n    /**\n     * @dev Sets the values for `name`, `symbol`, and `decimals`. All three of\n     * these values are immutable: they can only be set once during\n     * construction.\n     */\n    constructor (string memory name, string memory symbol, uint8 decimals) public {\n        _name = name;\n        _symbol = symbol;\n        _decimals = decimals;\n    }\n\n    /**\n     * @dev Returns the name of the token.\n     */\n    function name() public view returns (string memory) {\n        return _name;\n    }\n\n    /**\n     * @dev Returns the symbol of the token, usually a shorter version of the\n     * name.\n     */\n    function symbol() public view returns (string memory) {\n        return _symbol;\n    }\n\n    /**\n     * @dev Returns the number of decimals used to get its user representation.\n     * For example, if `decimals` equals `2`, a balance of `505` tokens should\n     * be displayed to a user as `5,05` (`505 / 10 ** 2`).\n     *\n     * Tokens usually opt for a value of 18, imitating the relationship between\n     * Ether and Wei.\n     *\n     * > Note that this information is only used for _display_ purposes: it in\n     * no way affects any of the arithmetic of the contract, including\n     * `IERC20.balanceOf` and `IERC20.transfer`.\n     */\n    function decimals() public view returns (uint8) {\n        return _decimals;\n    }\n}\n",
  "sourcePath": "C:\\Users\\robin\\code\\rebalance\\packages\\contracts\\node_modules\\@openzeppelin\\contracts\\token\\ERC20\\ERC20Detailed.sol",
  "ast": {
    "absolutePath": "/C/Users/robin/code/rebalance/packages/contracts/node_modules/@openzeppelin/contracts/token/ERC20/ERC20Detailed.sol",
    "exportedSymbols": {
      "ERC20Detailed": [
        1510
      ]
    },
    "id": 1511,
    "nodeType": "SourceUnit",
    "nodes": [
      {
        "id": 1454,
        "literals": [
          "solidity",
          "^",
          "0.5",
          ".0"
        ],
        "nodeType": "PragmaDirective",
        "src": "0:23:5"
      },
      {
        "absolutePath": "/C/Users/robin/code/rebalance/packages/contracts/node_modules/@openzeppelin/contracts/token/ERC20/IERC20.sol",
        "file": "./IERC20.sol",
        "id": 1455,
        "nodeType": "ImportDirective",
        "scope": 1511,
        "sourceUnit": 1580,
        "src": "25:22:5",
        "symbolAliases": [],
        "unitAlias": ""
      },
      {
        "baseContracts": [
          {
            "arguments": null,
            "baseName": {
              "contractScope": null,
              "id": 1456,
              "name": "IERC20",
              "nodeType": "UserDefinedTypeName",
              "referencedDeclaration": 1579,
              "src": "135:6:5",
              "typeDescriptions": {
                "typeIdentifier": "t_contract$_IERC20_$1579",
                "typeString": "contract IERC20"
              }
            },
            "id": 1457,
            "nodeType": "InheritanceSpecifier",
            "src": "135:6:5"
          }
        ],
        "contractDependencies": [
          1579
        ],
        "contractKind": "contract",
        "documentation": "@dev Optional functions from the ERC20 standard.",
        "fullyImplemented": false,
        "id": 1510,
        "linearizedBaseContracts": [
          1510,
          1579
        ],
        "name": "ERC20Detailed",
        "nodeType": "ContractDefinition",
        "nodes": [
          {
            "constant": false,
            "id": 1459,
            "name": "_name",
            "nodeType": "VariableDeclaration",
            "scope": 1510,
            "src": "148:20:5",
            "stateVariable": true,
            "storageLocation": "default",
            "typeDescriptions": {
              "typeIdentifier": "t_string_storage",
              "typeString": "string"
            },
            "typeName": {
              "id": 1458,
              "name": "string",
              "nodeType": "ElementaryTypeName",
              "src": "148:6:5",
              "typeDescriptions": {
                "typeIdentifier": "t_string_storage_ptr",
                "typeString": "string"
              }
            },
            "value": null,
            "visibility": "private"
          },
          {
            "constant": false,
            "id": 1461,
            "name": "_symbol",
            "nodeType": "VariableDeclaration",
            "scope": 1510,
            "src": "174:22:5",
            "stateVariable": true,
            "storageLocation": "default",
            "typeDescriptions": {
              "typeIdentifier": "t_string_storage",
              "typeString": "string"
            },
            "typeName": {
              "id": 1460,
              "name": "string",
              "nodeType": "ElementaryTypeName",
              "src": "174:6:5",
              "typeDescriptions": {
                "typeIdentifier": "t_string_storage_ptr",
                "typeString": "string"
              }
            },
            "value": null,
            "visibility": "private"
          },
          {
            "constant": false,
            "id": 1463,
            "name": "_decimals",
            "nodeType": "VariableDeclaration",
            "scope": 1510,
            "src": "202:23:5",
            "stateVariable": true,
            "storageLocation": "default",
            "typeDescriptions": {
              "typeIdentifier": "t_uint8",
              "typeString": "uint8"
            },
            "typeName": {
              "id": 1462,
              "name": "uint8",
              "nodeType": "ElementaryTypeName",
              "src": "202:5:5",
              "typeDescriptions": {
                "typeIdentifier": "t_uint8",
                "typeString": "uint8"
              }
            },
            "value": null,
            "visibility": "private"
          },
          {
            "body": {
              "id": 1484,
              "nodeType": "Block",
              "src": "494:85:5",
              "statements": [
                {
                  "expression": {
                    "argumentTypes": null,
                    "id": 1474,
                    "isConstant": false,
                    "isLValue": false,
                    "isPure": false,
                    "lValueRequested": false,
                    "leftHandSide": {
                      "argumentTypes": null,
                      "id": 1472,
                      "name": "_name",
                      "nodeType": "Identifier",
                      "overloadedDeclarations": [],
                      "referencedDeclaration": 1459,
                      "src": "504:5:5",
                      "typeDescriptions": {
                        "typeIdentifier": "t_string_storage",
                        "typeString": "string storage ref"
                      }
                    },
                    "nodeType": "Assignment",
                    "operator": "=",
                    "rightHandSide": {
                      "argumentTypes": null,
                      "id": 1473,
                      "name": "name",
                      "nodeType": "Identifier",
                      "overloadedDeclarations": [],
                      "referencedDeclaration": 1465,
                      "src": "512:4:5",
                      "typeDescriptions": {
                        "typeIdentifier": "t_string_memory_ptr",
                        "typeString": "string memory"
                      }
                    },
                    "src": "504:12:5",
                    "typeDescriptions": {
                      "typeIdentifier": "t_string_storage",
                      "typeString": "string storage ref"
                    }
                  },
                  "id": 1475,
                  "nodeType": "ExpressionStatement",
                  "src": "504:12:5"
                },
                {
                  "expression": {
                    "argumentTypes": null,
                    "id": 1478,
                    "isConstant": false,
                    "isLValue": false,
                    "isPure": false,
                    "lValueRequested": false,
                    "leftHandSide": {
                      "argumentTypes": null,
                      "id": 1476,
                      "name": "_symbol",
                      "nodeType": "Identifier",
                      "overloadedDeclarations": [],
                      "referencedDeclaration": 1461,
                      "src": "526:7:5",
                      "typeDescriptions": {
                        "typeIdentifier": "t_string_storage",
                        "typeString": "string storage ref"
                      }
                    },
                    "nodeType": "Assignment",
                    "operator": "=",
                    "rightHandSide": {
                      "argumentTypes": null,
                      "id": 1477,
                      "name": "symbol",
                      "nodeType": "Identifier",
                      "overloadedDeclarations": [],
                      "referencedDeclaration": 1467,
                      "src": "536:6:5",
                      "typeDescriptions": {
                        "typeIdentifier": "t_string_memory_ptr",
                        "typeString": "string memory"
                      }
                    },
                    "src": "526:16:5",
                    "typeDescriptions": {
                      "typeIdentifier": "t_string_storage",
                      "typeString": "string storage ref"
                    }
                  },
                  "id": 1479,
                  "nodeType": "ExpressionStatement",
                  "src": "526:16:5"
                },
                {
                  "expression": {
                    "argumentTypes": null,
                    "id": 1482,
                    "isConstant": false,
                    "isLValue": false,
                    "isPure": false,
                    "lValueRequested": false,
                    "leftHandSide": {
                      "argumentTypes": null,
                      "id": 1480,
                      "name": "_decimals",
                      "nodeType": "Identifier",
                      "overloadedDeclarations": [],
                      "referencedDeclaration": 1463,
                      "src": "552:9:5",
                      "typeDescriptions": {
                        "typeIdentifier": "t_uint8",
                        "typeString": "uint8"
                      }
                    },
                    "nodeType": "Assignment",
                    "operator": "=",
                    "rightHandSide": {
                      "argumentTypes": null,
                      "id": 1481,
                      "name": "decimals",
                      "nodeType": "Identifier",
                      "overloadedDeclarations": [],
                      "referencedDeclaration": 1469,
                      "src": "564:8:5",
                      "typeDescriptions": {
                        "typeIdentifier": "t_uint8",
                        "typeString": "uint8"
                      }
                    },
                    "src": "552:20:5",
                    "typeDescriptions": {
                      "typeIdentifier": "t_uint8",
                      "typeString": "uint8"
                    }
                  },
                  "id": 1483,
                  "nodeType": "ExpressionStatement",
                  "src": "552:20:5"
                }
              ]
            },
            "documentation": "@dev Sets the values for `name`, `symbol`, and `decimals`. All three of\nthese values are immutable: they can only be set once during\nconstruction.",
            "id": 1485,
            "implemented": true,
            "kind": "constructor",
            "modifiers": [],
            "name": "",
            "nodeType": "FunctionDefinition",
            "parameters": {
              "id": 1470,
              "nodeType": "ParameterList",
              "parameters": [
                {
                  "constant": false,
                  "id": 1465,
                  "name": "name",
                  "nodeType": "VariableDeclaration",
                  "scope": 1485,
                  "src": "429:18:5",
                  "stateVariable": false,
                  "storageLocation": "memory",
                  "typeDescriptions": {
                    "typeIdentifier": "t_string_memory_ptr",
                    "typeString": "string"
                  },
                  "typeName": {
                    "id": 1464,
                    "name": "string",
                    "nodeType": "ElementaryTypeName",
                    "src": "429:6:5",
                    "typeDescriptions": {
                      "typeIdentifier": "t_string_storage_ptr",
                      "typeString": "string"
                    }
                  },
                  "value": null,
                  "visibility": "internal"
                },
                {
                  "constant": false,
                  "id": 1467,
                  "name": "symbol",
                  "nodeType": "VariableDeclaration",
                  "scope": 1485,
                  "src": "449:20:5",
                  "stateVariable": false,
                  "storageLocation": "memory",
                  "typeDescriptions": {
                    "typeIdentifier": "t_string_memory_ptr",
                    "typeString": "string"
                  },
                  "typeName": {
                    "id": 1466,
                    "name": "string",
                    "nodeType": "ElementaryTypeName",
                    "src": "449:6:5",
                    "typeDescriptions": {
                      "typeIdentifier": "t_string_storage_ptr",
                      "typeString": "string"
                    }
                  },
                  "value": null,
                  "visibility": "internal"
                },
                {
                  "constant": false,
                  "id": 1469,
                  "name": "decimals",
                  "nodeType": "VariableDeclaration",
                  "scope": 1485,
                  "src": "471:14:5",
                  "stateVariable": false,
                  "storageLocation": "default",
                  "typeDescriptions": {
                    "typeIdentifier": "t_uint8",
                    "typeString": "uint8"
                  },
                  "typeName": {
                    "id": 1468,
                    "name": "uint8",
                    "nodeType": "ElementaryTypeName",
                    "src": "471:5:5",
                    "typeDescriptions": {
                      "typeIdentifier": "t_uint8",
                      "typeString": "uint8"
                    }
                  },
                  "value": null,
                  "visibility": "internal"
                }
              ],
              "src": "428:58:5"
            },
            "returnParameters": {
              "id": 1471,
              "nodeType": "ParameterList",
              "parameters": [],
              "src": "494:0:5"
            },
            "scope": 1510,
            "src": "416:163:5",
            "stateMutability": "nonpayable",
            "superFunction": null,
            "visibility": "public"
          },
          {
            "body": {
              "id": 1492,
              "nodeType": "Block",
              "src": "696:29:5",
              "statements": [
                {
                  "expression": {
                    "argumentTypes": null,
                    "id": 1490,
                    "name": "_name",
                    "nodeType": "Identifier",
                    "overloadedDeclarations": [],
                    "referencedDeclaration": 1459,
                    "src": "713:5:5",
                    "typeDescriptions": {
                      "typeIdentifier": "t_string_storage",
                      "typeString": "string storage ref"
                    }
                  },
                  "functionReturnParameters": 1489,
                  "id": 1491,
                  "nodeType": "Return",
                  "src": "706:12:5"
                }
              ]
            },
            "documentation": "@dev Returns the name of the token.",
            "id": 1493,
            "implemented": true,
            "kind": "function",
            "modifiers": [],
            "name": "name",
            "nodeType": "FunctionDefinition",
            "parameters": {
              "id": 1486,
              "nodeType": "ParameterList",
              "parameters": [],
              "src": "657:2:5"
            },
            "returnParameters": {
              "id": 1489,
              "nodeType": "ParameterList",
              "parameters": [
                {
                  "constant": false,
                  "id": 1488,
                  "name": "",
                  "nodeType": "VariableDeclaration",
                  "scope": 1493,
                  "src": "681:13:5",
                  "stateVariable": false,
                  "storageLocation": "memory",
                  "typeDescriptions": {
                    "typeIdentifier": "t_string_memory_ptr",
                    "typeString": "string"
                  },
                  "typeName": {
                    "id": 1487,
                    "name": "string",
                    "nodeType": "ElementaryTypeName",
                    "src": "681:6:5",
                    "typeDescriptions": {
                      "typeIdentifier": "t_string_storage_ptr",
                      "typeString": "string"
                    }
                  },
                  "value": null,
                  "visibility": "internal"
                }
              ],
              "src": "680:15:5"
            },
            "scope": 1510,
            "src": "644:81:5",
            "stateMutability": "view",
            "superFunction": null,
            "visibility": "public"
          },
          {
            "body": {
              "id": 1500,
              "nodeType": "Block",
              "src": "892:31:5",
              "statements": [
                {
                  "expression": {
                    "argumentTypes": null,
                    "id": 1498,
                    "name": "_symbol",
                    "nodeType": "Identifier",
                    "overloadedDeclarations": [],
                    "referencedDeclaration": 1461,
                    "src": "909:7:5",
                    "typeDescriptions": {
                      "typeIdentifier": "t_string_storage",
                      "typeString": "string storage ref"
                    }
                  },
                  "functionReturnParameters": 1497,
                  "id": 1499,
                  "nodeType": "Return",
                  "src": "902:14:5"
                }
              ]
            },
            "documentation": "@dev Returns the symbol of the token, usually a shorter version of the\nname.",
            "id": 1501,
            "implemented": true,
            "kind": "function",
            "modifiers": [],
            "name": "symbol",
            "nodeType": "FunctionDefinition",
            "parameters": {
              "id": 1494,
              "nodeType": "ParameterList",
              "parameters": [],
              "src": "853:2:5"
            },
            "returnParameters": {
              "id": 1497,
              "nodeType": "ParameterList",
              "parameters": [
                {
                  "constant": false,
                  "id": 1496,
                  "name": "",
                  "nodeType": "VariableDeclaration",
                  "scope": 1501,
                  "src": "877:13:5",
                  "stateVariable": false,
                  "storageLocation": "memory",
                  "typeDescriptions": {
                    "typeIdentifier": "t_string_memory_ptr",
                    "typeString": "string"
                  },
                  "typeName": {
                    "id": 1495,
                    "name": "string",
                    "nodeType": "ElementaryTypeName",
                    "src": "877:6:5",
                    "typeDescriptions": {
                      "typeIdentifier": "t_string_storage_ptr",
                      "typeString": "string"
                    }
                  },
                  "value": null,
                  "visibility": "internal"
                }
              ],
              "src": "876:15:5"
            },
            "scope": 1510,
            "src": "838:85:5",
            "stateMutability": "view",
            "superFunction": null,
            "visibility": "public"
          },
          {
            "body": {
              "id": 1508,
              "nodeType": "Block",
              "src": "1526:33:5",
              "statements": [
                {
                  "expression": {
                    "argumentTypes": null,
                    "id": 1506,
                    "name": "_decimals",
                    "nodeType": "Identifier",
                    "overloadedDeclarations": [],
                    "referencedDeclaration": 1463,
                    "src": "1543:9:5",
                    "typeDescriptions": {
                      "typeIdentifier": "t_uint8",
                      "typeString": "uint8"
                    }
                  },
                  "functionReturnParameters": 1505,
                  "id": 1507,
                  "nodeType": "Return",
                  "src": "1536:16:5"
                }
              ]
            },
            "documentation": "@dev Returns the number of decimals used to get its user representation.\nFor example, if `decimals` equals `2`, a balance of `505` tokens should\nbe displayed to a user as `5,05` (`505 / 10 ** 2`).\n     * Tokens usually opt for a value of 18, imitating the relationship between\nEther and Wei.\n     * > Note that this information is only used for _display_ purposes: it in\nno way affects any of the arithmetic of the contract, including\n`IERC20.balanceOf` and `IERC20.transfer`.",
            "id": 1509,
            "implemented": true,
            "kind": "function",
            "modifiers": [],
            "name": "decimals",
            "nodeType": "FunctionDefinition",
            "parameters": {
              "id": 1502,
              "nodeType": "ParameterList",
              "parameters": [],
              "src": "1495:2:5"
            },
            "returnParameters": {
              "id": 1505,
              "nodeType": "ParameterList",
              "parameters": [
                {
                  "constant": false,
                  "id": 1504,
                  "name": "",
                  "nodeType": "VariableDeclaration",
                  "scope": 1509,
                  "src": "1519:5:5",
                  "stateVariable": false,
                  "storageLocation": "default",
                  "typeDescriptions": {
                    "typeIdentifier": "t_uint8",
                    "typeString": "uint8"
                  },
                  "typeName": {
                    "id": 1503,
                    "name": "uint8",
                    "nodeType": "ElementaryTypeName",
                    "src": "1519:5:5",
                    "typeDescriptions": {
                      "typeIdentifier": "t_uint8",
                      "typeString": "uint8"
                    }
                  },
                  "value": null,
                  "visibility": "internal"
                }
              ],
              "src": "1518:7:5"
            },
            "scope": 1510,
            "src": "1478:81:5",
            "stateMutability": "view",
            "superFunction": null,
            "visibility": "public"
          }
        ],
        "scope": 1511,
        "src": "109:1452:5"
      }
    ],
    "src": "0:1562:5"
  },
  "legacyAST": {
    "absolutePath": "/C/Users/robin/code/rebalance/packages/contracts/node_modules/@openzeppelin/contracts/token/ERC20/ERC20Detailed.sol",
    "exportedSymbols": {
      "ERC20Detailed": [
        1510
      ]
    },
    "id": 1511,
    "nodeType": "SourceUnit",
    "nodes": [
      {
        "id": 1454,
        "literals": [
          "solidity",
          "^",
          "0.5",
          ".0"
        ],
        "nodeType": "PragmaDirective",
        "src": "0:23:5"
      },
      {
        "absolutePath": "/C/Users/robin/code/rebalance/packages/contracts/node_modules/@openzeppelin/contracts/token/ERC20/IERC20.sol",
        "file": "./IERC20.sol",
        "id": 1455,
        "nodeType": "ImportDirective",
        "scope": 1511,
        "sourceUnit": 1580,
        "src": "25:22:5",
        "symbolAliases": [],
        "unitAlias": ""
      },
      {
        "baseContracts": [
          {
            "arguments": null,
            "baseName": {
              "contractScope": null,
              "id": 1456,
              "name": "IERC20",
              "nodeType": "UserDefinedTypeName",
              "referencedDeclaration": 1579,
              "src": "135:6:5",
              "typeDescriptions": {
                "typeIdentifier": "t_contract$_IERC20_$1579",
                "typeString": "contract IERC20"
              }
            },
            "id": 1457,
            "nodeType": "InheritanceSpecifier",
            "src": "135:6:5"
          }
        ],
        "contractDependencies": [
          1579
        ],
        "contractKind": "contract",
        "documentation": "@dev Optional functions from the ERC20 standard.",
        "fullyImplemented": false,
        "id": 1510,
        "linearizedBaseContracts": [
          1510,
          1579
        ],
        "name": "ERC20Detailed",
        "nodeType": "ContractDefinition",
        "nodes": [
          {
            "constant": false,
            "id": 1459,
            "name": "_name",
            "nodeType": "VariableDeclaration",
            "scope": 1510,
            "src": "148:20:5",
            "stateVariable": true,
            "storageLocation": "default",
            "typeDescriptions": {
              "typeIdentifier": "t_string_storage",
              "typeString": "string"
            },
            "typeName": {
              "id": 1458,
              "name": "string",
              "nodeType": "ElementaryTypeName",
              "src": "148:6:5",
              "typeDescriptions": {
                "typeIdentifier": "t_string_storage_ptr",
                "typeString": "string"
              }
            },
            "value": null,
            "visibility": "private"
          },
          {
            "constant": false,
            "id": 1461,
            "name": "_symbol",
            "nodeType": "VariableDeclaration",
            "scope": 1510,
            "src": "174:22:5",
            "stateVariable": true,
            "storageLocation": "default",
            "typeDescriptions": {
              "typeIdentifier": "t_string_storage",
              "typeString": "string"
            },
            "typeName": {
              "id": 1460,
              "name": "string",
              "nodeType": "ElementaryTypeName",
              "src": "174:6:5",
              "typeDescriptions": {
                "typeIdentifier": "t_string_storage_ptr",
                "typeString": "string"
              }
            },
            "value": null,
            "visibility": "private"
          },
          {
            "constant": false,
            "id": 1463,
            "name": "_decimals",
            "nodeType": "VariableDeclaration",
            "scope": 1510,
            "src": "202:23:5",
            "stateVariable": true,
            "storageLocation": "default",
            "typeDescriptions": {
              "typeIdentifier": "t_uint8",
              "typeString": "uint8"
            },
            "typeName": {
              "id": 1462,
              "name": "uint8",
              "nodeType": "ElementaryTypeName",
              "src": "202:5:5",
              "typeDescriptions": {
                "typeIdentifier": "t_uint8",
                "typeString": "uint8"
              }
            },
            "value": null,
            "visibility": "private"
          },
          {
            "body": {
              "id": 1484,
              "nodeType": "Block",
              "src": "494:85:5",
              "statements": [
                {
                  "expression": {
                    "argumentTypes": null,
                    "id": 1474,
                    "isConstant": false,
                    "isLValue": false,
                    "isPure": false,
                    "lValueRequested": false,
                    "leftHandSide": {
                      "argumentTypes": null,
                      "id": 1472,
                      "name": "_name",
                      "nodeType": "Identifier",
                      "overloadedDeclarations": [],
                      "referencedDeclaration": 1459,
                      "src": "504:5:5",
                      "typeDescriptions": {
                        "typeIdentifier": "t_string_storage",
                        "typeString": "string storage ref"
                      }
                    },
                    "nodeType": "Assignment",
                    "operator": "=",
                    "rightHandSide": {
                      "argumentTypes": null,
                      "id": 1473,
                      "name": "name",
                      "nodeType": "Identifier",
                      "overloadedDeclarations": [],
                      "referencedDeclaration": 1465,
                      "src": "512:4:5",
                      "typeDescriptions": {
                        "typeIdentifier": "t_string_memory_ptr",
                        "typeString": "string memory"
                      }
                    },
                    "src": "504:12:5",
                    "typeDescriptions": {
                      "typeIdentifier": "t_string_storage",
                      "typeString": "string storage ref"
                    }
                  },
                  "id": 1475,
                  "nodeType": "ExpressionStatement",
                  "src": "504:12:5"
                },
                {
                  "expression": {
                    "argumentTypes": null,
                    "id": 1478,
                    "isConstant": false,
                    "isLValue": false,
                    "isPure": false,
                    "lValueRequested": false,
                    "leftHandSide": {
                      "argumentTypes": null,
                      "id": 1476,
                      "name": "_symbol",
                      "nodeType": "Identifier",
                      "overloadedDeclarations": [],
                      "referencedDeclaration": 1461,
                      "src": "526:7:5",
                      "typeDescriptions": {
                        "typeIdentifier": "t_string_storage",
                        "typeString": "string storage ref"
                      }
                    },
                    "nodeType": "Assignment",
                    "operator": "=",
                    "rightHandSide": {
                      "argumentTypes": null,
                      "id": 1477,
                      "name": "symbol",
                      "nodeType": "Identifier",
                      "overloadedDeclarations": [],
                      "referencedDeclaration": 1467,
                      "src": "536:6:5",
                      "typeDescriptions": {
                        "typeIdentifier": "t_string_memory_ptr",
                        "typeString": "string memory"
                      }
                    },
                    "src": "526:16:5",
                    "typeDescriptions": {
                      "typeIdentifier": "t_string_storage",
                      "typeString": "string storage ref"
                    }
                  },
                  "id": 1479,
                  "nodeType": "ExpressionStatement",
                  "src": "526:16:5"
                },
                {
                  "expression": {
                    "argumentTypes": null,
                    "id": 1482,
                    "isConstant": false,
                    "isLValue": false,
                    "isPure": false,
                    "lValueRequested": false,
                    "leftHandSide": {
                      "argumentTypes": null,
                      "id": 1480,
                      "name": "_decimals",
                      "nodeType": "Identifier",
                      "overloadedDeclarations": [],
                      "referencedDeclaration": 1463,
                      "src": "552:9:5",
                      "typeDescriptions": {
                        "typeIdentifier": "t_uint8",
                        "typeString": "uint8"
                      }
                    },
                    "nodeType": "Assignment",
                    "operator": "=",
                    "rightHandSide": {
                      "argumentTypes": null,
                      "id": 1481,
                      "name": "decimals",
                      "nodeType": "Identifier",
                      "overloadedDeclarations": [],
                      "referencedDeclaration": 1469,
                      "src": "564:8:5",
                      "typeDescriptions": {
                        "typeIdentifier": "t_uint8",
                        "typeString": "uint8"
                      }
                    },
                    "src": "552:20:5",
                    "typeDescriptions": {
                      "typeIdentifier": "t_uint8",
                      "typeString": "uint8"
                    }
                  },
                  "id": 1483,
                  "nodeType": "ExpressionStatement",
                  "src": "552:20:5"
                }
              ]
            },
            "documentation": "@dev Sets the values for `name`, `symbol`, and `decimals`. All three of\nthese values are immutable: they can only be set once during\nconstruction.",
            "id": 1485,
            "implemented": true,
            "kind": "constructor",
            "modifiers": [],
            "name": "",
            "nodeType": "FunctionDefinition",
            "parameters": {
              "id": 1470,
              "nodeType": "ParameterList",
              "parameters": [
                {
                  "constant": false,
                  "id": 1465,
                  "name": "name",
                  "nodeType": "VariableDeclaration",
                  "scope": 1485,
                  "src": "429:18:5",
                  "stateVariable": false,
                  "storageLocation": "memory",
                  "typeDescriptions": {
                    "typeIdentifier": "t_string_memory_ptr",
                    "typeString": "string"
                  },
                  "typeName": {
                    "id": 1464,
                    "name": "string",
                    "nodeType": "ElementaryTypeName",
                    "src": "429:6:5",
                    "typeDescriptions": {
                      "typeIdentifier": "t_string_storage_ptr",
                      "typeString": "string"
                    }
                  },
                  "value": null,
                  "visibility": "internal"
                },
                {
                  "constant": false,
                  "id": 1467,
                  "name": "symbol",
                  "nodeType": "VariableDeclaration",
                  "scope": 1485,
                  "src": "449:20:5",
                  "stateVariable": false,
                  "storageLocation": "memory",
                  "typeDescriptions": {
                    "typeIdentifier": "t_string_memory_ptr",
                    "typeString": "string"
                  },
                  "typeName": {
                    "id": 1466,
                    "name": "string",
                    "nodeType": "ElementaryTypeName",
                    "src": "449:6:5",
                    "typeDescriptions": {
                      "typeIdentifier": "t_string_storage_ptr",
                      "typeString": "string"
                    }
                  },
                  "value": null,
                  "visibility": "internal"
                },
                {
                  "constant": false,
                  "id": 1469,
                  "name": "decimals",
                  "nodeType": "VariableDeclaration",
                  "scope": 1485,
                  "src": "471:14:5",
                  "stateVariable": false,
                  "storageLocation": "default",
                  "typeDescriptions": {
                    "typeIdentifier": "t_uint8",
                    "typeString": "uint8"
                  },
                  "typeName": {
                    "id": 1468,
                    "name": "uint8",
                    "nodeType": "ElementaryTypeName",
                    "src": "471:5:5",
                    "typeDescriptions": {
                      "typeIdentifier": "t_uint8",
                      "typeString": "uint8"
                    }
                  },
                  "value": null,
                  "visibility": "internal"
                }
              ],
              "src": "428:58:5"
            },
            "returnParameters": {
              "id": 1471,
              "nodeType": "ParameterList",
              "parameters": [],
              "src": "494:0:5"
            },
            "scope": 1510,
            "src": "416:163:5",
            "stateMutability": "nonpayable",
            "superFunction": null,
            "visibility": "public"
          },
          {
            "body": {
              "id": 1492,
              "nodeType": "Block",
              "src": "696:29:5",
              "statements": [
                {
                  "expression": {
                    "argumentTypes": null,
                    "id": 1490,
                    "name": "_name",
                    "nodeType": "Identifier",
                    "overloadedDeclarations": [],
                    "referencedDeclaration": 1459,
                    "src": "713:5:5",
                    "typeDescriptions": {
                      "typeIdentifier": "t_string_storage",
                      "typeString": "string storage ref"
                    }
                  },
                  "functionReturnParameters": 1489,
                  "id": 1491,
                  "nodeType": "Return",
                  "src": "706:12:5"
                }
              ]
            },
            "documentation": "@dev Returns the name of the token.",
            "id": 1493,
            "implemented": true,
            "kind": "function",
            "modifiers": [],
            "name": "name",
            "nodeType": "FunctionDefinition",
            "parameters": {
              "id": 1486,
              "nodeType": "ParameterList",
              "parameters": [],
              "src": "657:2:5"
            },
            "returnParameters": {
              "id": 1489,
              "nodeType": "ParameterList",
              "parameters": [
                {
                  "constant": false,
                  "id": 1488,
                  "name": "",
                  "nodeType": "VariableDeclaration",
                  "scope": 1493,
                  "src": "681:13:5",
                  "stateVariable": false,
                  "storageLocation": "memory",
                  "typeDescriptions": {
                    "typeIdentifier": "t_string_memory_ptr",
                    "typeString": "string"
                  },
                  "typeName": {
                    "id": 1487,
                    "name": "string",
                    "nodeType": "ElementaryTypeName",
                    "src": "681:6:5",
                    "typeDescriptions": {
                      "typeIdentifier": "t_string_storage_ptr",
                      "typeString": "string"
                    }
                  },
                  "value": null,
                  "visibility": "internal"
                }
              ],
              "src": "680:15:5"
            },
            "scope": 1510,
            "src": "644:81:5",
            "stateMutability": "view",
            "superFunction": null,
            "visibility": "public"
          },
          {
            "body": {
              "id": 1500,
              "nodeType": "Block",
              "src": "892:31:5",
              "statements": [
                {
                  "expression": {
                    "argumentTypes": null,
                    "id": 1498,
                    "name": "_symbol",
                    "nodeType": "Identifier",
                    "overloadedDeclarations": [],
                    "referencedDeclaration": 1461,
                    "src": "909:7:5",
                    "typeDescriptions": {
                      "typeIdentifier": "t_string_storage",
                      "typeString": "string storage ref"
                    }
                  },
                  "functionReturnParameters": 1497,
                  "id": 1499,
                  "nodeType": "Return",
                  "src": "902:14:5"
                }
              ]
            },
            "documentation": "@dev Returns the symbol of the token, usually a shorter version of the\nname.",
            "id": 1501,
            "implemented": true,
            "kind": "function",
            "modifiers": [],
            "name": "symbol",
            "nodeType": "FunctionDefinition",
            "parameters": {
              "id": 1494,
              "nodeType": "ParameterList",
              "parameters": [],
              "src": "853:2:5"
            },
            "returnParameters": {
              "id": 1497,
              "nodeType": "ParameterList",
              "parameters": [
                {
                  "constant": false,
                  "id": 1496,
                  "name": "",
                  "nodeType": "VariableDeclaration",
                  "scope": 1501,
                  "src": "877:13:5",
                  "stateVariable": false,
                  "storageLocation": "memory",
                  "typeDescriptions": {
                    "typeIdentifier": "t_string_memory_ptr",
                    "typeString": "string"
                  },
                  "typeName": {
                    "id": 1495,
                    "name": "string",
                    "nodeType": "ElementaryTypeName",
                    "src": "877:6:5",
                    "typeDescriptions": {
                      "typeIdentifier": "t_string_storage_ptr",
                      "typeString": "string"
                    }
                  },
                  "value": null,
                  "visibility": "internal"
                }
              ],
              "src": "876:15:5"
            },
            "scope": 1510,
            "src": "838:85:5",
            "stateMutability": "view",
            "superFunction": null,
            "visibility": "public"
          },
          {
            "body": {
              "id": 1508,
              "nodeType": "Block",
              "src": "1526:33:5",
              "statements": [
                {
                  "expression": {
                    "argumentTypes": null,
                    "id": 1506,
                    "name": "_decimals",
                    "nodeType": "Identifier",
                    "overloadedDeclarations": [],
                    "referencedDeclaration": 1463,
                    "src": "1543:9:5",
                    "typeDescriptions": {
                      "typeIdentifier": "t_uint8",
                      "typeString": "uint8"
                    }
                  },
                  "functionReturnParameters": 1505,
                  "id": 1507,
                  "nodeType": "Return",
                  "src": "1536:16:5"
                }
              ]
            },
            "documentation": "@dev Returns the number of decimals used to get its user representation.\nFor example, if `decimals` equals `2`, a balance of `505` tokens should\nbe displayed to a user as `5,05` (`505 / 10 ** 2`).\n     * Tokens usually opt for a value of 18, imitating the relationship between\nEther and Wei.\n     * > Note that this information is only used for _display_ purposes: it in\nno way affects any of the arithmetic of the contract, including\n`IERC20.balanceOf` and `IERC20.transfer`.",
            "id": 1509,
            "implemented": true,
            "kind": "function",
            "modifiers": [],
            "name": "decimals",
            "nodeType": "FunctionDefinition",
            "parameters": {
              "id": 1502,
              "nodeType": "ParameterList",
              "parameters": [],
              "src": "1495:2:5"
            },
            "returnParameters": {
              "id": 1505,
              "nodeType": "ParameterList",
              "parameters": [
                {
                  "constant": false,
                  "id": 1504,
                  "name": "",
                  "nodeType": "VariableDeclaration",
                  "scope": 1509,
                  "src": "1519:5:5",
                  "stateVariable": false,
                  "storageLocation": "default",
                  "typeDescriptions": {
                    "typeIdentifier": "t_uint8",
                    "typeString": "uint8"
                  },
                  "typeName": {
                    "id": 1503,
                    "name": "uint8",
                    "nodeType": "ElementaryTypeName",
                    "src": "1519:5:5",
                    "typeDescriptions": {
                      "typeIdentifier": "t_uint8",
                      "typeString": "uint8"
                    }
                  },
                  "value": null,
                  "visibility": "internal"
                }
              ],
              "src": "1518:7:5"
            },
            "scope": 1510,
            "src": "1478:81:5",
            "stateMutability": "view",
            "superFunction": null,
            "visibility": "public"
          }
        ],
        "scope": 1511,
        "src": "109:1452:5"
      }
    ],
    "src": "0:1562:5"
  },
  "compiler": {
    "name": "solc",
    "version": "0.5.8+commit.23d335f2.Emscripten.clang"
  },
  "networks": {},
  "schemaVersion": "3.0.11",
  "updatedAt": "2019-08-13T07:30:45.627Z",
  "devdoc": {
    "details": "Optional functions from the ERC20 standard.",
    "methods": {
      "allowance(address,address)": {
        "details": "Returns the remaining number of tokens that `spender` will be allowed to spend on behalf of `owner` through `transferFrom`. This is zero by default.     * This value changes when `approve` or `transferFrom` are called."
      },
      "approve(address,uint256)": {
        "details": "Sets `amount` as the allowance of `spender` over the caller's tokens.     * Returns a boolean value indicating whether the operation succeeded.     * > Beware that changing an allowance with this method brings the risk that someone may use both the old and the new allowance by unfortunate transaction ordering. One possible solution to mitigate this race condition is to first reduce the spender's allowance to 0 and set the desired value afterwards: https://github.com/ethereum/EIPs/issues/20#issuecomment-263524729     * Emits an `Approval` event."
      },
      "balanceOf(address)": {
        "details": "Returns the amount of tokens owned by `account`."
      },
      "constructor": {
        "details": "Sets the values for `name`, `symbol`, and `decimals`. All three of these values are immutable: they can only be set once during construction."
      },
      "decimals()": {
        "details": "Returns the number of decimals used to get its user representation. For example, if `decimals` equals `2`, a balance of `505` tokens should be displayed to a user as `5,05` (`505 / 10 ** 2`).     * Tokens usually opt for a value of 18, imitating the relationship between Ether and Wei.     * > Note that this information is only used for _display_ purposes: it in no way affects any of the arithmetic of the contract, including `IERC20.balanceOf` and `IERC20.transfer`."
      },
      "name()": {
        "details": "Returns the name of the token."
      },
      "symbol()": {
        "details": "Returns the symbol of the token, usually a shorter version of the name."
      },
      "totalSupply()": {
        "details": "Returns the amount of tokens in existence."
      },
      "transfer(address,uint256)": {
        "details": "Moves `amount` tokens from the caller's account to `recipient`.     * Returns a boolean value indicating whether the operation succeeded.     * Emits a `Transfer` event."
      },
      "transferFrom(address,address,uint256)": {
        "details": "Moves `amount` tokens from `sender` to `recipient` using the allowance mechanism. `amount` is then deducted from the caller's allowance.     * Returns a boolean value indicating whether the operation succeeded.     * Emits a `Transfer` event."
      }
    }
  },
  "userdoc": {
    "methods": {}
  }
}