[
    {
      "source_name": "David Wilson Homes (DWH)",
      "group": "",
      "BDM": "TMcA",
      "Expedited_DOE_Fee_Chargeable_(Yes/No)": {
        "period_6_to_8_Weeks": "No",
        "period_4_to_6_Weeks": "Yes",
        "period_less_than_4_Weeks": "Yes"
      },
      "AML/ID_Fees_Chargeable_(Amiqus)_(Yes/No)" : "",
      "Additional_Comments": "",
      "fee_categories": {
        "conveyancing_purchase": {
          "variable": [
            {
              "fee_name": "Conveyancing Fee Purchase",
              "fee_description": "Conveyancing Fee Purchase",
              "conveyancing_price_scales": [
                {
                  "scale_name": "£0 to £200,000",
                  "scale_order": 1,
                  "scale_range_min": 0.00,
                  "scale_range_max": 200000.00,
                  "fee": {
                    "net_price": 600.00, 
                    "Vat": 120.00, 
                    "total_price": 720.00
                  }
                },
                {
                  "scale_name": "£200,001 to £400,000",
                  "scale_order": 2,
                  "scale_range_min": 200001.00,
                  "scale_range_max": 400000.00,
                  "fee": {
                    "net_price": 750.00, 
                    "Vat": 150.00, 
                    "total_price": 900.00
                  }
                }
              ]
            }
          ],
          "standard":[
            {
              "fee_name": "ID/AML Electronic Searches",
              "fee_description": "ID/AML Electronic Search Fees",
              "fee": {
                "net_price": 750.00, 
                "Vat": 150.00, 
                "total_price": 900.00
              }
            }
          ],
          "supplement":[
            {
              "fee_name": "ID/AML Electronic Searches",
              "fee_description": "ID/AML Electronic Search Fees",
              "fee": {
                "net_price": 750.00, 
                "Vat": 150.00, 
                "total_price": 900.00
              }
            }
          ]
        },
        "conveyancing_sale": {
          "variable": [
            {
              "fee_name": "Conveyancing Fee sale",
              "fee_description": "Conveyancing Fee sale",
              "conveyancing_price_scales": [
                {
                  "scale_name": "£0 to £200,000",
                  "scale_order": 1,
                  "scale_range_min": 0.00,
                  "scale_range_max": 200000.00,
                  "fee": {
                    "net_price": 600.00, 
                    "Vat": 120.00, 
                    "total_price": 720.00
                  }
                },
                {
                  "scale_name": "£200,001 to £400,000",
                  "scale_order": 2,
                  "scale_range_min": 200001.00,
                  "scale_range_max": 400000.00,
                  "fee": {
                    "net_price": 750.00, 
                    "Vat": 150.00, 
                    "total_price": 900.00
                  }
                }
              ]
            }
          ],
          "standard":[
            {
              "fee_name": "Total Referral Fee",
              "fee_description": "Total Referral Fee",
              "fee": {
                "net_price": 150.00, 
                "Vat": 30.00, 
                "total_price": 180
              }
            }
          ],
          "supplement":[
            {
              "fee_name": "Total Referral Fee",
              "fee_description": "Total Referral Fee",
              "fee": {
                "net_price": 150.00, 
                "Vat": 30.00, 
                "total_price": 180
              }
            }
          ]
        },
        "conveyancing_remortgage": {
          "variable": [
            {
              "fee_name": "Conveyancing Fee remortgage",
              "fee_description": "Conveyancing Fee remortgage",
              "conveyancing_price_scales": [
                {
                  "scale_name": "£0 to £200,000",
                  "scale_order": 1,
                  "scale_range_min": 0.00,
                  "scale_range_max": 200000.00,
                  "fee": {
                    "net_price": 600.00, 
                    "Vat": 120.00, 
                    "total_price": 720.00
                  }
                },
                {
                  "scale_name": "£200,001 to £400,000",
                  "scale_order": 2,
                  "scale_range_min": 200001.00,
                  "scale_range_max": 400000.00,
                  "fee": {
                    "net_price": 750.00, 
                    "Vat": 150.00, 
                    "total_price": 900.00
                  }
                }
              ]
            }
          ],
          "standard":[
            {
              "fee_name": "Total Referral Fee",
              "fee_description": "Total Referral Fee",
              "fee": {
                "net_price": 150.00, 
                "Vat": 30.00, 
                "total_price": 180
              }
            }
          ],
          "supplement":[
            {
              "fee_name": "Total Referral Fee",
              "fee_description": "Total Referral Fee",
              "fee": {
                "net_price": 150.00, 
                "Vat": 30.00, 
                "total_price": 180
              }
            }
          ]
        },
        "conveyancing_general_fees": [
          {
            "fee_name": "ID/AML Electronic Searches",
            "fee_description": "ID/AML Electronic Search Fees",
            "fee": {
              "net_price": 600.00, 
              "Vat": 120.00, 
              "total_price": 720.00
            }
          },
          {
            "fee_name": "Same Day Bank Transfer (Conveyancing)",
            "fee_description": "Same Day Electronic Bank Transfer",
            "fee": {
              "net_price": 600.00, 
              "Vat": 120.00, 
              "total_price": 720.00
            }
          },
          {
            "fee_name": "Lender Portal Fee",
            "fee_description": "Same Day Electronic Bank Transfer",
            "fee": {
              "net_price": 600.00, 
              "Vat": 120.00, 
              "total_price": 720.00
            }
          }
        ]
      }
    }
]
