{
  "conveyancing_purchase": [
    {
      "feeName": "Conveyancing Fee Purchase",
      "feeDescription": "",
      "vatable": true,
      "feeType": "variable",
      "fixedFee": "",
      "variableFee": [
        {
          "scale_id": 1,
          "scale_range_min": 0 ,
          "scale_range_max": 200000,              
          "Price (Net of VAT) (£)": 600, 
          "Vat": 120 , 
          "Total": 720  
        },
        {
          "scale_id": 2,
          "scale_range_min": 200001,
          "scale_range_max": 400000,              
          "Price (Net of VAT) (£)": 750, 
          "Vat": 150 , 
          "Total": 900  
        },
        {
          "scale_id": 2,
          "scale_range_min": 400001,
          "scale_range_max": 600000,              
          "Price (Net of VAT) (£)": 900, 
          "Vat": 180 , 
          "Total": 1080  
        },
        {
          "scale_id": 2,
          "scale_range_min": 600001,
          "scale_range_max": null,              
          "Price (Net of VAT) (£)": 1100, 
          "Vat": 220, 
          "Total": 1320 
        }
      ]          
    }       
  ],
  "conveyancing_sale": [
    {
      "feeName": "Conveyancing Fee Sale",
      "feeDescription": "",
      "vatable": true,
      "feeType": "variable",
      "fees": [
        {
          "scale_id": 1,
          "scale_range_min": 0,
          "scale_range_max": 200000,              
          "Price (Net of VAT) (£)": 600, 
          "Vat": 120 , 
          "Total": 720  
        },
        {
          "scale_id": 2,
          "scale_range_min": 200001 ,
          "scale_range_max": 400000 ,              
          "Price (Net of VAT) (£)": 750 , 
          "Vat": 150 , 
          "Total": 900  
        },
        {
          "scale_id": 2,
          "scale_range_min": 400001 ,
          "scale_range_max": 600000 ,              
          "Price (Net of VAT) (£)": 900 , 
          "Vat": 180 , 
          "Total": 1080  
        },
        {
          "scale_id": 2,
          "scale_range_min": 600001 ,
          "scale_range_max": null,              
          "Price (Net of VAT) (£)": 1100 , 
          "Vat": 220 , 
          "Total": 1320  
        }
      ]          
    }
  ],
  "conveyancing_remortgage_TOE": [
    {
      "feeName": "Remortgage (Standard)",
      "feeDescription": "",
      "vatable": true,
      "feeType": "fixed",
      "Price (Net of VAT) (£)": 350 , 
      "Vat": 70 , 
      "Total": 420          
    },
    {
      "feeName": "Remortgage and Title Transfer",
      "feeDescription": "",
      "vatable": true,
      "feeType": "fixed",
      "Price (Net of VAT) (£)": 600 , 
      "Vat": 120 , 
      "Total": 720          
    },
    {
      "feeName": "Lifetime/Shared Equity Mortgage",
      "feeDescription": "Bespoke fee so fee quoted here is approximate. Discuss billing with a Director on a case by case basis.",
      "vatable": true,
      "feeType": "fixed",
      "Price (Net of VAT) (£)": 600 , 
      "Vat": 120 , 
      "Total": 720          
    },
    {
      "feeName": "Discharge of Standard Security",
      "feeDescription": "For example, mortgage paid-off but security remains in place",
      "vatable": true,
      "feeType": "fixed",
      "Price (Net of VAT) (£)": 200 , 
      "Vat": 40 , 
      "Total": 240          
    }
  ],
  "general fees": [
    {
      "feeName": "ID/AML Electronic Searches",
      "feeDescription": "ID/AML Electronic Search Fees",
      "vatable": true,
      "feeType": "fixed",
      "Price (Net of VAT) (£)": 20,
      "Vat": 4,
      "Total": 24
    },
    {
      "feeName": "Same Day Bank Transfer (Conveyancing)",
      "feeDescription": "Same Day Electronic Bank Transfer",
      "vatable": true,
      "feeType": "fixed",
      "Price (Net of VAT) (£)": 30,
      "Vat": 6,
      "Total": 36
    },
    {
      "feeName": "Lender Portal Fee",
      "feeDescription": "",
      "vatable": true,
      "feeType": "fixed",
      "Price (Net of VAT) (£)": 25,
      "Vat": 5,
      "Total": 30
    }        
  ],
  "supplements": {
    "sale and purchase" : [
      {
        "feeName": "Adverse Entries in Personal Search",
        "feeDescription": "Taking required steps for transaction to proceed if search reveals adverse entries against client e.g. advising how to liaise with creditors",
        "vatable": true,
        "feeType": "fixed",
        "Price (Net of VAT) (£)": 95,
        "Vat": 19,
        "Total": 114
      },
      {
        "feeName": "Alterations - Checking (Purchase) or Obtaining (Sale) Alterations Documentation",
        "feeDescription": "Undertaking work to check for validity (for buyer), or to obtain (for seller) alterations documents.",
        "vatable": true,
        "feeType": "fixed",
        "Price (Net of VAT) (£)": 95,
        "Vat": 19,
        "Total": 114
      },
      {
        "feeName": "Same Day Payment",
        "feeDescription": "Guaranteed same day telegraphic bank transfer fee",
        "vatable": true,
        "feeType": "fixed",
        "Price (Net of VAT) (£)": 30,
        "Vat": 6,
        "Total": 36
      },
      {
        "feeName": "Discharge of Additional Security",
        "feeDescription": "Work involved in discharging additional securities other than main mortgage account",
        "vatable": true,
        "feeType": "fixed",
        "Price (Net of VAT) (£)": 125,
        "Vat": 25,
        "Total": 150
      },
      {
        "feeName": "Executry Sale or Purchase",
        "feeDescription": "Ensuring adequate links in title in place in executry sale or purchase",
        "vatable": true,
        "feeType": "fixed",
        "Price (Net of VAT) (£)": 125,
        "Vat": 25,
        "Total": 150
      },
      {
        "feeName": "Expedited Date of Entry",
        "feeDescription": "Date of Entry less than 6 weeks from agreeing sale or purchase",
        "vatable": true,
        "feeType": "fixed",
        "Price (Net of VAT) (£)": 95,
        "Vat": 19,
        "Total": 114
      },
      {
        "feeName": "Factored Property",
        "feeDescription": "Liaising with Factor for property on behalf of seller including obtaining apportionment of costs",
        "vatable": true,
        "feeType": "fixed",
        "Price (Net of VAT) (£)": 75,
        "Vat": 15,
        "Total": 90
      },
      {
        "feeName": "First Home Fund - NEW BUILD",
        "feeDescription": "Liaising with solicitors acting for Government and additional administration and paperwork",
        "vatable": true,
        "feeType": "fixed",
        "Price (Net of VAT) (£)": 195,
        "Vat": 39,
        "Total": 234
      },
      {
        "feeName": "First Home Fund - PRIVATE CLIENT",
        "feeDescription": "Liaising with solicitors acting for Government and additional administration and paperwork",
        "vatable": true,
        "feeType": "fixed",
        "Price (Net of VAT) (£)": 250,
        "Vat": 50,
        "Total": 300
      },
      {
        "feeName": "First Registration/Property Not in Land Register",
        "feeDescription": "Work involved in applying to enter property into Land Register for the first time for buyer or obtaining additional reports and ensuring burdens present for seller",
        "vatable": true,
        "feeType": "fixed",
        "Price (Net of VAT) (£)": 125,
        "Vat": 25,
        "Total": 150
      },
      {
        "feeName": "Gifted Deposit",
        "feeDescription": "Undertaking Enhanced Client Due Diligence on Gifter of purchase funds",
        "vatable": true,
        "feeType": "fixed",
        "Price (Net of VAT) (£)": 100,
        "Vat": 20,
        "Total": 120
      },
      {
        "feeName": "Gifted Deposit - ID Checks",
        "feeDescription": "ID Checks have to be undertaken on any parties gifting funds towards a property purchase. Per person gifting.",
        "vatable": true,
        "feeType": "fixed",
        "Price (Net of VAT) (£)": 10,
        "Vat": 2,
        "Total": 12
      },
      {
        "feeName": "Help to Buy - NEW BUILD",
        "feeDescription": "Liaising with solicitors acting for Government and additional administration and paperwork",
        "vatable": true,
        "feeType": "fixed",
        "Price (Net of VAT) (£)": 195,
        "Vat": 39,
        "Total": 234
      },
      {
        "feeName": "Help to Buy - PRIVATE CLIENT",
        "feeDescription": "Liaising with solicitors acting for Government and additional administration and paperwork",
        "vatable": true,
        "feeType": "fixed",
        "Price (Net of VAT) (£)": 150,
        "Vat": 30,
        "Total": 180
      },
      {
        "feeName": "Help to Buy ISA",
        "feeDescription": "Liaising with ISA provider and Bonus Application. Fee per Help to Buy Scheme Rules.",
        "vatable": true,
        "feeType": "fixed",
        "Price (Net of VAT) (£)": 50,
        "Vat": 10,
        "Total": 60
      },
      {
        "feeName": "Liaising with Joint Valuation Board for Rateable Value Certificate",
        "feeDescription": "",
        "vatable": true,
        "feeType": "fixed",
        "Price (Net of VAT) (£)": 75,
        "Vat": 15,
        "Total": 90
      },
      {
        "feeName": "Lifetime ISA",
        "feeDescription": "",
        "vatable": true,
        "feeType": "fixed",
        "Price (Net of VAT) (£)": 75,
        "Vat": 15,
        "Total": 90
      },
      {
        "feeName": "Shared Equity Purchase - NEW BUILD",
        "feeDescription": "Liaising with various additional parties and additional legal paperwork",
        "vatable": true,
        "feeType": "fixed",
        "Price (Net of VAT) (£)": 195,
        "Vat": 39,
        "Total": 234
      },
      {
        "feeName": "Shared Equity Purchase - PRIVATE CLIENT",
        "feeDescription": "Liaising with various additional parties and additional legal paperwork",
        "vatable": true,
        "feeType": "fixed",
        "Price (Net of VAT) (£)": 250,
        "Vat": 50,
        "Total": 300
      },
      {
        "feeName": "Taking Instructions from Multiple Parties",
        "feeDescription": "Taking separate instructions from two or more individuals on a purchase or sale",
        "vatable": true,
        "feeType": "fixed",
        "Price (Net of VAT) (£)": 95,
        "Vat": 19,
        "Total": 114
      },
      {
        "feeName": "Title Indemnity - Approving (Sale) or Advising on (Purchase) Title Indemnity Policy",
        "feeDescription": "If title issue may prevent or delay a sale or purchase, Indemnity Policy may allow it to proceed. Not including cost of insurance policy.",
        "vatable": true,
        "feeType": "fixed",
        "Price (Net of VAT) (£)": 95,
        "Vat": 19,
        "Total": 114
      },
      {
        "feeName": "Unreasonable Missive Delays or Unusually Complex Missives",
        "feeDescription": "Non-standard, protracted contract negotiations with solicitor acting for your seller or buyer.",
        "vatable": true,
        "feeType": "fixed",
        "Price (Net of VAT) (£)": 95,
        "Vat": 19,
        "Total": 114
      },
      {
        "feeName": "Using a Separate Solicitor Firm for Purchase or Sale",
        "feeDescription": "Liaising with separate solicitor acting for you e.g. if using different firm for purchase and sale",
        "vatable": true,
        "feeType": "fixed",
        "Price (Net of VAT) (£)": 95,
        "Vat": 19,
        "Total": 114
      }        
    ],
    "sale" : [],
    "purchase" : [],
    "remortgage" : [
      {
        "feeName": "Adverse Entries in Personal Search",
        "feeDescription": "Taking required steps for transaction to proceed if search reveals adverse entries against client e.g. advising how to liaise with creditors",
        "vatable": true,
        "feeType": "fixed",
        "Price (Net of VAT) (£)": 95,
        "Vat": 19,
        "Total": 114
      },
      {
        "feeName": "Alterations - Checking (Purchase) or Obtaining (Sale) Alterations Documentation",
        "feeDescription": "Undertaking work to check for validity (for buyer), or to obtain (for seller) alterations documents.",
        "vatable": true,
        "feeType": "fixed",
        "Price (Net of VAT) (£)": 95,
        "Vat": 19,
        "Total": 114
      },
      {
        "feeName": "Same Day Payment (Standard)",
        "feeDescription": "Guaranteed same day telegraphic bank transfer fee",
        "vatable": true,
        "feeType": "fixed",
        "Price (Net of VAT) (£)": 30,
        "Vat": 6,
        "Total": 36
      },
      {
        "feeName": "Discharge of Additional Security",
        "feeDescription": "Work involved in discharging additional securities other than main mortgage account",
        "vatable": true,
        "feeType": "fixed",
        "Price (Net of VAT) (£)": 100,
        "Vat": 20,
        "Total": 120
      },
      {
        "feeName": "Executry Sale or Purchase",
        "feeDescription": "Ensuring adequate links in title in place in executry sale or purchase",
        "vatable": true,
        "feeType": "fixed",
        "Price (Net of VAT) (£)": 125,
        "Vat": 25,
        "Total": 150
      },
      {
        "feeName": "Expedited Date of Entry",
        "feeDescription": "Date of Entry less than 6 weeks from agreeing sale or purchase",
        "vatable": true,
        "feeType": "fixed",
        "Price (Net of VAT) (£)": 95,
        "Vat": 19,
        "Total": 114
      },
      {
        "feeName": "Factored Property",
        "feeDescription": "Liaising with Factor for property on behalf of seller including obtaining apportionment of costs",
        "vatable": true,
        "feeType": "fixed",
        "Price (Net of VAT) (£)": 75,
        "Vat": 15,
        "Total": 90
      },
      {
        "feeName": "First Home Fund - NEW BUILD",
        "feeDescription": "Liaising with solicitors acting for Government and additional administration and paperwork",
        "vatable": true,
        "feeType": "fixed",
        "Price (Net of VAT) (£)": 195,
        "Vat": 39,
        "Total": 234
      },
      {
        "feeName": "First Home Fund - PRIVATE CLIENT",
        "feeDescription": "Liaising with solicitors acting for Government and additional administration and paperwork",
        "vatable": true,
        "feeType": "fixed",
        "Price (Net of VAT) (£)": 250,
        "Vat": 50,
        "Total": 300
      },
      {
        "feeName": "First Registration/Property Not in Land Register",
        "feeDescription": "Work involved in applying to enter property into Land Register for the first time for buyer or obtaining additional reports and ensuring burdens present for seller",
        "vatable": true,
        "feeType": "fixed",
        "Price (Net of VAT) (£)": 125,
        "Vat": 25,
        "Total": 150
      },
      {
        "feeName": "Gifted Deposit",
        "feeDescription": "Undertaking Enhanced Client Due Diligence on Gifter of purchase funds",
        "vatable": true,
        "feeType": "fixed",
        "Price (Net of VAT) (£)": 95,
        "Vat": 19,
        "Total": 114
      },
      {
        "feeName": "Gifted Deposit - ID Checks",
        "feeDescription": "ID Checks have to be undertaken on any parties gifting funds towards a property purchase. Per person gifting.",
        "vatable": true,
        "feeType": "fixed",
        "Price (Net of VAT) (£)": 10,
        "Vat": 2,
        "Total": 12
      },
      {
        "feeName": "Help to Buy - NEW BUILD",
        "feeDescription": "Liaising with solicitors acting for Government and additional administration and paperwork",
        "vatable": true,
        "feeType": "fixed",
        "Price (Net of VAT) (£)": 195,
        "Vat": 39,
        "Total": 234
      },
      {
        "feeName": "Help to Buy - PRIVATE CLIENT",
        "feeDescription": "Liaising with solicitors acting for Government and additional administration and paperwork",
        "vatable": true,
        "feeType": "fixed",
        "Price (Net of VAT) (£)": 250,
        "Vat": 50,
        "Total": 300
      },
      {
        "feeName": "Help to Buy ISA",
        "feeDescription": "Liaising with ISA provider and Bonus Application. Fee per Help to Buy Scheme Rules.",
        "vatable": true,
        "feeType": "fixed",
        "Price (Net of VAT) (£)": 50,
        "Vat": 10,
        "Total": 60
      },
      {
        "feeName": "Liaising with Joint Valuation Board for Rateable Value Certificate",
        "feeDescription": "",
        "vatable": true,
        "feeType": "fixed",
        "Price (Net of VAT) (£)": 75,
        "Vat": 15,
        "Total": 90
      },
      {
        "feeName": "Lifetime ISA",
        "feeDescription": "",
        "vatable": true,
        "feeType": "fixed",
        "Price (Net of VAT) (£)": 75,
        "Vat": 15,
        "Total": 90
      },
      {
        "feeName": "Shared Equity Purchase - NEW BUILD",
        "feeDescription": "Liaising with various additional parties and additional legal paperwork",
        "vatable": true,
        "feeType": "fixed",
        "Price (Net of VAT) (£)": 195,
        "Vat": 39,
        "Total": 234
      },
      {
        "feeName": "Shared Equity Purchase - PRIVATE CLIENT",
        "feeDescription": "Liaising with various additional parties and additional legal paperwork",
        "vatable": true,
        "feeType": "fixed",
        "Price (Net of VAT) (£)": 250,
        "Vat": 50,
        "Total": 300
      },
      {
        "feeName": "Taking Instructions from Multiple Parties",
        "feeDescription": "Taking separate instructions from two or more individuals on a purchase or sale",
        "vatable": true,
        "feeType": "fixed",
        "Price (Net of VAT) (£)": 95,
        "Vat": 19,
        "Total": 114
      },
      {
        "feeName": "Title Indemnity - Approving (Sale) or Advising on (Purchase) Title Indemnity Policy",
        "feeDescription": "If title issue may prevent or delay a sale or purchase, Indemnity Policy may allow it to proceed. Not including cost of insurance policy.",
        "vatable": true,
        "feeType": "fixed",
        "Price (Net of VAT) (£)": 95,
        "Vat": 19,
        "Total": 114
      },
      {
        "feeName": "Unreasonable Missive Delays or Unusually Complex Missives",
        "feeDescription": "Non-standard, protracted contract negotiations with solicitor acting for your seller or buyer.",
        "vatable": true,
        "feeType": "fixed",
        "Price (Net of VAT) (£)": 95,
        "Vat": 19,
        "Total": 114
      },
      {
        "feeName": "Using a Separate Solicitor Firm for Purchase or Sale",
        "feeDescription": "Liaising with separate solicitor acting for you e.g. if using different firm for purchase and sale",
        "vatable": true,
        "feeType": "fixed",
        "Price (Net of VAT) (£)": 95,
        "Vat": 19,
        "Total": 114
      }        
    ]
  },
  "outlays": [  
    {
      "feeName": "Multisearch (FSSS) (Legacy Pricing)",
      "feeDescription": "Multisearch ordered from and paid to First Scottish Searching Services. This was charged when conveyancing was quoted as a 'bundled' price (e.g. \"£999 including VAT and Standard Outlays\")",
      "vatable": false,
      "feeType": "fixed",
      "Price (Net of VAT) (£)": "115",
      "Vat": "No Vat",
      "Total": "115"
    },
    {
      "feeName": "Multisearch (FSSS) (Current Pricing)",
      "feeDescription": "Multisearch ordered from and paid to First Scottish Searching Services",
      "vatable": false,
      "feeType": "fixed",
      "Price (Net of VAT) (£)": "195",
      "Vat": "No Vat",
      "Total": "195"
    },
    {
      "feeName": "Dues of Discharge of Standard Security",
      "feeDescription": "Registration of Discharge of Standard Security ordered from and paid to Registers of Scotland",
      "vatable": false,
      "feeType": "fixed",
      "Price (Net of VAT) (£)": "80",
      "Vat": "No Vat",
      "Total": "80"
    },
    {
      "feeName": "Advance Notice",
      "feeDescription": "Advance Notice ordered from and paid to Registers of Scotland",
      "vatable": false,
      "feeType": "fixed",
      "Price (Net of VAT) (£)": "20",
      "Vat": "No Vat",
      "Total": "20"
    },
    {
      "feeName": "E-Discharge dues of Standard Security",
      "feeDescription": "E-Discharge ordered from and paid to Registers of Scotland",
      "vatable": false,
      "feeType": "fixed",
      "Price (Net of VAT) (£)": "60",
      "Vat": "No Vat",
      "Total": "60"
    },
    {
      "feeName": "Dues of Disposition",
      "feeDescription": "Disposition ordered from and paid to Registers of Scotland",
      "vatable": false,
      "feeType": "fixed",
      "Price (Net of VAT) (£)": "0",
      "Vat": "No Vat",
      "Total": "0"
    },
    {
      "feeName": "Discharge of Inhibition",
      "feeDescription": "Discharge of Inhibition ordered from and paid to Registers of Scotland",
      "vatable": false,
      "feeType": "fixed",
      "Price (Net of VAT) (£)": "15",
      "Vat": "No Vat",
      "Total": "15"
    },
    {
      "feeName": "Rejection Charge",
      "feeDescription": "Rejection Charge ordered from and paid to Registers of Scotland",
      "vatable": false,
      "feeType": "fixed",
      "Price (Net of VAT) (£)": "30",
      "Vat": "No Vat",
      "Total": "30"
    },
    {
      "feeName": "Coal Report - Residential",
      "feeDescription": "Coal Report - Residential ordered from and paid to First Scottish Searching Services",
      "vatable": false,
      "feeType": "fixed",
      "Price (Net of VAT) (£)": "55",
      "Vat": "No Vat",
      "Total": "55"
    },
    {
      "feeName": "Interperative Coal Report",
      "feeDescription": "Interperative Coal Report ordered from and paid to First Scottish Searching Services",
      "vatable": false,
      "feeType": "fixed",
      "Price (Net of VAT) (£)": "208",
      "Vat": "No Vat",
      "Total": "208"
    },
    {
      "feeName": "Coal Report - Commercial",
      "feeDescription": "Coal Report - Commercial ordered from and paid to First Scottish Searching Services",
      "vatable": false,
      "feeType": "fixed",
      "Price (Net of VAT) (£)": "163",
      "Vat": "No Vat",
      "Total": "163"
    },
    {
      "feeName": "Level 3 Plans Report",
      "feeDescription": "Level 3 Plans Report ordered from and paid to First Scottish Searching Services",
      "vatable": false,
      "feeType": "fixed",
      "Price (Net of VAT) (£)": "115",
      "Vat": "No Vat",
      "Total": "115"
    },
    {
      "feeName": "Copy Deed",
      "feeDescription": "Copy Deed ordered from and paid to First Scottish Searching Services",
      "vatable": false,
      "feeType": "fixed",
      "Price (Net of VAT) (£)": "35",
      "Vat": "No Vat",
      "Total": "35"
    },
    {
      "feeName": "Claims History Report",
      "feeDescription": "Claims History Report ordered from and paid to First Scottish Searching Services",
      "vatable": false,
      "feeType": "fixed",
      "Price (Net of VAT) (£)": "494",
      "Vat": "No Vat",
      "Total": "494"
    },
    {
      "feeName": "Deed Plan",
      "feeDescription": "Deed Plan ordered from and paid to First Scottish Searching Services",
      "vatable": false,
      "feeType": "fixed",
      "Price (Net of VAT) (£)": "117",
      "Vat": "No Vat",
      "Total": "117"
    },
    {
      "feeName": "Charges Search and Company Report",
      "feeDescription": "Charges Search and Company Report ordered from and paid to First Scottish Searching Services",
      "vatable": false,
      "feeType": "fixed",
      "Price (Net of VAT) (£)": "86",
      "Vat": "No Vat",
      "Total": "86"
    },
    {
      "feeName": "Register of Charge and Full Company Report",
      "feeDescription": "Register of Charge and Full Company Report ordered from and paid to First Scottish Searching Services",
      "vatable": false,
      "feeType": "fixed",
      "Price (Net of VAT) (£)": "94",
      "Vat": "No Vat",
      "Total": "94"
    },
    {
      "feeName": "Update Charges and Full Company Report",
      "feeDescription": "Update Charges and Full Company Report ordered from and paid to First Scottish Searching Services",
      "vatable": false,
      "feeType": "fixed",
      "Price (Net of VAT) (£)": "47",
      "Vat": "No Vat",
      "Total": "47"
    },
    {
      "feeName": "Update Charges and Company Report",
      "feeDescription": "Update Charges and Company Report ordered from and paid to First Scottish Searching Services",
      "vatable": false,
      "feeType": "fixed",
      "Price (Net of VAT) (£)": "39",
      "Vat": "No Vat",
      "Total": "39"
    },
    {
      "feeName": "Update Charges Search",
      "feeDescription": "Update Charges Search ordered from and paid to First Scottish Searching Services",
      "vatable": false,
      "feeType": "fixed",
      "Price (Net of VAT) (£)": "32.5",
      "Vat": "No Vat",
      "Total": "32.5"
    },
    {
      "feeName": "Legal Report - Registered",
      "feeDescription": "Legal Report Registered ordered from and paid to First Scottish Searching Services",
      "vatable": false,
      "feeType": "fixed",
      "Price (Net of VAT) (£)": "99",
      "Vat": "No Vat",
      "Total": "99"
    },
    {
      "feeName": "Legal Report - Unregistered",
      "feeDescription": "Legal Report Unregistered ordered from and paid to First Scottish Searching Services",
      "vatable": false,
      "feeType": "fixed",
      "Price (Net of VAT) (£)": "99",
      "Vat": "No Vat",
      "Total": "99"
    },
    {
      "feeName": "Legal Report - Registered - No Continuation",
      "feeDescription": "Legal Report Registered No Continuation ordered from and paid to First Scottish Searching Services",
      "vatable": false,
      "feeType": "fixed",
      "Price (Net of VAT) (£)": "65",
      "Vat": "No Vat",
      "Total": "65"
    },
    {
      "feeName": "Continuation - Registered",
      "feeDescription": "Continuation Registered ordered from and paid to First Scottish Searching Services",
      "vatable": false,
      "feeType": "fixed",
      "Price (Net of VAT) (£)": "40",
      "Vat": "No Vat",
      "Total": "40"
    },
    {
      "feeName": "Continuation - Unregistered",
      "feeDescription": "Continuation Unregistered ordered from and paid to First Scottish Searching Services",
      "vatable": false,
      "feeType": "fixed",
      "Price (Net of VAT) (£)": "40",
      "Vat": "No Vat",
      "Total": "40"
    },
    {
      "feeName": "Register of Charges Search",
      "feeDescription": "Register of Charges Search ordered from and paid to First Scottish Searching Services",
      "vatable": false,
      "feeType": "fixed",
      "Price (Net of VAT) (£)": "72",
      "Vat": "No Vat",
      "Total": "72"
    },
    {
      "feeName": "Building Warrant and Certificate of Completion",
      "feeDescription": "Building Warrant and Certificate of completion (per property) ordered from and paid to City of Edinburgh Council",
      "vatable": false,
      "feeType": "fixed",
      "Price (Net of VAT) (£)": "63.5",
      "Vat": "No Vat",
      "Total": "63.5"
    },
    {
      "feeName": "Building Warrant and Certificate of Completion",
      "feeDescription": "Building Warrant and Certificate of completion (per property) ordered from and paid to City of Edinburgh Council",
      "vatable": false,
      "feeType": "fixed",
      "Price (Net of VAT) (£)": "69",
      "Vat": "No Vat",
      "Total": "69"
    },
    {
      "feeName": "Building Warrant and Certificate of Completion",
      "feeDescription": "Building Warrant and Certificate of completion (per property) ordered from and paid to City of Edinburgh Council",
      "vatable": false,
      "feeType": "fixed",
      "Price (Net of VAT) (£)": "82",
      "Vat": "No Vat",
      "Total": "82"
    },
    {
      "feeName": "Building Warrant and Certificate of Completion",
      "feeDescription": "Building Warrant and Certificate of completion (per property) ordered from and paid to City of Edinburgh Council",
      "vatable": false,
      "feeType": "fixed",
      "Price (Net of VAT) (£)": "100",
      "Vat": "No Vat",
      "Total": "100"
    },
    {
      "feeName": "Building Warrant and Certificate of Completion",
      "feeDescription": "Building Warrant and Certificate of completion (per property) ordered from and paid to City of Edinburgh Council",
      "vatable": false,
      "feeType": "fixed",
      "Price (Net of VAT) (£)": "120",
      "Vat": "No Vat",
      "Total": "120"
    },
    {
      "feeName": "Building Warrant and Certificate of Completion",
      "feeDescription": "Building Warrant and Certificate of completion (per property) ordered from and paid to City of Edinburgh Council",
      "vatable": false,
      "feeType": "fixed",
      "Price (Net of VAT) (£)": "156.5",
      "Vat": "No Vat",
      "Total": "156.5"
    },
    {
      "feeName": "Building Warrant and Certificate of Completion",
      "feeDescription": "Building Warrant and Certificate of completion (per property) ordered from and paid to City of Edinburgh Council",
      "vatable": false,
      "feeType": "fixed",
      "Price (Net of VAT) (£)": "182",
      "Vat": "No Vat",
      "Total": "182"
    },
    {
      "feeName": "Building Warrant and Certificate of Completion",
      "feeDescription": "Building Warrant and Certificate of completion (per property) ordered from and paid to City of Edinburgh Council",
      "vatable": false,
      "feeType": "fixed",
      "Price (Net of VAT) (£)": "271",
      "Vat": "No Vat",
      "Total": "271"
    },
    {
      "feeName": "Building Warrant and Certificate of Completion",
      "feeDescription": "Building Warrant and Certificate of completion (per property) ordered from and paid to City of Edinburgh Council",
      "vatable": false,
      "feeType": "fixed",
      "Price (Net of VAT) (£)": "367.5",
      "Vat": "No Vat",
      "Total": "367.5"
    },
    {
      "feeName": "A4 Plan Copy",
      "feeDescription": "A4 Plan Copy ordered from and paid to City of Edinburgh Council",
      "vatable": false,
      "feeType": "fixed",
      "Price (Net of VAT) (£)": "0.65",
      "Vat": "No Vat",
      "Total": "0.65"
    },
    {
      "feeName": "A3 Plan Copy",
      "feeDescription": "A3 Plan Copy ordered from and paid to City of Edinburgh Council",
      "vatable": false,
      "feeType": "fixed",
      "Price (Net of VAT) (£)": "1.3",
      "Vat": "No Vat",
      "Total": "1.3"
    },
    {
      "feeName": "A2 Plan Copy",
      "feeDescription": "A2 Plan Copy ordered from and paid to City of Edinburgh Council",
      "vatable": false,
      "feeType": "fixed",
      "Price (Net of VAT) (£)": "2.5",
      "Vat": "No Vat",
      "Total": "2.5"
    },
    {
      "feeName": "A1 Plan Copy",
      "feeDescription": "A1 Plan Copy ordered from and paid to City of Edinburgh Council",
      "vatable": false,
      "feeType": "fixed",
      "Price (Net of VAT) (£)": "3.75",
      "Vat": "No Vat",
      "Total": "3.75"
    },
    {
      "feeName": "A0 Plan Copy",
      "feeDescription": "A0 Plan Copy ordered from and paid to City of Edinburgh Council",
      "vatable": false,
      "feeType": "fixed",
      "Price (Net of VAT) (£)": "6.5",
      "Vat": "No Vat",
      "Total": "6.5"
    },
    {
      "feeName": "Inspection Report",
      "feeDescription": "Inspection Report ordered from and paid to A.W.A",
      "vatable": false,
      "feeType": "fixed",
      "Price (Net of VAT) (£)": "Varies",
      "Vat": "No Vat",
      "Total": "Varies"
    },
    {
      "feeName": "Consultancy Work",
      "feeDescription": "Consultancy work ordered from and paid to A.W.A",
      "vatable": false,
      "feeType": "fixed",
      "Price (Net of VAT) (£)": "Varies",
      "Vat": "No Vat",
      "Total": "Varies"
    },
    {
      "feeName": "Discharge of Shared Equity Admin Fee",
      "feeDescription": "Discharge of Shared Equity Admin Fee ordered from and paid to Hamilton Mortgage Services Ltd",
      "vatable": false,
      "feeType": "fixed",
      "Price (Net of VAT) (£)": "s",
      "Vat": "No Vat",
      "Total": "s"
    },
    {
      "feeName": "Title Indemnity Policy",
      "feeDescription": "Title Indemnity Policy ordered from and paid to DUAL Corporate Risks Ltd",
      "vatable": false,
      "feeType": "fixed",
      "Price (Net of VAT) (£)": "Varies",
      "Vat": "No Vat",
      "Total": "Varies"
    },
    {
      "feeName": "Certificate of Rateable Values",
      "feeDescription": "Certificate of Rateable Values ordered from and paid to Lothian Valuation Joint Board",
      "vatable": false,
      "feeType": "fixed",
      "Price (Net of VAT) (£)": "Varies",
      "Vat": "No Vat",
      "Total": "Varies"
    }
  ]
}
