<?xml version="1.0" encoding="UTF-8" standalone="no"?>
<!-- Created with Inkscape (http://www.inkscape.org/) -->

<svg
   xmlns:dc="http://purl.org/dc/elements/1.1/"
   xmlns:cc="http://creativecommons.org/ns#"
   xmlns:rdf="http://www.w3.org/1999/02/22-rdf-syntax-ns#"
   xmlns:svg="http://www.w3.org/2000/svg"
   xmlns="http://www.w3.org/2000/svg"
   xmlns:sodipodi="http://sodipodi.sourceforge.net/DTD/sodipodi-0.dtd"
   xmlns:inkscape="http://www.inkscape.org/namespaces/inkscape"
   width="256"
   height="300"
   viewBox="0 0 67.733332 79.375002"
   version="1.1"
   id="svg8"
   inkscape:version="0.92.3 (2405546, 2018-03-11)"
   sodipodi:docname="rocket_idle.svg">
  <defs
     id="defs2">
    <inkscape:path-effect
       effect="bspline"
       id="path-effect372"
       is_visible="true"
       weight="33.333333"
       steps="2"
       helper_size="0"
       apply_no_weight="true"
       apply_with_weight="true"
       only_selected="false" />
    <inkscape:path-effect
       effect="bspline"
       id="path-effect350"
       is_visible="true"
       weight="33.333333"
       steps="2"
       helper_size="0"
       apply_no_weight="true"
       apply_with_weight="true"
       only_selected="false" />
    <inkscape:path-effect
       effect="bspline"
       id="path-effect328"
       is_visible="true"
       weight="33.333333"
       steps="2"
       helper_size="0"
       apply_no_weight="true"
       apply_with_weight="true"
       only_selected="false" />
    <inkscape:path-effect
       effect="bspline"
       id="path-effect300"
       is_visible="true"
       weight="33.333333"
       steps="2"
       helper_size="0"
       apply_no_weight="true"
       apply_with_weight="true"
       only_selected="false" />
    <inkscape:path-effect
       effect="bspline"
       id="path-effect239"
       is_visible="true"
       weight="33.333333"
       steps="2"
       helper_size="0"
       apply_no_weight="true"
       apply_with_weight="true"
       only_selected="false" />
    <inkscape:path-effect
       effect="bspline"
       id="path-effect235"
       is_visible="true"
       weight="33.333333"
       steps="2"
       helper_size="0"
       apply_no_weight="true"
       apply_with_weight="true"
       only_selected="false" />
    <inkscape:path-effect
       effect="bspline"
       id="path-effect195"
       is_visible="true"
       weight="33.333333"
       steps="2"
       helper_size="0"
       apply_no_weight="true"
       apply_with_weight="true"
       only_selected="false" />
    <inkscape:path-effect
       effect="bspline"
       id="path-effect191"
       is_visible="true"
       weight="33.333333"
       steps="2"
       helper_size="0"
       apply_no_weight="true"
       apply_with_weight="true"
       only_selected="false" />
    <inkscape:path-effect
       effect="bspline"
       id="path-effect150"
       is_visible="true"
       weight="33.333333"
       steps="2"
       helper_size="0"
       apply_no_weight="true"
       apply_with_weight="true"
       only_selected="false" />
    <inkscape:path-effect
       effect="bspline"
       id="path-effect150-3"
       is_visible="true"
       weight="33.333333"
       steps="2"
       helper_size="0"
       apply_no_weight="true"
       apply_with_weight="true"
       only_selected="false" />
    <inkscape:path-effect
       effect="bspline"
       id="path-effect195-7"
       is_visible="true"
       weight="33.333333"
       steps="2"
       helper_size="0"
       apply_no_weight="true"
       apply_with_weight="true"
       only_selected="false" />
    <inkscape:path-effect
       effect="bspline"
       id="path-effect195-7-3"
       is_visible="true"
       weight="33.333333"
       steps="2"
       helper_size="0"
       apply_no_weight="true"
       apply_with_weight="true"
       only_selected="false" />
    <inkscape:path-effect
       effect="bspline"
       id="path-effect239-6"
       is_visible="true"
       weight="33.333333"
       steps="2"
       helper_size="0"
       apply_no_weight="true"
       apply_with_weight="true"
       only_selected="false" />
    <inkscape:path-effect
       effect="bspline"
       id="path-effect239-9"
       is_visible="true"
       weight="33.333333"
       steps="2"
       helper_size="0"
       apply_no_weight="true"
       apply_with_weight="true"
       only_selected="false" />
    <inkscape:path-effect
       effect="bspline"
       id="path-effect328-2"
       is_visible="true"
       weight="33.333333"
       steps="2"
       helper_size="0"
       apply_no_weight="true"
       apply_with_weight="true"
       only_selected="false" />
    <inkscape:path-effect
       effect="bspline"
       id="path-effect350-0"
       is_visible="true"
       weight="33.333333"
       steps="2"
       helper_size="0"
       apply_no_weight="true"
       apply_with_weight="true"
       only_selected="false" />
  </defs>
  <sodipodi:namedview
     id="base"
     pagecolor="#ffffff"
     bordercolor="#666666"
     borderopacity="1.0"
     inkscape:pageopacity="0.0"
     inkscape:pageshadow="2"
     inkscape:zoom="1.979899"
     inkscape:cx="223.79723"
     inkscape:cy="136.23798"
     inkscape:document-units="mm"
     inkscape:current-layer="layer1"
     showgrid="true"
     inkscape:window-width="1872"
     inkscape:window-height="1012"
     inkscape:window-x="48"
     inkscape:window-y="32"
     inkscape:window-maximized="1"
     units="px">
    <inkscape:grid
       type="xygrid"
       id="grid82" />
  </sodipodi:namedview>
  <metadata
     id="metadata5">
    <rdf:RDF>
      <cc:Work
         rdf:about="">
        <dc:format>image/svg+xml</dc:format>
        <dc:type
           rdf:resource="http://purl.org/dc/dcmitype/StillImage" />
        <dc:title></dc:title>
      </cc:Work>
    </rdf:RDF>
  </metadata>
  <g
     inkscape:label="Layer 1"
     inkscape:groupmode="layer"
     id="layer1"
     transform="translate(0,-217.62498)">
    <path
       style="fill:none;stroke:#000000;stroke-width:0.26458332px;stroke-linecap:butt;stroke-linejoin:miter;stroke-opacity:1"
       d="m 26.590625,271.19407 c -0.176393,-10.35173 -0.352782,-20.70319 0.881977,-28.96568 1.23476,-8.26248 3.880661,-14.43625 6.526356,-20.60954"
       id="path148"
       inkscape:connector-curvature="0"
       inkscape:path-effect="#path-effect150"
       inkscape:original-d="m 26.590625,271.19407 c -0.176124,-10.35173 -0.352513,-20.70319 -0.529167,-31.05439 2.646032,-6.17372 5.291931,-12.34749 7.9375,-18.52083"
       sodipodi:nodetypes="ccc" />
    <path
       style="fill:none;stroke:#000000;stroke-width:0.26458332px;stroke-linecap:butt;stroke-linejoin:miter;stroke-opacity:1"
       d="m 41.142709,271.19407 c 0.26459,-10.35174 0.529174,-20.7032 -0.66149,-28.96568 -1.190664,-8.26248 -3.836565,-14.43625 -6.48226,-20.60954"
       id="path148-6"
       inkscape:connector-curvature="0"
       inkscape:path-effect="#path-effect150-3"
       inkscape:original-d="m 41.142709,271.19407 c 0.264848,-10.35173 0.529431,-20.70319 0.79375,-31.05439 -2.646032,-6.17372 -5.291931,-12.34749 -7.9375,-18.52083"
       sodipodi:nodetypes="ccc" />
    <path
       style="fill:none;stroke:#000000;stroke-width:0.26458332px;stroke-linecap:butt;stroke-linejoin:miter;stroke-opacity:1"
       d="m 28.707291,236.17093 c 1.764077,0.44102 3.527964,0.88199 5.291822,0.88195 1.763858,-3e-5 3.527933,-0.44105 5.291512,-0.88195"
       id="path189"
       inkscape:connector-curvature="0"
       inkscape:path-effect="#path-effect191"
       inkscape:original-d="m 28.707291,236.17093 c 1.764155,0.44071 3.528042,0.88168 5.291667,1.32292 1.763967,-0.44119 3.528042,-0.88221 5.291667,-1.32292" />
    <path
       style="fill:none;stroke:#000000;stroke-width:0.52916682px;stroke-linecap:butt;stroke-linejoin:miter;stroke-opacity:1"
       d="m 33.998959,242.78552 c -1.763615,-2.6e-4 -3.527513,1.76363 -3.527514,3.52805 -10e-7,1.76442 1.76336,3.52778 3.527514,3.52752 1.764153,-2.7e-4 3.528039,-1.76416 3.528039,-3.52752 -10e-7,-1.76336 -1.764424,-3.52778 -3.528039,-3.52805 z"
       id="path193"
       inkscape:connector-curvature="0"
       inkscape:path-effect="#path-effect195"
       inkscape:original-d="m 33.998694,241.02191 c -1.763358,1.76334 -3.527251,3.52724 -5.291667,5.29166 1.764946,1.76389 3.528309,3.52725 5.291667,5.29167 1.764417,-1.76442 3.52831,-3.5283 5.291668,-5.29167 -1.762828,-1.7639 -3.527251,-3.52832 -5.291668,-5.29166 z" />
    <path
       style="fill:none;stroke:#000000;stroke-width:0.26458332px;stroke-linecap:butt;stroke-linejoin:miter;stroke-opacity:1"
       d="m 26.590625,271.19407 c 2.469624,0.67289 4.939067,1.34574 7.364386,1.34569 2.425319,-4e-5 4.806761,-0.67294 7.187698,-1.34569"
       id="path233"
       inkscape:connector-curvature="0"
       inkscape:path-effect="#path-effect235"
       inkscape:original-d="m 26.590625,271.19407 c 2.469709,0.67258 4.939153,1.34542 7.408333,2.01853 2.381323,-0.67305 4.762765,-1.34595 7.143751,-2.01853"
       sodipodi:nodetypes="ccc" />
    <path
       style="fill:none;stroke:#000000;stroke-width:0.41402772px;stroke-linecap:butt;stroke-linejoin:miter;stroke-opacity:1"
       d="m 26.590625,252.67324 c -2.159114,1.32261 -4.318729,2.64553 -5.758776,7.60739 -1.440046,4.96187 -2.159748,13.55885 -2.159616,17.19681 1.32e-4,3.63797 0.719969,2.31511 1.439708,0.99244 0.719738,-1.32268 1.439868,-2.64608 2.51952,-3.85849 1.079652,-1.21242 2.519907,-2.31525 3.959164,-3.41732"
       id="path237"
       inkscape:connector-curvature="0"
       inkscape:path-effect="#path-effect239"
       inkscape:original-d="m 26.590625,252.67324 c -2.159176,1.32251 -4.318784,2.64544 -6.478823,3.96874 -0.719603,8.60055 -1.439305,17.19753 -2.159607,25.7969 0.720336,-1.32338 1.440169,-2.64624 2.159607,-3.96875 0.720043,-1.32284 1.440168,-2.64624 2.159608,-3.96875 1.439672,-1.10245 2.879929,-2.20528 4.319215,-3.30731"
       sodipodi:nodetypes="cccccc" />
    <path
       style="fill:none;stroke:#000000;stroke-width:0.41402772px;stroke-linecap:butt;stroke-linejoin:miter;stroke-opacity:1"
       d="m 41.142709,252.67324 c 2.159114,1.32261 4.318729,2.64553 5.758776,7.60739 1.440046,4.96187 2.159748,13.55885 2.159616,17.19681 -1.32e-4,3.63797 -0.719969,2.31511 -1.439708,0.99244 -0.719738,-1.32268 -1.439868,-2.64608 -2.51952,-3.85849 -1.079652,-1.21242 -2.519907,-2.31525 -3.959164,-3.41732"
       id="path237-1"
       inkscape:connector-curvature="0"
       inkscape:path-effect="#path-effect239-9"
       inkscape:original-d="m 41.142709,252.67324 c 2.159176,1.32251 4.318784,2.64544 6.478823,3.96874 0.719603,8.60055 1.439305,17.19753 2.159607,25.7969 -0.720336,-1.32338 -1.440169,-2.64624 -2.159607,-3.96875 -0.720043,-1.32284 -1.440168,-2.64624 -2.159608,-3.96875 -1.439672,-1.10245 -2.879929,-2.20528 -4.319215,-3.30731"
       sodipodi:nodetypes="cccccc" />
    <path
       style="fill:#ff0000;stroke-width:0.03340869"
       d="m 32.846264,236.84484 c -0.605169,-0.0599 -1.346515,-0.18194 -2.120675,-0.34918 -0.759527,-0.16408 -1.799239,-0.41539 -1.824972,-0.44113 -0.03762,-0.0376 0.580319,-2.20918 1.005165,-3.53233 0.750443,-2.3372 1.78934,-5.08023 3.100779,-8.18706 0.833644,-1.97492 0.974694,-2.30219 0.99246,-2.30274 0.01723,-5.3e-4 0.09511,0.18029 0.991738,2.30274 1.90091,4.49973 3.088312,7.85687 4.015116,11.35192 l 0.0995,0.37524 -0.122774,0.0328 c -0.735804,0.19686 -2.16674,0.50774 -2.846478,0.61842 -1.128083,0.18368 -2.291104,0.23008 -3.289863,0.13128 z"
       id="path284"
       inkscape:connector-curvature="0" />
    <path
       style="fill:#0000ff;stroke-width:0.03340869"
       d="m 32.71263,236.81406 c -0.793038,-0.0867 -1.852705,-0.28934 -3.165474,-0.60532 -0.369443,-0.0889 -0.626346,-0.16677 -0.626248,-0.18976 2.65e-4,-0.0793 0.271671,-1.07132 0.568058,-2.07691 0.637534,-2.16306 1.450641,-4.46417 2.532194,-7.16616 0.721546,-1.80261 1.937142,-4.67722 1.977867,-4.67722 0.06187,0 1.842336,4.2848 2.582108,6.21402 0.640313,1.66984 1.36275,3.76887 1.811004,5.26186 0.2125,0.70777 0.684845,2.40215 0.684845,2.45665 0,0.0328 -1.013685,0.27965 -1.971111,0.47994 -0.769959,0.16108 -1.421681,0.26312 -2.03793,0.31906 -0.518443,0.0471 -1.861298,0.0378 -2.355313,-0.0162 z"
       id="path286"
       inkscape:connector-curvature="0" />
    <path
       style="fill:#ffffff;stroke-width:0.09449405"
       d="m 32.187319,272.25636 c -0.887431,-0.10068 -2.618354,-0.46154 -4.155644,-0.86635 l -1.179078,-0.31048 -0.07603,-0.42218 c -0.128535,-0.71373 -0.121507,-16.11597 0.0085,-18.70678 0.216228,-4.30786 0.474226,-7.10863 0.922679,-10.01637 0.230002,-1.49133 0.76287,-4.19199 1.008769,-5.11261 l 0.116231,-0.43516 1.133928,0.2682 c 3.096979,0.73248 4.878056,0.73363 8.041531,0.005 l 1.143466,-0.26331 0.203536,0.85535 c 0.9463,3.97678 1.55843,9.00382 1.678429,13.78392 0.02585,1.03002 0.07247,1.93909 0.103574,2.02016 0.06958,0.18132 -0.06218,15.2136 -0.147617,16.84082 l -0.06161,1.17348 -0.944941,0.26463 c -3.215169,0.90043 -5.549482,1.17636 -7.795758,0.92151 z M 35.45763,249.7792 c 1.527741,-0.7521 2.535081,-2.39706 2.354246,-3.84443 -0.147785,-1.18283 -1.176255,-2.52707 -2.383993,-3.11594 -0.475719,-0.23195 -0.658964,-0.26717 -1.397932,-0.26868 -0.763902,-0.002 -0.91585,0.0292 -1.493157,0.30269 -0.804741,0.38116 -1.63035,1.18787 -2.009437,1.96343 -0.250229,0.51193 -0.277129,0.65868 -0.277148,1.5119 -1.6e-5,0.81244 0.03146,1.00457 0.224459,1.37017 0.612963,1.16112 1.391513,1.87078 2.466062,2.24784 0.842063,0.29548 1.692061,0.23909 2.5169,-0.16698 z"
       id="path288"
       inkscape:connector-curvature="0" />
    <path
       style="fill:#ffffff;stroke-width:0.09449405"
       d="m 32.187319,272.25636 c -0.868328,-0.0985 -2.582296,-0.45504 -4.154525,-0.86419 -1.156946,-0.30108 -1.179031,-0.31183 -1.2378,-0.60235 -0.03291,-0.16269 -0.08939,-2.90538 -0.125524,-6.09487 -0.126766,-11.1912 0.234075,-18.25603 1.220441,-23.89468 0.199668,-1.14142 0.876224,-4.35715 0.927685,-4.40938 0.0084,-0.008 0.525452,0.10576 1.149112,0.25386 3.071826,0.72946 4.773676,0.74146 7.845832,0.0553 0.752036,-0.16796 1.367338,-0.29381 1.367338,-0.27968 0,0.0141 0.131418,0.61206 0.292042,1.32871 0.768881,3.43054 1.187791,6.61996 1.52396,11.60286 0.137903,2.04409 0.14659,18.01734 0.01106,20.35458 l -0.07893,1.36126 -0.944941,0.2688 c -3.148031,0.89549 -5.531236,1.17666 -7.795757,0.91974 z m 2.768597,-22.29118 c 1.452137,-0.44851 2.627487,-1.81143 2.851735,-3.30682 0.20189,-1.34631 -0.900621,-3.12181 -2.384131,-3.83944 -0.467765,-0.22628 -0.661348,-0.26327 -1.395236,-0.26662 -0.778729,-0.004 -0.907219,0.0232 -1.49199,0.31096 -0.808541,0.39785 -1.559505,1.12707 -1.967585,1.91063 -0.29505,0.56653 -0.317391,0.67257 -0.317934,1.50902 -5.29e-4,0.82195 0.02556,0.9528 0.302035,1.51439 0.513649,1.04337 1.565265,1.93132 2.626696,2.21789 0.665475,0.17966 1.069663,0.16829 1.77641,-0.05 z"
       id="path290"
       inkscape:connector-curvature="0" />
    <path
       style="fill:#0000ff;stroke-width:0.09449405"
       d="m 19.00013,279.01366 c -0.09749,-0.78028 0.01625,-4.86224 0.191942,-6.88861 0.494319,-5.70125 1.378914,-10.64253 2.360041,-13.18299 1.045463,-2.70705 2.262525,-4.21867 4.587586,-5.69791 l 0.236236,-0.15029 -0.0069,8.98148 -0.0069,8.98148 -0.512839,0.38719 c -1.118812,0.8447 -2.664633,2.19038 -3.257332,2.83559 -0.752419,0.81908 -1.58222,2.04893 -2.499198,3.70408 -0.374311,0.67563 -0.757705,1.30852 -0.851988,1.40641 -0.166494,0.17287 -0.173414,0.16205 -0.240692,-0.37643 z"
       id="path292"
       inkscape:connector-curvature="0" />
    <path
       style="fill:#0000ff;stroke-width:0.09449405"
       d="m 48.179825,278.91856 c -0.208732,-0.35827 -0.645001,-1.11914 -0.969483,-1.69083 -0.324483,-0.57169 -0.835139,-1.37962 -1.134788,-1.79539 -0.671935,-0.93233 -2.245965,-2.47169 -3.665214,-3.58448 l -1.069015,-0.83818 0.07683,-3.78904 c 0.04226,-2.08398 0.07683,-6.09382 0.07683,-8.91078 v -5.12173 l 0.236236,0.1504 c 3.189023,2.03042 4.61741,4.63819 5.709565,10.4238 0.80758,4.27809 1.478275,11.38265 1.352728,14.32923 -0.06659,1.56279 -0.132919,1.65218 -0.613686,0.827 z"
       id="path294"
       inkscape:connector-curvature="0" />
    <path
       style="fill:#00ffff;stroke-width:0.09449405"
       d="m 32.870322,249.25995 c -0.273994,-0.12756 -0.723884,-0.4454 -0.999754,-0.7063 -1.395826,-1.32012 -1.418178,-3.08013 -0.05641,-4.4419 1.324964,-1.32496 3.041824,-1.31907 4.371935,0.015 0.730192,0.73237 0.962819,1.26615 0.959411,2.20143 -0.0033,0.90835 -0.248833,1.46509 -0.959517,2.17577 -0.959231,0.95923 -2.247971,1.25308 -3.315663,0.756 z"
       id="path296"
       inkscape:connector-curvature="0" />
    <path
       style="fill:none;stroke:#000000;stroke-width:0.26458332px;stroke-linecap:butt;stroke-linejoin:miter;stroke-opacity:1"
       d="m 26.590625,271.19407 c -0.440813,0.88163 -0.881786,1.76358 -0.440524,2.20471 0.441263,0.44113 1.763703,0.44113 3.208999,1.1026 1.445297,0.66147 3.013211,1.98438 4.556742,1.98425 1.54353,-1.3e-4 3.062424,-1.32305 4.483319,-1.98438 1.420895,-0.66134 2.743816,-0.66134 3.184707,-1.10221 0.440892,-0.44086 -2.41e-4,-1.32313 -0.44116,-2.20497"
       id="path298"
       inkscape:connector-curvature="0"
       inkscape:path-effect="#path-effect300"
       inkscape:original-d="m 26.590625,271.19407 c -0.440708,0.88168 -0.88168,1.76363 -1.322917,2.64584 1.323656,-2.7e-4 2.646096,-2.7e-4 3.968751,0 1.56818,1.32265 3.136092,2.64557 4.703741,3.96875 1.519156,-1.32318 3.038048,-2.6461 4.556675,-3.96875 1.323181,-2.7e-4 2.646102,-2.7e-4 3.96875,0 -0.44055,-0.88189 -0.881679,-1.76416 -1.322917,-2.64584"
       sodipodi:nodetypes="ccccccc" />
    <path
       style="fill:none;stroke:#000000;stroke-width:0.26458332px;stroke-linecap:butt;stroke-linejoin:miter;stroke-opacity:1"
       d="m 29.236459,271.98782 c -0.26432,0.26432 -0.528901,0.5289 -0.749545,0.88187 -0.220643,0.35298 -0.396855,0.7935 -0.573372,1.2348"
       id="path326"
       inkscape:connector-curvature="0"
       inkscape:path-effect="#path-effect328"
       inkscape:original-d="m 29.236459,271.98782 c -0.26432,0.26432 -0.528902,0.5289 -0.793751,0.79375 -0.176301,0.44115 -0.35251,0.88168 -0.529166,1.32292"
       sodipodi:nodetypes="ccc" />
    <path
       style="fill:none;stroke:#000000;stroke-width:0.26458332px;stroke-linecap:butt;stroke-linejoin:miter;stroke-opacity:1"
       d="m 38.496875,271.98782 c 0.26432,0.26432 0.528901,0.5289 0.749545,0.88187 0.220643,0.35298 0.396855,0.7935 0.573372,1.2348"
       id="path326-7"
       inkscape:connector-curvature="0"
       inkscape:path-effect="#path-effect328-2"
       inkscape:original-d="m 38.496875,271.98782 c 0.26432,0.26432 0.528902,0.5289 0.793751,0.79375 0.176301,0.44115 0.35251,0.88168 0.529166,1.32292"
       sodipodi:nodetypes="ccc" />
    <path
       style="fill:none;stroke:#000000;stroke-width:0.26458332px;stroke-linecap:butt;stroke-linejoin:miter;stroke-opacity:1"
       d="m 33.734375,272.51699 c -0.08814,0.52886 -0.176339,1.05803 -0.176352,1.71975 -1.3e-5,0.66171 0.08813,1.45501 0.176352,2.249"
       id="path370"
       inkscape:connector-curvature="0"
       inkscape:path-effect="#path-effect372"
       inkscape:original-d="m 33.734375,272.51699 c -0.08793,0.5289 -0.176125,1.05807 -0.264583,1.5875 0.08851,0.79393 0.176654,1.58723 0.264583,2.38125" />
    <path
       style="fill:#666666;stroke-width:0.03340869"
       d="m 27.310101,273.70229 c -0.780891,-0.20475 -1.034078,-0.3226 -1.130744,-0.52631 -0.06921,-0.14584 -0.07056,-0.38414 -0.0036,-0.64223 0.06345,-0.24474 0.399208,-1.01265 0.47793,-1.09308 0.05478,-0.056 0.09521,-0.0487 0.858102,0.15368 0.440338,0.11682 0.943438,0.24788 1.117997,0.29123 0.174561,0.0434 0.331054,0.0901 0.347765,0.10388 0.01672,0.0138 -0.06646,0.12773 -0.184822,0.2532 -0.338889,0.35924 -0.618027,0.82203 -0.87662,1.45337 -0.03352,0.0818 -0.07218,0.12439 -0.111482,0.12271 -0.03309,-10e-4 -0.255611,-0.0538 -0.494485,-0.11645 z"
       id="path374"
       inkscape:connector-curvature="0" />
    <path
       style="fill:#666666;stroke-width:0.03340869"
       d="m 33.323667,276.26991 c -0.128624,-0.0263 -0.346617,-0.0856 -0.484428,-0.1317 -0.366342,-0.12259 -1.294051,-0.58801 -2.021224,-1.01402 -0.899805,-0.52716 -1.590989,-0.86324 -2.166789,-1.05358 -0.569857,-0.18838 -0.540948,-0.10926 -0.255855,-0.70032 0.210815,-0.43705 0.369547,-0.66816 0.723226,-1.05299 l 0.230854,-0.25119 0.183039,0.0414 c 1.285266,0.29046 2.418331,0.46757 3.489655,0.54545 0.275159,0.02 0.50596,0.042 0.512892,0.049 0.0069,0.007 -0.01204,0.19023 -0.04213,0.40732 -0.111025,0.80065 -0.0944,1.83473 0.0477,2.96641 0.01611,0.12836 0.02652,0.23534 0.0231,0.23775 -0.0034,0.002 -0.111432,-0.0171 -0.240053,-0.0435 z"
       id="path376"
       inkscape:connector-curvature="0" />
    <path
       style="fill:#666666;stroke-width:0.03340869"
       d="m 33.859467,276.25179 c -0.0092,-0.0413 -0.04251,-0.33074 -0.07402,-0.64311 -0.0811,-0.8037 -0.08019,-1.94203 0.0021,-2.4922 l 0.06287,-0.42086 0.5719,-0.021 c 1.109014,-0.0407 2.251982,-0.1996 3.523588,-0.48982 l 0.422588,-0.0965 0.211256,0.20666 c 0.383453,0.37511 0.630225,0.74951 0.894318,1.35684 l 0.109384,0.25155 -0.496146,0.17044 c -0.61916,0.21268 -1.12108,0.45962 -2.038453,1.0029 -1.546858,0.91606 -2.336578,1.24707 -2.98109,1.2495 -0.171614,5.3e-4 -0.193196,-0.007 -0.208179,-0.0744 z"
       id="path378"
       inkscape:connector-curvature="0" />
    <path
       style="fill:#666666;stroke-width:0.03340869"
       d="m 39.770954,273.5958 c -0.24712,-0.592 -0.501004,-1.00671 -0.845743,-1.3815 l -0.202869,-0.22054 0.190513,-0.0421 c 0.104783,-0.0231 0.624202,-0.16069 1.154266,-0.3056 0.530061,-0.14492 0.978588,-0.25432 0.996725,-0.24311 0.0466,0.0288 0.314031,0.61352 0.426122,0.9317 0.22891,0.64976 0.154964,0.92961 -0.298556,1.12988 -0.157546,0.0696 -1.198919,0.3568 -1.293606,0.3568 -0.01799,0 -0.07508,-0.10148 -0.126852,-0.22551 z"
       id="path382"
       inkscape:connector-curvature="0" />
    <path
       style="fill:#ff0000;stroke-width:0.13363476"
       d="m 31.774918,236.61419 c -0.54474,-0.0986 -1.396405,-0.27877 -1.892588,-0.40037 l -0.902153,-0.22108 0.262821,-0.95733 c 0.872697,-3.17878 2.431799,-7.40539 4.563735,-12.37192 l 0.195977,-0.45654 0.290634,0.657 c 1.883717,4.25823 4.919006,12.82977 4.641466,13.10731 -0.111736,0.11174 -1.445183,0.41613 -2.828589,0.64569 -1.449043,0.24045 -2.993162,0.23947 -4.331303,-0.003 z"
       id="path384"
       inkscape:connector-curvature="0" />
    <path
       style="fill:#ff0000;stroke-width:0.13363476"
       d="m 19.119209,275.97259 c 0.08646,-4.49539 0.534421,-8.70063 1.358964,-12.75719 0.507572,-2.49714 0.944857,-3.88327 1.751113,-5.55078 0.678071,-1.40239 0.850706,-1.64198 1.973938,-2.73951 0.676985,-0.66149 1.422122,-1.31135 1.655862,-1.44413 l 0.424981,-0.24141 v 8.88657 8.88658 l -1.236122,0.99427 c -1.85156,1.48929 -3.243825,3.02526 -4.242903,4.68082 -0.477745,0.79167 -1.067822,1.7514 -1.311284,2.13275 l -0.442657,0.69335 z"
       id="path386"
       inkscape:connector-curvature="0" />
    <path
       style="fill:#ff0000;stroke-width:0.13363476"
       d="m 47.404644,277.46119 c -0.609074,-1.03013 -1.41591,-2.23535 -1.792968,-2.67826 -0.747686,-0.87828 -2.484133,-2.48443 -3.571771,-3.30377 l -0.68747,-0.51788 0.08251,-1.87089 c 0.04538,-1.02898 0.08273,-5.0167 0.083,-8.8616 l 5.29e-4,-6.99072 0.634765,0.44262 c 1.056401,0.73661 2.385422,2.16659 3.018038,3.24729 1.478042,2.52494 2.582056,7.56526 3.29334,15.03556 0.219488,2.30517 0.33356,6.85941 0.178742,7.13605 -0.108474,0.19383 -0.32354,-0.0906 -1.23867,-1.6384 z"
       id="path388"
       inkscape:connector-curvature="0" />
    <path
       style="fill:#00ffff;stroke-width:0.13363476"
       d="m 32.698536,249.09787 c -1.686893,-1.01128 -2.277202,-2.71599 -1.436968,-4.14974 0.665353,-1.13534 1.604201,-1.71606 2.774347,-1.71606 1.565246,0 3.077705,1.52876 3.069632,3.10272 -0.0055,1.07342 -0.781317,2.21462 -1.896036,2.789 -0.692303,0.35673 -1.893377,0.34433 -2.510975,-0.0259 z"
       id="path390"
       inkscape:connector-curvature="0" />
  </g>
</svg>
