{
    "_id": "IRh6qlZtN7OBKrek",
    "content": "<p>You were educated at a famed Ustalavic academy, such as the University of Lepidstadt or the Sincomakti School of Sciences, and received quality instruction in advanced concepts of mathematics, science, and engineering.</p>\n<p>Choose two ability boosts. One must be to <strong>Intelligence</strong> or <strong>Wisdom</strong>, and one is a free ability boost.</p>\n<p>You're trained in the Crafting skill and the Academia Lore skill. You gain the @Compendium[pf2e.feats-srd.Skill Training]{Skill Training} skill feat.</p>",
    "flags": {},
    "name": "Ustalavic Academic",
    "permission": {
        "default": 0
    }
}
