{
    "_id": "K6hG7nH8yjmbA0Q9",
    "data": {
        "actionCategory": {
            "value": ""
        },
        "actionType": {
            "value": "passive"
        },
        "actions": {
            "value": ""
        },
        "description": {
            "chat": "",
            "unidentified": "",
            "value": "<p>As an illusionist, you use magic to create images, figments, and phantasms to baffle your enemies. You understand that perception is reality. You add one 1st-level illusion spell (such as @Compendium[pf2e.spells-srd.Illusory Object]{Illusory Object}) to your spellbook. You learn the @Compendium[pf2e.spells-srd.Warped Terrain]{Warped Terrain} school spell.</p>"
        },
        "featType": {
            "value": "classfeature"
        },
        "level": {
            "value": "1"
        },
        "prerequisites": {
            "value": ""
        },
        "rarity": {
            "value": "common"
        },
        "source": {
            "value": ""
        },
        "traits": {
            "custom": "",
            "value": [
                "wizard"
            ]
        },
        "usage": {
            "value": "held-in-one-hand"
        }
    },
    "flags": {},
    "img": "systems/pf2e/icons/features/classes/illusion.jpg",
    "name": "Arcane School: Illusion",
    "permission": {
        "default": 0
    },
    "type": "feat"
}
