{
    "_id": "Cy5W8U4yN9P1EvBy",
    "data": {
        "actionCategory": {
            "value": ""
        },
        "actionType": {
            "value": "passive"
        },
        "actions": {
            "value": ""
        },
        "description": {
            "chat": "",
            "unidentified": "",
            "value": "<p>Your healing energies empower attacks. An ally that recovers Hit Points from your <em>lay on hands</em> gains a +1 status bonus to their attack rolls and deals 1 additional good damage on all their @Compendium[pf2e.actionspf2e.Strike]{Strikes} until the end of their next turn.</p>"
        },
        "featType": {
            "value": "class"
        },
        "level": {
            "value": "12"
        },
        "prerequisites": {
            "value": [
                "devotion spell (lay on hands)"
            ]
        },
        "rarity": {
            "value": "common"
        },
        "source": {
            "value": ""
        },
        "traits": {
            "rarity": {
                "value": "common"
            },
            "value": [
                "champion"
            ]
        },
        "usage": {
            "value": ""
        }
    },
    "flags": {},
    "img": "systems/pf2e/icons/features/feats/feats.jpg",
    "name": "Amplifying Touch",
    "permission": {
        "default": 0
    },
    "type": "feat"
}
