{
    "_id": "QHwajD5n8P3oS9Wb",
    "data": {
        "actionCategory": {
            "value": ""
        },
        "actionType": {
            "value": "passive"
        },
        "actions": {
            "value": ""
        },
        "description": {
            "chat": "",
            "unidentified": "",
            "value": "<p>You've let your incisors grow long enough to serve as formidable weapons. You gain a jaws unarmed attack that deals <a class=\"inline-roll roll\" data-mode=\"roll\" data-flavor=\"piercing\" data-formula=\"1d6\" title=\"piercing\"><i class=\"fas fa-dice-d20\"></i> 1d6</a> piercing damage. Your jaws are in the brawling group and have the finesse and unarmed traits. Unlike most creatures, you can file down your teeth and regrow them later on, enabling you to select this feat at any level, and to retrain into and out of this feat.</p>"
        },
        "featType": {
            "value": "ancestry"
        },
        "level": {
            "value": "1"
        },
        "prerequisites": {
            "value": [
                ""
            ]
        },
        "rarity": {
            "value": "common"
        },
        "rules": [],
        "source": {
            "value": ""
        },
        "traits": {
            "rarity": {
                "value": "common"
            },
            "value": [
                "ratfolk"
            ]
        },
        "usage": {
            "value": ""
        }
    },
    "flags": {},
    "img": "systems/pf2e/icons/features/feats/feats.jpg",
    "name": "Vicious Incisors",
    "permission": {
        "default": 0
    },
    "type": "feat"
}
