{
    "_id": "HKGyFj2w5dzkf3SW",
    "data": {
        "actionCategory": {
            "value": ""
        },
        "actionType": {
            "value": "passive"
        },
        "actions": {
            "value": ""
        },
        "description": {
            "chat": "",
            "unidentified": "",
            "value": "<p>By drawing upon the First World's magic, you can siphon a portion of that malleable world to create a convincing illusion. Once per day, you can cast @Compendium[pf2e.spells-srd.Illusory Disguise]{Illusory Disguise}, @Compendium[pf2e.spells-srd.Item Facade]{Item Facade}, or @Compendium[pf2e.spells-srd.Ventriloquism]{Ventriloquism}. At 7th level, the spell is heightened to 2nd level, and every 2 levels thereafter, the spell is heightened an additional spell level.</p>"
        },
        "featType": {
            "value": "ancestry"
        },
        "level": {
            "value": "5"
        },
        "prerequisites": {
            "value": [
                "Illusion Sense"
            ]
        },
        "rarity": {
            "value": "common"
        },
        "source": {
            "value": ""
        },
        "traits": {
            "custom": "",
            "rarity": {
                "value": "common"
            },
            "value": [
                "gnome"
            ]
        },
        "usage": {
            "value": "held-in-one-hand"
        }
    },
    "flags": {},
    "img": "systems/pf2e/icons/features/feats/feats.jpg",
    "name": "Natural Illusionist",
    "permission": {
        "default": 0
    },
    "type": "feat"
}
