{
    "_id": "ood552HB1onSdJFS",
    "description": "Table of 11th-Level Permanent Items",
    "displayRoll": true,
    "flags": {
        "core": {
            "sourceId": "RollTable.ldfcV8oH1OCnDFuW"
        }
    },
    "formula": "1d148",
    "img": "icons/svg/d20-grey.svg",
    "name": "11th-Level Permanent Items",
    "permission": {
        "default": 0
    },
    "replacement": true,
    "results": [
        {
            "_id": "mYq4p5qykRLe1Ok4",
            "drawn": false,
            "flags": {},
            "img": "systems/pf2e/icons/equipment/artifacts/eye-of-the-wise.jpg",
            "range": [
                1,
                6
            ],
            "resultId": "eoQRjG2RjppnbYGL",
            "text": "Magic Armor (+2 resilient)",
            "type": 0,
            "weight": 6
        },
        {
            "_id": "QN2b9QvvhEhXYHss",
            "drawn": false,
            "flags": {},
            "img": "systems/pf2e/icons/equipment/cursed-items/bag-of-devouring.jpg",
            "range": [
                7,
                12
            ],
            "resultId": "EIBmADRICTyYzxik",
            "text": "Cold Iron Armor, Standard Grade",
            "type": 0,
            "weight": 6
        },
        {
            "_id": "k455WZW8SCQLXbsv",
            "drawn": false,
            "flags": {},
            "img": "systems/pf2e/icons/equipment/held-items/bag-of-holding.jpg",
            "range": [
                13,
                18
            ],
            "resultId": "JBMBaN9dZLytfFLQ",
            "text": "Silver Armor, Standard Grade",
            "type": 0,
            "weight": 6
        },
        {
            "_id": "aPbhuQl16Dn83HR8",
            "collection": "pf2e.equipment-srd",
            "drawn": false,
            "flags": {},
            "img": "systems/pf2e/icons/equipment/held-items/bag-of-holding.jpg",
            "range": [
                19,
                24
            ],
            "resultId": "jkb2WNby4mjcYqq9",
            "text": "Bag of Holding (Type III)",
            "type": 2,
            "weight": 6
        },
        {
            "_id": "3EqXFbXhBaS3HemC",
            "collection": "pf2e.equipment-srd",
            "drawn": false,
            "flags": {},
            "img": "systems/pf2e/icons/equipment/held-items/holy-prayer-beads.jpg",
            "range": [
                25,
                27
            ],
            "resultId": "OHs7L8CJMdp2UV0P",
            "text": "Holy Prayer Beads (Greater)",
            "type": 2,
            "weight": 3
        },
        {
            "_id": "lLzSpPUauPOj4sfl",
            "collection": "pf2e.equipment-srd",
            "drawn": false,
            "flags": {},
            "img": "systems/pf2e/icons/equipment/held-items/skeleton-key.jpg",
            "range": [
                28,
                33
            ],
            "resultId": "AFE073UYI0mkWuUs",
            "text": "Skeleton Key (Greater)",
            "type": 2,
            "weight": 6
        },
        {
            "_id": "HpyqvpBDM6D2jUC6",
            "collection": "pf2e.equipment-srd",
            "drawn": false,
            "flags": {},
            "img": "systems/pf2e/icons/equipment/runes/fundamental-armor-runes/armor-potency.jpg",
            "range": [
                34,
                39
            ],
            "resultId": "4Hb8tvvWFtykbZhG",
            "text": "Armor Potency (+2)",
            "type": 2,
            "weight": 6
        },
        {
            "_id": "bqsJMu7IB225fTYz",
            "collection": "pf2e.equipment-srd",
            "drawn": false,
            "flags": {},
            "img": "systems/pf2e/icons/equipment/runes/weapon-property-runes/weapon-property-runes.jpg",
            "range": [
                40,
                45
            ],
            "resultId": "65YL6nk1jIzCWutt",
            "text": "Anarchic",
            "type": 2,
            "weight": 6
        },
        {
            "_id": "xkxbqKf3zQN0HjG2",
            "collection": "pf2e.equipment-srd",
            "drawn": false,
            "flags": {},
            "img": "systems/pf2e/icons/equipment/runes/weapon-property-runes/weapon-property-runes.jpg",
            "range": [
                46,
                51
            ],
            "resultId": "6xu6dPIaUZ7edKEB",
            "text": "Axiomatic",
            "type": 2,
            "weight": 6
        },
        {
            "_id": "kQTbzpAKyDIdb9PY",
            "collection": "pf2e.equipment-srd",
            "drawn": false,
            "flags": {},
            "img": "systems/pf2e/icons/equipment/runes/weapon-property-runes/weapon-property-runes.jpg",
            "range": [
                52,
                57
            ],
            "resultId": "DH0kB9Wbr5pDeunX",
            "text": "Holy",
            "type": 2,
            "weight": 6
        },
        {
            "_id": "11E6i8082Hr9VbAI",
            "collection": "pf2e.equipment-srd",
            "drawn": false,
            "flags": {},
            "img": "systems/pf2e/icons/equipment/runes/weapon-property-runes/weapon-property-runes.jpg",
            "range": [
                58,
                63
            ],
            "resultId": "gmMrJREf4JSHd2dZ",
            "text": "Unholy",
            "type": 2,
            "weight": 6
        },
        {
            "_id": "vQq7Hy7Dx1a8GCHZ",
            "collection": "pf2e.equipment-srd",
            "drawn": false,
            "flags": {},
            "img": "systems/pf2e/icons/equipment/shields/specific-shields/arrow-catching-shield.jpg",
            "range": [
                64,
                69
            ],
            "resultId": "9ZGkQo739t9utj37",
            "text": "Arrow-Catching Shield",
            "type": 2,
            "weight": 6
        },
        {
            "_id": "dwXrm0DZwZ0Vtpyl",
            "collection": "pf2e.equipment-srd",
            "drawn": false,
            "flags": {},
            "img": "systems/pf2e/icons/equipment/shields/specific-shields/floating-shield.jpg",
            "range": [
                70,
                72
            ],
            "resultId": "ydNocKN6afzIyVh6",
            "text": "Floating Shield",
            "type": 2,
            "weight": 3
        },
        {
            "_id": "ViMk7CeQzvGeYUrC",
            "collection": "pf2e.equipment-srd",
            "drawn": false,
            "flags": {},
            "img": "systems/pf2e/icons/equipment/wands/magic-wands/magic-wand.jpg",
            "range": [
                73,
                78
            ],
            "resultId": "5BF7zMnrPYzyigCs",
            "text": "Magic Wand (5th-Level Spell)",
            "type": 2,
            "weight": 6
        },
        {
            "_id": "rj2RuyHe7q9qcZ2d",
            "collection": "pf2e.equipment-srd",
            "drawn": false,
            "flags": {},
            "img": "systems/pf2e/icons/equipment/wands/specialty-wands/wand-of-continuation.jpg",
            "range": [
                79,
                84
            ],
            "resultId": "bCsdAkffuk29ssUg",
            "text": "Wand of Continuation (4th-Level Spell)",
            "type": 2,
            "weight": 6
        },
        {
            "_id": "o3gZ97kIi4lo11BY",
            "drawn": false,
            "flags": {},
            "img": "systems/pf2e/icons/equipment/weapons/specific-magic-weapons/oathbow.jpg",
            "range": [
                85,
                87
            ],
            "resultId": "bheWnrBqMphBRUmn",
            "text": "Adamantine Weapon, Standard Grade",
            "type": 0,
            "weight": 3
        },
        {
            "_id": "OtH5vWwuqo4ICMuF",
            "drawn": false,
            "flags": {},
            "img": "systems/pf2e/icons/equipment/weapons/specific-magic-weapons/spore-sap.jpg",
            "range": [
                88,
                90
            ],
            "resultId": "tE2IarA29mYsgrxj",
            "text": "Darkwood Weapon, Standard Grade",
            "type": 0,
            "weight": 3
        },
        {
            "_id": "TbqN7piUhgo0OfAf",
            "drawn": false,
            "flags": {},
            "img": "systems/pf2e/icons/equipment/weapons/specific-magic-weapons/stoneraiser-javelin.jpg",
            "range": [
                91,
                93
            ],
            "resultId": "ud3pqCquYA5UecaS",
            "text": "Mithral Weapon, Standard Grade",
            "type": 0,
            "weight": 3
        },
        {
            "_id": "l9CD8GKGvhWX8hAA",
            "collection": "pf2e.equipment-srd",
            "drawn": false,
            "flags": {},
            "img": "systems/pf2e/icons/equipment/weapons/specific-magic-weapons/oathbow.jpg",
            "range": [
                94,
                99
            ],
            "resultId": "bheWnrBqMphBRUmn",
            "text": "Oathbow",
            "type": 2,
            "weight": 6
        },
        {
            "_id": "t5t1wLQE2o2FC0iI",
            "collection": "pf2e.equipment-srd",
            "drawn": false,
            "flags": {},
            "img": "systems/pf2e/icons/equipment/worn-items/other-worn-items/alchemist-goggles.jpg",
            "range": [
                100,
                105
            ],
            "resultId": "8XZqdeZStFAM4XnH",
            "text": "Alchemist Goggles (Greater)",
            "type": 2,
            "weight": 6
        },
        {
            "_id": "51ULgg4Z2gGAZbMm",
            "drawn": false,
            "flags": {},
            "img": "icons/svg/d20-black.svg",
            "range": [
                106,
                106
            ],
            "resultId": "",
            "text": "Mithral Weapon (Standard-Grade)",
            "type": 0,
            "weight": 1
        },
        {
            "_id": "WGS4NVKgvBlbRbTe",
            "collection": "pf2e.equipment-srd",
            "drawn": false,
            "flags": {},
            "img": "systems/pf2e/icons/equipment/worn-items/other-worn-items/cassock-of-devotion.jpg",
            "range": [
                107,
                112
            ],
            "resultId": "62vH66XLehPiRwwo",
            "text": "Cassock of Devotion",
            "type": 2,
            "weight": 6
        },
        {
            "_id": "7Z6tn2kUuYj3hLx2",
            "collection": "pf2e.equipment-srd",
            "drawn": false,
            "flags": {},
            "img": "systems/pf2e/icons/equipment/worn-items/other-worn-items/crafters-eyepiece.jpg",
            "range": [
                113,
                118
            ],
            "resultId": "JSYtBZ7XblyAEFoV",
            "text": "Crafter's Eyepiece (Greater)",
            "type": 2,
            "weight": 6
        },
        {
            "_id": "STcQUllJfx9jubmn",
            "collection": "pf2e.equipment-srd",
            "drawn": false,
            "flags": {},
            "img": "systems/pf2e/icons/equipment/worn-items/other-worn-items/doubling-rings.jpg",
            "range": [
                119,
                124
            ],
            "resultId": "gRQXLqUuP4GWfDWI",
            "text": "Doubling Rings (Greater)",
            "type": 2,
            "weight": 6
        },
        {
            "_id": "9V0wkAcLvloWJuB2",
            "collection": "pf2e.equipment-srd",
            "drawn": false,
            "flags": {},
            "img": "systems/pf2e/icons/equipment/worn-items/other-worn-items/goggles-of-night.jpg",
            "range": [
                125,
                130
            ],
            "resultId": "Tej30MsQo8Ek9aA6",
            "text": "Goggles of Night (Greater)",
            "type": 2,
            "weight": 6
        },
        {
            "_id": "1I1aKyDFUhl3sgcR",
            "collection": "pf2e.equipment-srd",
            "drawn": false,
            "flags": {},
            "img": "systems/pf2e/icons/equipment/worn-items/other-worn-items/gorget-of-the-primal-roar.jpg",
            "range": [
                131,
                136
            ],
            "resultId": "WYg2dZ8UK1N3rpgs",
            "text": "Gorget of the Primal Roar",
            "type": 2,
            "weight": 6
        },
        {
            "_id": "UvP7whKlzWpyF6YX",
            "collection": "pf2e.equipment-srd",
            "drawn": false,
            "flags": {},
            "img": "systems/pf2e/icons/equipment/cursed-items/necklace-of-strangulation.jpg",
            "range": [
                137,
                142
            ],
            "resultId": "Dr9b08JhDThUenF9",
            "text": "Necklace of Fireballs IV",
            "type": 2,
            "weight": 6
        },
        {
            "_id": "4C60NntnlXweLDuB",
            "collection": "pf2e.equipment-srd",
            "drawn": false,
            "flags": {},
            "img": "systems/pf2e/icons/equipment/worn-items/other-worn-items/ring-of-maniacal-devices.jpg",
            "range": [
                143,
                148
            ],
            "resultId": "nLvP7U50hLqz26Uy",
            "text": "Ring of Maniacal Devices",
            "type": 2,
            "weight": 6
        }
    ]
}
