{
    "_id": "eW3cfCH7Wpx2vik2",
    "data": {
        "actionCategory": {
            "value": ""
        },
        "actionType": {
            "value": "passive"
        },
        "actions": {
            "value": ""
        },
        "description": {
            "chat": "",
            "unidentified": "",
            "value": "<p>Fey whimsy or a tryst in a moonlit grove put the bewitching magic of the First World into your family's bloodline.<br /></p>\n<p><strong>Spell List</strong>primal<br /><strong>Bloodline Skills</strong>Deception, Nature<br /><strong>Granted Spells</strong>cantrip @Compendium[pf2e.spells-srd.Ghost Sound]{Ghost Sound}, 1st: @Compendium[pf2e.spells-srd.Charm]{Charm}, 2nd: @Compendium[pf2e.spells-srd.Hideous Laughter]{Hideous Laughter}, 3rd: @Compendium[pf2e.spells-srd.Enthrall]{Enthrall}, 4th: @Compendium[pf2e.spells-srd.Suggestion]{Suggestion}&gt;, 5th: @Compendium[pf2e.spells-srd.Cloak of Colors]{Cloak of Colors}&gt;, 6th: @Compendium[pf2e.spells-srd.Mislead]{Mislead}, 7th: @Compendium[pf2e.spells-srd.Visions of Danger]{Visions of Danger}, 8th: @Compendium[pf2e.spells-srd.Uncontrollable Dance]{Uncontrollable Dance}, 9th: @Compendium[pf2e.spells-srd.Resplendent Mansion]{Resplendent Mansion}<br /><strong>Bloodline Spells</strong>initial: @Compendium[pf2e.spells-srd.Faerie Dust]{Faerie Dust}&gt;, advanced: @Compendium[pf2e.spells-srd.Fey Disappearance]{Fey Disappearance}&gt;, greater: @Compendium[pf2e.spells-srd.Fey Glamour]{Fey Glamour}<br /><strong>Blood Magic</strong>Colorful fey glamours dance around you or one target, causing them to be concealed for 1 round. Such obvious concealment can't be used to Hide.</p>"
        },
        "featType": {
            "value": "classfeature"
        },
        "level": {
            "value": "1"
        },
        "prerequisites": {
            "value": ""
        },
        "rarity": {
            "value": "common"
        },
        "source": {
            "value": ""
        },
        "traits": {
            "custom": "",
            "value": [
                "sorcerer"
            ]
        },
        "usage": {
            "value": "held-in-one-hand"
        }
    },
    "flags": {},
    "img": "systems/pf2e/icons/features/classes/fey.jpg",
    "name": "Bloodline: Fey",
    "permission": {
        "default": 0
    },
    "type": "feat"
}
