{
    "_id": "hrTl9kfSNrOQeNze",
    "data": {
        "actionCategory": {
            "value": ""
        },
        "actionType": {
            "value": "passive"
        },
        "actions": {
            "value": ""
        },
        "containerId": {
            "value": ""
        },
        "description": {
            "chat": "",
            "unidentified": "",
            "value": "<p><strong>Minor Boon</strong>: Erastil shares in his bounty as long as you work for it. Whenever you roll a critical failure at a check to @Compendium[pf2e.actionspf2e.Subsist]{Subsist} in the wild, you get a failure instead.</p>"
        },
        "featType": {
            "value": "deityboon"
        },
        "level": {
            "value": "0"
        },
        "prerequisites": {
            "value": ""
        },
        "rarity": {
            "value": "common"
        },
        "source": {
            "value": ""
        },
        "traits": {
            "custom": "",
            "rarity": {
                "value": "common"
            },
            "selected": {},
            "value": []
        },
        "usage": {
            "value": "held-in-one-hand"
        }
    },
    "flags": {},
    "img": "systems/pf2e/icons/deity/Erastil.png",
    "name": "Erastil - Minor Boon",
    "permission": {
        "default": 0
    },
    "type": "feat"
}
