{
    "_id": "tjrdYJLPoGdFZlNl",
    "data": {
        "description": {
            "chat": "",
            "unidentified": "",
            "value": "<p>Granted by @Compendium[pf2e.equipment-srd.Potion of Swimming (Moderate)]{Potion of Swimming (Moderate)} or @Compendium[pf2e.equipment-srd.Potion of Swimming (Greater)]{Potion of Swimming (Greater)}</p>\n<p>Automatically applied effects:</p>\n<ul>\n<li>gain a swim Speed equal to your land Speed</li>\n</ul>\n<p>&nbsp;</p>"
        },
        "level": {
            "value": 1
        },
        "rarity": {
            "value": "common"
        },
        "rules": [
            {
                "key": "PF2E.RuleElement.BaseSpeed",
                "selector": "swim",
                "value": "@attributes.speed.value"
            },
            {
                "key": "PF2E.RuleElement.TokenEffectIcon"
            }
        ],
        "source": {
            "value": ""
        },
        "traits": {
            "value": []
        },
        "usage": {
            "value": "held-in-one-hand"
        }
    },
    "effects": [],
    "flags": {
        "core": {
            "sourceId": "Item.h3u0HMgX0cI98WwK"
        }
    },
    "img": "systems/pf2e/icons/equipment/consumables/potions/potion-of-swimming.jpg",
    "name": "Effect: Potion of Swimming",
    "permission": {
        "default": 0
    },
    "type": "effect"
}
