{
    "_id": "skqghxn3svID1dyU",
    "content": "<p>You are a member of the Bright Lions and seek to overthrow the tyrannical reign of Walkena and free Mzali from his cruel whims. You're experienced operating undercover and have had to be cautious of what you say and who you trust, lest you fall afoul of the god-king's terrible punishments.</p>\n<p>Choose two ability boosts. One must be to <strong>Strength</strong>  or <strong>Charisma</strong>, and one is a free ability boost.</p>\n<p>You're trained in the Deception skill and the Mzali Lore skill. You gain the @Compendium[pf2e.feats-srd.Lie To Me]{Lie To Me} skill feat.</p>",
    "flags": {},
    "name": "Bright Lion",
    "permission": {
        "default": 0
    }
}
