{
    "_id": "pBjryBfM3caODg6M",
    "data": {
        "description": {
            "chat": "",
            "unidentified": "",
            "value": "<p>Granted by @Compendium[pf2e.equipment-srd.Potion of Flying (Standard)]{Potion of Flying (Standard)} or @Compendium[pf2e.equipment-srd.Potion of Flying (Greater)]{Potion of Flying (Greater)}</p>\n<p>Automatically applied effects:</p>\n<ul>\n<li>You gain a Fly speed of 40 feet</li>\n</ul>"
        },
        "level": {
            "value": 1
        },
        "rarity": {
            "value": "common"
        },
        "rules": [
            {
                "key": "PF2E.RuleElement.BaseSpeed",
                "selector": "fly",
                "value": 40
            },
            {
                "key": "PF2E.RuleElement.TokenEffectIcon"
            }
        ],
        "source": {
            "value": ""
        },
        "traits": {
            "value": []
        },
        "usage": {
            "value": "held-in-one-hand"
        }
    },
    "effects": [],
    "flags": {
        "core": {
            "sourceId": "Item.sfUPFUXs2faDu7ap"
        }
    },
    "img": "systems/pf2e/icons/equipment/consumables/potions/potion-of-flying.jpg",
    "name": "Effect: Potion of Flying",
    "permission": {
        "default": 0
    },
    "type": "effect"
}
