{
    "_id": "b7isszc8C75V3okn",
    "data": {
        "actionCategory": {
            "value": ""
        },
        "actionType": {
            "value": "passive"
        },
        "actions": {
            "value": ""
        },
        "description": {
            "chat": "",
            "unidentified": "",
            "value": "<p>A combination of additional viscosity and careful application keeps your weapons poisoned even when suffering significant wear and tear.</p>\n<p>If your @Compendium[pf2e.actionspf2e.Strike]{Strike} with a poisoned weapon would expend its poison without your target attempting an initial save (due to resistance or your Strike being a critical failure, for example), attempt a DC 5 flat check. On a success, your weapon remains poisoned.</p>\n<p>If your Strike with a poisoned weapon succeeds, attempt a DC 17 flat check. On a success, your weapon remains poisoned until the end of your next turn.</p>"
        },
        "featType": {
            "value": "class"
        },
        "level": {
            "value": "6"
        },
        "prerequisites": {
            "value": [
                ""
            ]
        },
        "rarity": {
            "value": "common"
        },
        "rules": [],
        "source": {
            "value": ""
        },
        "traits": {
            "rarity": {
                "value": "common"
            },
            "value": [
                "alchemist"
            ]
        },
        "usage": {
            "value": ""
        }
    },
    "flags": {},
    "img": "systems/pf2e/icons/features/feats/feats.jpg",
    "name": "Sticky Poison",
    "permission": {
        "default": 0
    },
    "type": "feat"
}
