{
    "_id": "ZMY58Yk5hnyfeE3q",
    "data": {
        "ability": {
            "value": ""
        },
        "area": {
            "value": ""
        },
        "areasize": {
            "value": ""
        },
        "components": {
            "value": "somatic, verbal"
        },
        "cost": {
            "value": ""
        },
        "damage": {
            "applyMod": false,
            "value": "2d12"
        },
        "damageType": {
            "value": "piercing"
        },
        "description": {
            "chat": "",
            "unidentified": "",
            "value": "<p>You replicate the fiery venom of the tor linnorm and inflict an enemy with the dread dragon's debilitating bite. You deal [[/r 2d12 #piercing]] piercing damage to the targeted creature and afflict it with tor linnorm venom. If the target takes piercing damage, they must attempt a Fortitude save.</p>\n<hr />\n<p><strong>Critical Success</strong> The target is unaffected.</p>\n<p><strong>Success</strong> The target takes [[/r 8d6 #fire]] fire damage.</p>\n<p><strong>Failure</strong> The target is afflicted with Tor Linnorm Venom at stage 1.</p>\n<p><strong>Critical Failure</strong> The target is afflicted with tor linnorm venom at stage 2.</p><hr /><p><b>Tor Linnorm Venom</b> (fire, injury, poison) <b>Level 17</b></p><p><b>Maximum Duration</b> 10 rounds</p><p><b>Stage 1</b> [[/r 8d6 #fire]] fire damage and @Compendium[pf2e.conditionitems.Drained]{Drained 1} (1 round)</p><p><b>Stage 2</b> [[/r 12d6 #fire]] fire damage and Drained 2 (1 round)</p>"
        },
        "duration": {
            "value": ""
        },
        "level": {
            "value": 9
        },
        "location": {
            "value": "Z9TGJ4zsSKnZVV9u"
        },
        "materials": {
            "value": ""
        },
        "prepared": {
            "value": ""
        },
        "primarycheck": {
            "value": ""
        },
        "range": {
            "value": "touch"
        },
        "rarity": {
            "value": "common"
        },
        "rules": [],
        "save": {
            "basic": "",
            "value": "fortitude"
        },
        "scaling": {
            "formula": "",
            "mode": "none"
        },
        "school": {
            "value": "nec"
        },
        "secondarycasters": {
            "value": ""
        },
        "secondarycheck": {
            "value": ""
        },
        "source": {
            "value": ""
        },
        "spellCategorie": {
            "value": "spell"
        },
        "spellCategory": {
            "value": ""
        },
        "spellType": {
            "value": "save"
        },
        "sustained": {
            "value": false
        },
        "target": {
            "value": "1 creature"
        },
        "time": {
            "value": "2"
        },
        "traditions": {
            "custom": "",
            "value": [
                "arcane",
                "primal"
            ]
        },
        "traits": {
            "custom": "",
            "rarity": {
                "value": "uncommon"
            },
            "selected": [],
            "value": [
                "fire",
                "necromancy",
                "poison"
            ]
        },
        "usage": {
            "value": "held-in-one-hand"
        }
    },
    "effects": [],
    "flags": {
        "core": {
            "sourceId": "Item.am51mXu95E9Uy0Ww"
        }
    },
    "img": "systems/pf2e/icons/spells/linnorm-sting.jpg",
    "name": "Linnorm Sting",
    "permission": {
        "default": 0
    },
    "type": "spell"
}
