{
    "_id": "qTr2oCgIXl703Whb",
    "data": {
        "ability": {
            "value": ""
        },
        "area": {
            "value": ""
        },
        "areasize": {
            "value": ""
        },
        "components": {
            "value": "somatic"
        },
        "cost": {
            "value": ""
        },
        "damage": {
            "applyMod": false,
            "value": ""
        },
        "damageType": {
            "value": ""
        },
        "description": {
            "chat": "",
            "unidentified": "",
            "value": "<p>You teleport one object of light or negligible Bulk held in your hand to the target. The object appears instantly in the target's hand, if they have a free hand, or at their feet if they don't. The target knows what object you are attempting to send them. If the target is @Compendium[pf2e.conditionitems.Unconscious]{Unconscious} or refuses to accept your gift, or if the spell would teleport a creature (even if the creature is inside an extradimensional container), the spell fails.</p>\n<hr />\n<p><strong>Heightened (3rd)</strong> The spell's range increases to 500 feet.</p>\n<p><strong>Heightened (5th)</strong> As 3rd level, and the object's maximum Bulk increases to 1. You can @Compendium[pf2e.actionspf2e.Cast a Spell]{Cast the Spell} with 3 actions instead of 1; doing so increases the range to 1 mile and you don't need line of sight to the target, but you must be extremely familiar with the target.</p>"
        },
        "duration": {
            "value": ""
        },
        "level": {
            "value": 1
        },
        "location": {
            "value": ""
        },
        "materials": {
            "value": ""
        },
        "prepared": {
            "value": false
        },
        "primarycheck": {
            "value": ""
        },
        "range": {
            "value": "120 feet"
        },
        "rarity": {
            "value": "common"
        },
        "rules": [],
        "save": {
            "basic": "",
            "value": ""
        },
        "scaling": {
            "formula": "",
            "mode": "none"
        },
        "school": {
            "value": "con"
        },
        "secondarycasters": {
            "value": ""
        },
        "secondarycheck": {
            "value": ""
        },
        "source": {
            "value": ""
        },
        "spellCategorie": {
            "value": "spell"
        },
        "spellCategory": {
            "value": ""
        },
        "spellType": {
            "value": "utility"
        },
        "sustained": {
            "value": false
        },
        "target": {
            "value": "1 willing creature"
        },
        "time": {
            "value": "1 (up to 3 if heightened)"
        },
        "traditions": {
            "value": [
                "arcane",
                "divine",
                "occult"
            ]
        },
        "traits": {
            "custom": "",
            "rarity": {
                "value": "common"
            },
            "value": [
                "conjuration",
                "teleportation"
            ]
        },
        "usage": {
            "value": ""
        }
    },
    "effects": [],
    "flags": {},
    "img": "systems/pf2e/icons/spells/thoughtful-gift.jpg",
    "name": "Thoughtful Gift",
    "permission": {
        "default": 0
    },
    "type": "spell"
}
