{
    "_id": "LzfrBDxxPTiuN7uL",
    "data": {
        "ability": {
            "value": ""
        },
        "area": {
            "value": ""
        },
        "areasize": {
            "value": "2 adjacent 10-foot cubes"
        },
        "components": {
            "value": "material, somatic, verbal"
        },
        "cost": {
            "value": ""
        },
        "damage": {
            "applyMod": false,
            "value": ""
        },
        "damageType": {
            "value": ""
        },
        "description": {
            "chat": "",
            "unidentified": "",
            "value": "<p>You warp the structure of earthen material, turning rock into mud or mud into rock. Choose one of these two options when you @Compendium[pf2e.actionspf2e.Cast a Spell]{Cast the Spell}.</p>\n<p>•<strong>Rock to Mud</strong> You transform non-magical, unworked, and unattended stone in the area into an equal volume of mud. If you Cast this Spell on a stone floor, it becomes difficult terrain; if the resulting mud is at least 3 feet deep, it is greater difficult terrain, or the creature can try to @Compendium[pf2e.actionspf2e.Swim]{Swim} through it (DC 10 Athletics). If the mud is deep enough that a creature can't reach the bottom, the creature must Swim to move through it. If you Cast this Spell on a ceiling, the falling mud deals [[/r 8d6 #bludgeoning]] bludgeoning damage (basic Reflex save) and spreads out, creating difficult terrain in an area 10 feet larger in radius than the original spell's area. Once the rock is transformed into mud, the mud is non-magical and remains until natural conditions cause it to dry out or otherwise disperse.</p>\n<p>•<strong>Mud to Rock</strong> Mud in the area turns into unworked stone. If creatures are in the mud when it is transformed to stone, they must attempt a Reflex saving throw.</p>\n<hr />\n<p><strong>Critical Success</strong> The creature escapes the mud and is atop the stone, unaffected.</p>\n<p><strong>Success</strong> The creature climbs out of the mud as it turns to rock and is @Compendium[pf2e.conditionitems.Prone]{Prone} atop the stone.</p>\n<p><strong>Failure</strong> The creature is partially stuck in the mud and is @Compendium[pf2e.conditionitems.Grabbed]{Grabbed} for 1 round or until it @Compendium[pf2e.actionspf2e.Escape]{Escapes}, whichever comes first.</p>\n<p><strong>Critical Failure</strong> The creature is entirely stuck. It is @Compendium[pf2e.conditionitems.Restrained]{Restrained} for 1 round or until it Escapes, whichever comes first.</p>\n<hr />\n<p><strong>Heightened (+2)</strong> Add an additional 10-foot cube to the area, adjacent to at least one of the other cubes.</p>"
        },
        "duration": {
            "value": ""
        },
        "level": {
            "value": 5
        },
        "location": {
            "value": ""
        },
        "materials": {
            "value": ""
        },
        "prepared": {
            "value": false
        },
        "primarycheck": {
            "value": ""
        },
        "range": {
            "value": "60 feet"
        },
        "rarity": {
            "value": "common"
        },
        "rules": [],
        "save": {
            "basic": "",
            "value": ""
        },
        "scaling": {
            "formula": "",
            "mode": "none"
        },
        "school": {
            "value": "trs"
        },
        "secondarycasters": {
            "value": ""
        },
        "secondarycheck": {
            "value": ""
        },
        "source": {
            "value": ""
        },
        "spellCategorie": {
            "value": "spell"
        },
        "spellCategory": {
            "value": ""
        },
        "spellType": {
            "value": "utility"
        },
        "sustained": {
            "value": false
        },
        "target": {
            "value": ""
        },
        "time": {
            "value": "3"
        },
        "traditions": {
            "value": [
                "arcane",
                "primal"
            ]
        },
        "traits": {
            "custom": "",
            "rarity": {
                "value": "common"
            },
            "value": [
                "earth",
                "transmutation"
            ]
        },
        "usage": {
            "value": ""
        }
    },
    "effects": [],
    "flags": {},
    "img": "systems/pf2e/icons/spells/transmute-rock-and-mud.jpg",
    "name": "Transmute Rock And Mud",
    "permission": {
        "default": 0
    },
    "type": "spell"
}
