{
    "_id": "liqDAd5xk2b3xzeE",
    "data": {
        "actionCategory": {
            "value": ""
        },
        "actionType": {
            "value": "passive"
        },
        "actions": {
            "value": ""
        },
        "description": {
            "chat": "",
            "unidentified": "",
            "value": "<p><strong>Access</strong>Shoanti ethnicity<br /></p>\n<hr />\n<p>You grew up among the Shoanti tribes, with the spirits watching over you, and they offer you guidance. You gain the trained proficiency rank in the skill listed for your quah (or another skill of your choice, if you're already trained in that skill). You gain the @Compendium[pf2e.feats-srd.Assurance]{Assurance} skill feat in that skill, as the spirits' help guides your actions.</p>\n<ul>\n<li>Lyrune-Quah: Religion</li>\n<li>Shadde-Quah: Athletics</li>\n<li>Shriikirri-Quah: Nature</li>\n<li>Shundar-Quah: Diplomacy</li>\n<li>Sklar-Quah: Intimidation</li>\n<li>Skoan-Quah: Medicine</li>\n<li>Tamiir-Quah: Acrobatics</li>\n</ul>"
        },
        "featType": {
            "value": "ancestry"
        },
        "level": {
            "value": "1"
        },
        "prerequisites": {
            "value": [
                ""
            ]
        },
        "rarity": {
            "value": "common"
        },
        "rules": [],
        "source": {
            "value": ""
        },
        "traits": {
            "custom": "",
            "rarity": {
                "value": "common"
            },
            "value": [
                "uncommon",
                "human"
            ]
        },
        "usage": {
            "value": "held-in-one-hand"
        }
    },
    "flags": {},
    "img": "systems/pf2e/icons/features/feats/feats.jpg",
    "name": "Quah Bond",
    "permission": {
        "default": 0
    },
    "type": "feat"
}
