{
    "_id": "N03BtRvjX9TeHRa4",
    "data": {
        "actionCategory": {
            "value": ""
        },
        "actionType": {
            "value": "passive"
        },
        "actions": {
            "value": ""
        },
        "description": {
            "chat": "",
            "unidentified": "",
            "value": "<p>The battlefield is your stage, the clang of steel, your song. Your muse engages in countless battles, whether reveling in combat or resigned to its necessity. If your muse is a creature, it might be an otherworldly soldier, such as a planetar, archon, cornugon, or purrodaemon. If it's a deity, it might be Gorum. As a bard with a warrior muse, you train for battle in addition to performance, and you prepare your allies for the dangers of battle. You might even wade into the thick of things with them.</p>\n<p>You gain the @Compendium[pf2e.feats-srd.Martial Performance]{Martial Performance} feat and add @Compendium[pf2e.spells-srd.Fear]{Fear} to your spell repertoire.</p>"
        },
        "featType": {
            "value": "classfeature"
        },
        "level": {
            "value": "1"
        },
        "prerequisites": {
            "value": ""
        },
        "rarity": {
            "value": "common"
        },
        "rules": [],
        "source": {
            "value": ""
        },
        "traits": {
            "custom": "",
            "rarity": {
                "value": "common"
            },
            "value": [
                "bard"
            ]
        },
        "usage": {
            "value": "held-in-one-hand"
        }
    },
    "effects": [],
    "flags": {},
    "img": "systems/pf2e/icons/features/classes/warrior.jpg",
    "name": "Warrior (Bard Muse)",
    "permission": {
        "default": 0
    },
    "type": "feat"
}
