{
    "_id": "y8sk7Q4uAtacYdR2",
    "data": {
        "actionCategory": {
            "value": ""
        },
        "actionType": {
            "value": "passive"
        },
        "actions": {
            "value": ""
        },
        "containerId": {
            "value": ""
        },
        "description": {
            "chat": "",
            "unidentified": "",
            "value": "<p><strong>[Slotless][Generic]</strong></p>\n<p><strong>Effect</strong>: Having Read the ancient scrolls from which Meleeka created the Unforgiving Fire style, you have gained access to the following feat for all of your characters (include a copy of this Chronicle sheet with any character who selects this feat).</p>\n<p>@Compendium[pf2e.feats-srd.Rain of Embers Stance]{Rain of Embers Stance}</p>"
        },
        "featType": {
            "value": "pfsboon"
        },
        "level": {
            "value": "0"
        },
        "prerequisites": {
            "value": ""
        },
        "rarity": {
            "value": "common"
        },
        "source": {
            "value": ""
        },
        "traits": {
            "custom": "",
            "rarity": {
                "value": "common"
            },
            "selected": {},
            "value": []
        },
        "usage": {
            "value": "held-in-one-hand"
        }
    },
    "flags": {},
    "img": "systems/pf2e/icons/default-icons/mystery-man.png",
    "name": "S1-Q02 - Student of the Unforgiving Fire",
    "permission": {
        "default": 0
    },
    "type": "feat"
}
