{
    "_id": "B3eLlbaPxOYHcs1o",
    "data": {
        "ability": {
            "value": ""
        },
        "area": {
            "value": ""
        },
        "areasize": {
            "value": ""
        },
        "components": {
            "value": "somatic, verbal"
        },
        "cost": {
            "value": ""
        },
        "damage": {
            "applyMod": false,
            "value": ""
        },
        "damageType": {
            "value": ""
        },
        "description": {
            "chat": "",
            "unidentified": "",
            "value": "<p>You mimic the process of aging or erosion on the target. The effect depends on whether the target is an object, a construct, or a living creature. Artifacts and objects and constructs made of precious materials, as determined by the GM, are immune.</p>\n<hr />\n<p><strong>• Object</strong> If the object is attended, its bearer can attempt a Fortitude save. If the bearer fails or the object is unattended, the object immediately takes [[/r 4d6]] damage (applying Hardness normally) and the item is cursed with an unlimited duration. Until the curse ends, the item becomes shoddy and can't be @Compendium[pf2e.actionspf2e.Repair]{Repaired}, and the curse attempts to counteract any spell that would restore the object's Hit Points.<em> @Compendium[pf2e.spells-srd.Remove Curse]{Remove Curse}</em> can target an item affected by this spell.</p>\n<p><strong>• Construct</strong> The construct takes [[/r 4d6]] damage (basic Fortitude save). On a failure, for 1 hour the construct is @Compendium[pf2e.conditionitems.Clumsy]{Clumsy} 1, is @Compendium[pf2e.conditionitems.Enfeebled]{Enfeebled} 1, and can't be Repaired, and the curse attempts to counteract any spell that would restore the construct's Hit Points. On a critical failure, these effects have an unlimited duration.</p>\n<p><strong>• Living Creature</strong> The living creature must attempt a Fortitude save. Ageless creatures are immune.</p>\n<hr />\n<p><strong>Critical Success</strong> The living creature is unaffected.</p>\n<p><strong>Success</strong> The living creature briefly ages, becoming Clumsy 1 and Enfeebled 1 for 1 round.</p>\n<p><strong>Failure</strong> As success, with a duration of 1 hour.</p>\n<p><strong>Critical Failure</strong> As success, with an unlimited duration.</p>\n<hr />\n<p><strong>Heightened (+1)</strong> The damage increases by [[/r 1d6]].</p>"
        },
        "duration": {
            "value": "varies"
        },
        "level": {
            "value": 3
        },
        "location": {
            "value": ""
        },
        "materials": {
            "value": ""
        },
        "prepared": {
            "value": false
        },
        "primarycheck": {
            "value": ""
        },
        "range": {
            "value": "touch"
        },
        "rarity": {
            "value": "common"
        },
        "rules": [],
        "save": {
            "basic": "",
            "label": "Saving Throw",
            "type": "String",
            "value": "fortitude"
        },
        "scaling": {
            "formula": "",
            "mode": "none"
        },
        "school": {
            "value": "trs"
        },
        "secondarycasters": {
            "value": ""
        },
        "secondarycheck": {
            "value": ""
        },
        "source": {
            "value": ""
        },
        "spellCategorie": {
            "value": "spell"
        },
        "spellCategory": {
            "value": ""
        },
        "spellType": {
            "label": "Spell Type",
            "type": "String",
            "value": "save"
        },
        "sustained": {
            "value": false
        },
        "target": {
            "value": "1 Large or smaller object, construct, or living creature"
        },
        "time": {
            "value": "2"
        },
        "traditions": {
            "custom": "",
            "value": [
                "arcane",
                "occult",
                "primal"
            ]
        },
        "traits": {
            "custom": "",
            "rarity": {
                "value": "common"
            },
            "value": [
                "curse",
                "negative",
                "transmutation"
            ]
        },
        "usage": {
            "value": ""
        }
    },
    "effects": [],
    "flags": {},
    "img": "systems/pf2e/icons/spells/curse-of-lost-time.jpg",
    "name": "Curse Of Lost Time",
    "permission": {
        "default": 0
    },
    "type": "spell"
}
