{
    "_id": "awfTQvkm7NrRjRaQ",
    "description": "Table of 13th-Level Consumables Items",
    "displayRoll": true,
    "flags": {
        "core": {
            "sourceId": "RollTable.BgcgSl7Mus6CRZcz"
        }
    },
    "formula": "1d42",
    "img": "icons/svg/d20-grey.svg",
    "name": "13th-Level Consumables Items",
    "permission": {
        "default": 0
    },
    "replacement": true,
    "results": [
        {
            "_id": "mYq4p5qykRLe1Ok4",
            "collection": "pf2e.equipment-srd",
            "drawn": false,
            "flags": {},
            "img": "systems/pf2e/icons/equipment/consumables/ammunition/explosive-ammunition.jpg",
            "range": [
                1,
                6
            ],
            "resultId": "g27kK39Nzqphl1Tb",
            "text": "Explosive Ammunition (Greater)",
            "type": 2,
            "weight": 6
        },
        {
            "_id": "QN2b9QvvhEhXYHss",
            "collection": "pf2e.equipment-srd",
            "drawn": false,
            "flags": {},
            "img": "systems/pf2e/icons/equipment/consumables/ammunition/spellstrike-ammunition.jpg",
            "range": [
                7,
                12
            ],
            "resultId": "n4FF7K3SLb7q1v6v",
            "text": "Spellstrike Ammunition (Type VI)",
            "type": 2,
            "weight": 6
        },
        {
            "_id": "k455WZW8SCQLXbsv",
            "collection": "pf2e.equipment-srd",
            "drawn": false,
            "flags": {},
            "img": "systems/pf2e/icons/equipment/alchemical-items/alchemical-elixirs/elixir-of-life.jpg",
            "range": [
                13,
                18
            ],
            "resultId": "mYozcVg9fQY6zO7C",
            "text": "Elixir of Life (Greater)",
            "type": 2,
            "weight": 6
        },
        {
            "_id": "aPbhuQl16Dn83HR8",
            "collection": "pf2e.equipment-srd",
            "drawn": false,
            "flags": {},
            "img": "systems/pf2e/icons/equipment/alchemical-items/alchemical-poisons/deathcap-powder.jpg",
            "range": [
                19,
                24
            ],
            "resultId": "87AzvRja9uQOLJCC",
            "text": "Deathcap Powder",
            "type": 2,
            "weight": 6
        },
        {
            "_id": "oLZsd9xeniDUB97N",
            "collection": "pf2e.equipment-srd",
            "drawn": false,
            "flags": {},
            "img": "systems/pf2e/icons/equipment/alchemical-items/alchemical-poisons/purple-worm-venom.jpg",
            "range": [
                25,
                30
            ],
            "resultId": "iRDCa4OVSTGUD3vi",
            "text": "Purple Worm Venom",
            "type": 2,
            "weight": 6
        },
        {
            "_id": "zz0eL7k3QNTKNXc3",
            "collection": "pf2e.equipment-srd",
            "drawn": false,
            "flags": {},
            "img": "systems/pf2e/icons/equipment/consumables/potions/panacea.jpg",
            "range": [
                31,
                33
            ],
            "resultId": "LRSiYsgEz3e0PEwX",
            "text": "Panacea",
            "type": 2,
            "weight": 3
        },
        {
            "_id": "lLzSpPUauPOj4sfl",
            "collection": "pf2e.equipment-srd",
            "drawn": false,
            "flags": {},
            "img": "systems/pf2e/icons/equipment/consumables/other-consumables/spell-scroll.jpg",
            "range": [
                34,
                39
            ],
            "resultId": "fomEZZ4MxVVK3uVu",
            "text": "Scroll of 7th-level Spell",
            "type": 2,
            "weight": 6
        },
        {
            "_id": "HpyqvpBDM6D2jUC6",
            "collection": "pf2e.equipment-srd",
            "drawn": false,
            "flags": {},
            "img": "systems/pf2e/icons/equipment/consumables/talismans/mending-lattice.jpg",
            "range": [
                40,
                42
            ],
            "resultId": "JSmdTDUEGwHVbV7g",
            "text": "Mending Lattice",
            "type": 2,
            "weight": 3
        }
    ]
}
