{
    "_id": "5u7FKCHuWmscNe5i",
    "content": "<p>You're from Rahadoum, where the Laws of Mortality taught you to reject the gods, yet you've seen firsthand how dangerous it can be to go without healing magic. As a result, you've thrown yourself into the study of medicine, so you can save lives without saving souls.</p>\n<p>Choose two ability boosts. One must be to <strong>Wisdom</strong> or <strong>Dexterity</strong>, and one is a free ability boost.</p>\n<p>You're trained in the Medicine skill and the Anatomy Lore skill. You gain the @Compendium[pf2e.feats-srd.Battle Medicine]{Battle Medicine} skill feat.</p>",
    "flags": {},
    "name": "Secular Medic",
    "permission": {
        "default": 0
    }
}
