{
    "_id": "hFRHPBj6wjAayNtW",
    "data": {
        "actionCategory": {
            "value": ""
        },
        "actionType": {
            "value": "action"
        },
        "actions": {
            "value": "2"
        },
        "description": {
            "chat": "",
            "unidentified": "",
            "value": "<p><strong>Frequency</strong> once per day</p>\n<hr />\n<p>You can curse another creature with clumsiness. This curse has a range of 30 feet, and you must be able to see your target. The target gets a Will saving throw to resist this jinx, using your class DC or spell DC, whichever is higher.</p>\n<hr />\n<p><strong>Success</strong> The target is unaffected and is temporarily immune for 24 hours.</p>\n<p><strong>Failure</strong> The target is @Compendium[pf2e.conditionitems.Clumsy]{Clumsy} 1 for 1 minute.</p>\n<p><strong>Critical Failure</strong> The target is clumsy 2 for 1 minute.</p>"
        },
        "rarity": {
            "value": "common"
        },
        "requirements": {
            "value": ""
        },
        "rules": [],
        "skill_requirement": {
            "skill": {
                "rank": "",
                "skill": ""
            }
        },
        "skill_requirements": {
            "rank": "",
            "skill": ""
        },
        "source": {
            "value": ""
        },
        "traits": {
            "custom": "",
            "value": [
                "curse",
                "necromancy",
                "occult"
            ]
        },
        "trigger": {
            "value": ""
        },
        "usage": {
            "value": "held-in-one-hand"
        },
        "weapon": {
            "value": ""
        }
    },
    "effects": [],
    "flags": {},
    "img": "systems/pf2e/icons/actions/TwoActions.png",
    "name": "Jinx",
    "permission": {
        "default": 0
    },
    "type": "action"
}
