{
    "_id": "PbEqXHWiyzii4g8T",
    "data": {
        "actionCategory": {
            "value": ""
        },
        "actionType": {
            "value": "passive"
        },
        "actions": {
            "value": ""
        },
        "containerId": {
            "value": ""
        },
        "description": {
            "chat": "",
            "unidentified": "",
            "value": "<p><strong>[Advanced]</strong><strong>[Limited Use] □</strong></p>\n<p><strong>Effect</strong>: You have survived the grim symphony, but the haunting melody which bridged the worlds of the living and the dead still echoes in your mind. When your dying value is 2 or greater, you can check the box next to this boon to gain a +2 circumstance bonus to Performance checks, 20 temporary Hit Points, and a +1 circumstance bonus to Fortitude saves, all for the next 10 minutes.</p>"
        },
        "featType": {
            "value": "pfsboon"
        },
        "level": {
            "value": 0
        },
        "prerequisites": {
            "value": ""
        },
        "rarity": {
            "value": "common"
        },
        "rules": [],
        "source": {
            "value": ""
        },
        "traits": {
            "custom": "",
            "rarity": {
                "value": "common"
            },
            "selected": {},
            "value": []
        },
        "usage": {
            "value": "held-in-one-hand"
        }
    },
    "effects": [],
    "flags": {
        "core": {
            "sourceId": "Item.Yigttf5xIfroMoBD"
        }
    },
    "img": "systems/pf2e/icons/default-icons/mystery-man.png",
    "name": "S1-25 - Grand Finale",
    "permission": {
        "default": 0
    },
    "type": "feat"
}
