{
    "_id": "HrV31rAkNjV4KfCU",
    "data": {
        "actionCategory": {
            "value": ""
        },
        "actionType": {
            "value": "passive"
        },
        "actions": {
            "value": ""
        },
        "containerId": {
            "value": ""
        },
        "description": {
            "chat": "",
            "unidentified": "",
            "value": "<p><strong>Minor Boon</strong>: Gorum grants you a weapon whenever you need one. You can use an Interact action to draw a 0-level non-magical iron weapon, even if you have no weapons on your person. Such a weapon lasts only as long as you continue using it to attack, and it can't be sold, given away, melted for scrap iron, or the like.</p>"
        },
        "featType": {
            "value": "deityboon"
        },
        "level": {
            "value": "0"
        },
        "prerequisites": {
            "value": ""
        },
        "rarity": {
            "value": "common"
        },
        "source": {
            "value": ""
        },
        "traits": {
            "custom": "",
            "rarity": {
                "value": "common"
            },
            "selected": {},
            "value": []
        },
        "usage": {
            "value": "held-in-one-hand"
        }
    },
    "flags": {},
    "img": "systems/pf2e/icons/deity/Gorum.png",
    "name": "Gorum - Minor Boon",
    "permission": {
        "default": 0
    },
    "type": "feat"
}
