{
    "_id": "evXJISqyhl3fHE9u",
    "data": {
        "actionCategory": {
            "value": ""
        },
        "actionType": {
            "value": "passive"
        },
        "actions": {
            "value": null
        },
        "description": {
            "chat": "",
            "unidentified": "",
            "value": "<p>The prehensile vines woven into your body grant you unmatched skill at climbing. You do not need to have any hands free to @Compendium[pf2e.actionspf2e.Climb]{Climb}. Additionally, if you roll a success on an Athletics check to climb, you get a critical success instead.</p>"
        },
        "featType": {
            "value": "ancestryfeature"
        },
        "level": {
            "value": "1"
        },
        "prerequisites": {
            "value": null
        },
        "rarity": {
            "value": "common"
        },
        "rules": [],
        "source": {
            "value": ""
        },
        "traits": {
            "custom": "",
            "rarity": {
                "value": "common"
            },
            "value": [
                "leshy"
            ]
        },
        "usage": {
            "value": "held-in-one-hand"
        }
    },
    "effects": [],
    "flags": {},
    "img": "systems/pf2e/icons/features/ancestry/vine-leshy.jpg",
    "name": "Vine Leshy",
    "permission": {
        "default": 0
    },
    "type": "feat"
}
