{
    "_id": "81xlcIFJIAtsmXmd",
    "data": {
        "actionCategory": {
            "value": ""
        },
        "actionType": {
            "value": "passive"
        },
        "actions": {
            "value": ""
        },
        "description": {
            "chat": "",
            "unidentified": "",
            "value": "<p>You learn the secrets of armor runes by viewing them through gems and can alter them at your discretion. Once per day when you make your daily preparations, you can focus on a rune's magical energies through a crystal's facets to alter a single property rune on one suit of armor in your possession to suppress its normal effects and make it function as a different property rune. You can temporarily alter the rune to function as one of the following runes: energy-resistant, fortification, glamered, invisibility, shadow, or slick. The property rune remains altered until you make your next daily preparations. The armor must meet the prerequisites for the temporary rune, and any other runes that required the suppressed rune are also suppressed while the rune is transformed. The rune is obviously altered, and thus the armor can't be sold as though it had the temporary rune.</p>"
        },
        "featType": {
            "value": "archetype"
        },
        "level": {
            "value": "10"
        },
        "prerequisites": {
            "value": [
                "Crystal Keeper Dedication"
            ]
        },
        "rarity": {
            "value": "common"
        },
        "source": {
            "value": ""
        },
        "traits": {
            "custom": "",
            "rarity": {
                "value": "common"
            },
            "value": [
                "archetype"
            ]
        },
        "usage": {
            "value": "held-in-one-hand"
        }
    },
    "flags": {},
    "img": "systems/pf2e/icons/features/feats/feats.jpg",
    "name": "Armor Rune Shifter",
    "permission": {
        "default": 0
    },
    "type": "feat"
}
