{
    "_id": "8aRa9VHoDKl9B1Z1",
    "data": {
        "actionCategory": {
            "value": ""
        },
        "actionType": {
            "value": "reaction"
        },
        "actions": {
            "value": ""
        },
        "description": {
            "chat": "",
            "unidentified": "",
            "value": "<p>Once per day, you can spend 10 minutes studying your surroundings in search of omens related to a particular course of action to cast @Compendium[pf2e.spells-srd.Augury]{Augury} as an innate divine spell. Unless the result of the<em>augury</em>was \"nothing,\" you gain the @Compendium[pf2e.actionspf2e.Call Upon the Brightness]{Call Upon the Brightness} reaction for the next 30 minutes.</p>"
        },
        "featType": {
            "value": "ancestry"
        },
        "level": {
            "value": "9"
        },
        "prerequisites": {
            "value": [
                ""
            ]
        },
        "rarity": {
            "value": "common"
        },
        "source": {
            "value": ""
        },
        "traits": {
            "custom": "",
            "rarity": {
                "value": "common"
            },
            "value": [
                "elf"
            ]
        },
        "usage": {
            "value": "held-in-one-hand"
        }
    },
    "flags": {},
    "img": "systems/pf2e/icons/features/feats/feats.jpg",
    "name": "Brightness Seeker",
    "permission": {
        "default": 0
    },
    "type": "feat"
}
