{
    "_id": "AIBvZzHidUXxZfEF",
    "description": "Table of 10th-Level Consumables Items",
    "displayRoll": true,
    "flags": {
        "core": {
            "sourceId": "RollTable.lwMWFhxjqPbTAjde"
        }
    },
    "formula": "1d72",
    "img": "icons/svg/d20-grey.svg",
    "name": "10th-Level Consumables Items",
    "permission": {
        "default": 0
    },
    "replacement": true,
    "results": [
        {
            "_id": "mYq4p5qykRLe1Ok4",
            "collection": "pf2e.equipment-srd",
            "drawn": false,
            "flags": {},
            "img": "systems/pf2e/icons/equipment/consumables/other-consumables/elemental-gem.jpg",
            "range": [
                1,
                6
            ],
            "resultId": "TgZdamADHuaKyriW",
            "text": "Elemental Gem",
            "type": 2,
            "weight": 6
        },
        {
            "_id": "QN2b9QvvhEhXYHss",
            "collection": "pf2e.equipment-srd",
            "drawn": false,
            "flags": {},
            "img": "systems/pf2e/icons/equipment/alchemical-items/alchemical-elixirs/antidote.jpg",
            "range": [
                7,
                12
            ],
            "resultId": "XWkeL34yJK6t5qUE",
            "text": "Antidote (Greater)",
            "type": 2,
            "weight": 6
        },
        {
            "_id": "k455WZW8SCQLXbsv",
            "collection": "pf2e.equipment-srd",
            "drawn": false,
            "flags": {},
            "img": "systems/pf2e/icons/equipment/alchemical-items/alchemical-elixirs/antiplague.jpg",
            "range": [
                13,
                18
            ],
            "resultId": "ORDaAzMZLrf6Hn8A",
            "text": "Antiplague (Greater)",
            "type": 2,
            "weight": 6
        },
        {
            "_id": "aPbhuQl16Dn83HR8",
            "collection": "pf2e.equipment-srd",
            "drawn": false,
            "flags": {},
            "img": "systems/pf2e/icons/equipment/alchemical-items/alchemical-elixirs/bravos-brew.jpg",
            "range": [
                19,
                24
            ],
            "resultId": "oCuwJ9IUDAuzsUwa",
            "text": "Bravo's Brew (Moderate)",
            "type": 2,
            "weight": 6
        },
        {
            "_id": "3EqXFbXhBaS3HemC",
            "collection": "pf2e.equipment-srd",
            "drawn": false,
            "flags": {},
            "img": "systems/pf2e/icons/equipment/alchemical-items/alchemical-elixirs/eagle-eyes-elixir.jpg",
            "range": [
                25,
                30
            ],
            "resultId": "xWCdsGSwLLTeX6tQ",
            "text": "Eagle Eye Elixir (Greater)",
            "type": 2,
            "weight": 6
        },
        {
            "_id": "oLZsd9xeniDUB97N",
            "collection": "pf2e.equipment-srd",
            "drawn": false,
            "flags": {},
            "img": "systems/pf2e/icons/equipment/alchemical-items/alchemical-elixirs/mistform-elixir.jpg",
            "range": [
                31,
                36
            ],
            "resultId": "04giYigfDL5geu5f",
            "text": "Mistform Elixir (Greater)",
            "type": 2,
            "weight": 6
        },
        {
            "_id": "zz0eL7k3QNTKNXc3",
            "collection": "pf2e.equipment-srd",
            "drawn": false,
            "flags": {},
            "img": "systems/pf2e/icons/equipment/alchemical-items/alchemical-poisons/shadow-essence.jpg",
            "range": [
                37,
                42
            ],
            "resultId": "Wjkw0lEUOhypYvzo",
            "text": "Shadow Essence",
            "type": 2,
            "weight": 6
        },
        {
            "_id": "lLzSpPUauPOj4sfl",
            "collection": "pf2e.equipment-srd",
            "drawn": false,
            "flags": {},
            "img": "systems/pf2e/icons/equipment/alchemical-items/alchemical-poisons/wolfsbane.jpg",
            "range": [
                43,
                48
            ],
            "resultId": "NRoA1HpA3ElPGBEQ",
            "text": "Wolfsbane",
            "type": 2,
            "weight": 6
        },
        {
            "_id": "HpyqvpBDM6D2jUC6",
            "collection": "pf2e.equipment-srd",
            "drawn": false,
            "flags": {},
            "img": "systems/pf2e/icons/equipment/consumables/potions/potion-of-resistance.jpg",
            "range": [
                49,
                54
            ],
            "resultId": "dzfmP3WsA15puenS",
            "text": "Potion of Resistance (Moderate)",
            "type": 2,
            "weight": 6
        },
        {
            "_id": "bqsJMu7IB225fTYz",
            "collection": "pf2e.equipment-srd",
            "drawn": false,
            "flags": {},
            "img": "systems/pf2e/icons/equipment/consumables/talismans/iron-medallion.jpg",
            "range": [
                55,
                60
            ],
            "resultId": "ewzJzyJ4Vo9lZKvp",
            "text": "Iron Medallion",
            "type": 2,
            "weight": 6
        },
        {
            "_id": "kQTbzpAKyDIdb9PY",
            "collection": "pf2e.equipment-srd",
            "drawn": false,
            "flags": {},
            "img": "systems/pf2e/icons/equipment/consumables/talismans/mummified-bat.jpg",
            "range": [
                61,
                66
            ],
            "resultId": "UnDjPxFOs6bldlcM",
            "text": "Mummified Bat",
            "type": 2,
            "weight": 6
        },
        {
            "_id": "11E6i8082Hr9VbAI",
            "collection": "pf2e.equipment-srd",
            "drawn": false,
            "flags": {},
            "img": "systems/pf2e/icons/equipment/consumables/talismans/vanishing-coin.jpg",
            "range": [
                67,
                72
            ],
            "resultId": "dBevXop3G2P3PGjp",
            "text": "Vanishing Coin",
            "type": 2,
            "weight": 6
        }
    ]
}
