{
    "_id": "wIJC00ODLq9WYc1m",
    "data": {
        "actionCategory": {
            "value": ""
        },
        "actionType": {
            "value": "passive"
        },
        "actions": {
            "value": ""
        },
        "description": {
            "chat": "",
            "unidentified": "",
            "value": "<p>You can project your premonitions of danger to your allies. When you use Premonition of Avoidance, allies within 15 feet of you who are rolling the same saving throw against the same hazard also gain a +2 circumstance bonus to their saving throws.</p>"
        },
        "featType": {
            "value": "class"
        },
        "level": {
            "value": "10"
        },
        "prerequisites": {
            "value": [
                "Premonition of Avoidance"
            ]
        },
        "rarity": {
            "value": "common"
        },
        "rules": [],
        "source": {
            "value": ""
        },
        "traits": {
            "rarity": {
                "value": "common"
            },
            "value": [
                "cleric"
            ]
        },
        "usage": {
            "value": ""
        }
    },
    "flags": {},
    "img": "systems/pf2e/icons/features/feats/feats.jpg",
    "name": "Shared Avoidance",
    "permission": {
        "default": 0
    },
    "type": "feat"
}
