{
    "_id": "hghR0f5IetZBvyDR",
    "data": {
        "actionCategory": {
            "value": ""
        },
        "actionType": {
            "value": "passive"
        },
        "actions": {
            "value": ""
        },
        "containerId": {
            "value": ""
        },
        "description": {
            "chat": "",
            "unidentified": "",
            "value": "<p><strong>[Heroic]</strong></p>\n<p><strong>Prerequisites:</strong> Tier 3 with the Vigilant Seal</p>\n<p><strong>Cost</strong>: 4 Fame</p>\n<p><strong>Effect</strong>: When you spend your Hero Points to avoid death, you can choose to immediately wake up with 1 Hit Point.</p>\n<p><strong>Normal</strong>: When you spend your Hero Points to avoid death, you stabilize with 0 Hit Points, but you do not wake up until your Hit Points rise above 0.</p>"
        },
        "featType": {
            "value": "pfsboon"
        },
        "level": {
            "value": "0"
        },
        "prerequisites": {
            "value": ""
        },
        "rarity": {
            "value": "common"
        },
        "source": {
            "value": ""
        },
        "traits": {
            "custom": "",
            "rarity": {
                "value": "common"
            },
            "selected": {},
            "value": []
        },
        "usage": {
            "value": "held-in-one-hand"
        }
    },
    "flags": {},
    "img": "systems/pf2e/icons/default-icons/mystery-man.png",
    "name": "Heroic Defiance",
    "permission": {
        "default": 0
    },
    "type": "feat"
}
