{
    "_id": "UmJGUUgN9TQtFQDI",
    "description": "Table of 8th-Level Consumables Items",
    "displayRoll": true,
    "flags": {
        "core": {
            "sourceId": "RollTable.PLmJzdJJj6jWVnBt"
        }
    },
    "formula": "1d72",
    "img": "icons/svg/d20-grey.svg",
    "name": "8th-Level Consumables Items",
    "permission": {
        "default": 0
    },
    "replacement": true,
    "results": [
        {
            "_id": "mYq4p5qykRLe1Ok4",
            "collection": "pf2e.equipment-srd",
            "drawn": false,
            "flags": {},
            "img": "systems/pf2e/icons/equipment/consumables/other-consumables/candle-of-truth.jpg",
            "range": [
                1,
                3
            ],
            "resultId": "61mFRFnaCLHDtvdv",
            "text": "Candle of Truth",
            "type": 2,
            "weight": 3
        },
        {
            "_id": "k455WZW8SCQLXbsv",
            "collection": "pf2e.equipment-srd",
            "drawn": false,
            "flags": {},
            "img": "systems/pf2e/icons/equipment/consumables/other-consumables/feather-token.jpg",
            "range": [
                4,
                9
            ],
            "resultId": "WzsKbMMewXbf1nws",
            "text": "Feather Token (Swan Boat)",
            "type": 2,
            "weight": 6
        },
        {
            "_id": "3EqXFbXhBaS3HemC",
            "collection": "pf2e.equipment-srd",
            "drawn": false,
            "flags": {},
            "img": "systems/pf2e/icons/equipment/alchemical-items/alchemical-elixirs/darkvision-elixir.jpg",
            "range": [
                10,
                15
            ],
            "resultId": "bz8Y8bVUe7QfBk9g",
            "text": "Darkvision Elixir (Greater)",
            "type": 2,
            "weight": 6
        },
        {
            "_id": "oLZsd9xeniDUB97N",
            "collection": "pf2e.equipment-srd",
            "drawn": false,
            "flags": {},
            "img": "systems/pf2e/icons/equipment/alchemical-items/alchemical-poisons/nettleweed-residue.jpg",
            "range": [
                16,
                21
            ],
            "resultId": "KdeeRCrtsDCJLfgc",
            "text": "Nettleweed Residue",
            "type": 2,
            "weight": 6
        },
        {
            "_id": "zz0eL7k3QNTKNXc3",
            "collection": "pf2e.equipment-srd",
            "drawn": false,
            "flags": {},
            "img": "systems/pf2e/icons/equipment/alchemical-items/alchemical-poisons/wyvern-poison.jpg",
            "range": [
                22,
                27
            ],
            "resultId": "WL4O32qFifxnMj0H",
            "text": "Wyvern Poison",
            "type": 2,
            "weight": 6
        },
        {
            "_id": "lLzSpPUauPOj4sfl",
            "collection": "pf2e.equipment-srd",
            "drawn": false,
            "flags": {},
            "img": "systems/pf2e/icons/equipment/consumables/potions/potion-of-flying.jpg",
            "range": [
                28,
                33
            ],
            "resultId": "KlJSw919hpN6V9oK",
            "text": "Potion of Flying (Standard)",
            "type": 2,
            "weight": 6
        },
        {
            "_id": "HpyqvpBDM6D2jUC6",
            "collection": "pf2e.equipment-srd",
            "drawn": false,
            "flags": {},
            "img": "systems/pf2e/icons/equipment/consumables/potions/potion-of-quickness.jpg",
            "range": [
                34,
                39
            ],
            "resultId": "kORpovlPYicysr2g",
            "text": "Potion of Quickness",
            "type": 2,
            "weight": 6
        },
        {
            "_id": "bqsJMu7IB225fTYz",
            "collection": "pf2e.equipment-srd",
            "drawn": false,
            "flags": {},
            "img": "systems/pf2e/icons/equipment/weapons/shrinking-potion-greater.jpg",
            "range": [
                40,
                45
            ],
            "resultId": "5xsfj30uXMKINxnk",
            "text": "Shrinking Potion (Greater)",
            "type": 2,
            "weight": 6
        },
        {
            "_id": "kQTbzpAKyDIdb9PY",
            "collection": "pf2e.equipment-srd",
            "drawn": false,
            "flags": {},
            "img": "systems/pf2e/icons/equipment/snares/bomb-snare.jpg",
            "range": [
                46,
                51
            ],
            "resultId": "axU0I9xIm4xm2VPH",
            "text": "Bomb Snare",
            "type": 2,
            "weight": 6
        },
        {
            "_id": "11E6i8082Hr9VbAI",
            "collection": "pf2e.equipment-srd",
            "drawn": false,
            "flags": {},
            "img": "systems/pf2e/icons/equipment/snares/grasping-snare.jpg",
            "range": [
                52,
                54
            ],
            "resultId": "TFnr9Gq7VXPJu0GQ",
            "text": "Grasping Snare",
            "type": 2,
            "weight": 3
        },
        {
            "_id": "61ajGdu6KUgCbRhV",
            "collection": "pf2e.equipment-srd",
            "drawn": false,
            "flags": {},
            "img": "systems/pf2e/icons/equipment/snares/striking-snare.jpg",
            "range": [
                55,
                60
            ],
            "resultId": "6KdYdFovFBivwI8M",
            "text": "Striking Snare",
            "type": 2,
            "weight": 6
        },
        {
            "_id": "eKm3g1vLvoZDKctH",
            "collection": "pf2e.equipment-srd",
            "drawn": false,
            "flags": {},
            "img": "systems/pf2e/icons/equipment/consumables/talismans/gallows-tooth.jpg",
            "range": [
                61,
                66
            ],
            "resultId": "u6g7AClRFEAj4lf4",
            "text": "Gallows Tooth",
            "type": 2,
            "weight": 6
        },
        {
            "_id": "1ULLBfpXeyX73K7j",
            "collection": "pf2e.equipment-srd",
            "drawn": false,
            "flags": {},
            "img": "systems/pf2e/icons/equipment/consumables/talismans/jade-bauble.jpg",
            "range": [
                67,
                72
            ],
            "resultId": "cKqZe5imzxqSnzwD",
            "text": "Jade Bauble",
            "type": 2,
            "weight": 6
        }
    ]
}
