{
    "_id": "Wb3FHiDuY6Nuc0N0",
    "data": {
        "actionCategory": {
            "value": ""
        },
        "actionType": {
            "value": "passive"
        },
        "actions": {
            "value": ""
        },
        "description": {
            "chat": "",
            "unidentified": "",
            "value": "<p>You are able to find and secure better labor than most. When securing a hireling for a service, that hireling gains a +2 circumstance bonus to all skill checks. This circumstance bonus applies to both trained and untrained hirelings and has no effect on the cost of the service or labor provided.</p>"
        },
        "featType": {
            "value": "general"
        },
        "level": {
            "value": "3"
        },
        "prerequisites": {
            "value": [
                "Charisma 14"
            ]
        },
        "rarity": {
            "value": "common"
        },
        "source": {
            "value": ""
        },
        "traits": {
            "rarity": {
                "value": "common"
            },
            "value": [
                "general"
            ]
        },
        "usage": {
            "value": ""
        }
    },
    "flags": {},
    "img": "systems/pf2e/icons/features/feats/feats.jpg",
    "name": "Hireling Manager",
    "permission": {
        "default": 0
    },
    "type": "feat"
}
