{
    "_id": "4lp8oG9A3zuqhPBS",
    "data": {
        "actionCategory": {
            "value": ""
        },
        "actionType": {
            "value": "passive"
        },
        "actions": {
            "value": ""
        },
        "description": {
            "chat": "",
            "unidentified": "",
            "value": "<p>You have become thoroughly adept with bardic weapons. You gain expert proficiency in simple weapons and unarmed attacks, plus the longsword, rapier, sap, shortbow, shortsword, and whip. When you critically succeed at an attack roll using one of these weapons while one of your compositions is active, you apply the critical specialization effect for that weapon.</p>"
        },
        "featType": {
            "value": "classfeature"
        },
        "level": {
            "value": "11"
        },
        "prerequisites": {
            "value": ""
        },
        "rarity": {
            "value": "common"
        },
        "source": {
            "value": ""
        },
        "traits": {
            "custom": "",
            "value": [
                "bard"
            ]
        },
        "usage": {
            "value": "held-in-one-hand"
        }
    },
    "flags": {},
    "img": "systems/pf2e/icons/features/classes/bard-weapon-expertise.jpg",
    "name": "Bard Weapon Expertise",
    "permission": {
        "default": 0
    },
    "type": "feat"
}
