{
    "_id": "zL6zUrt44tZYyuh4",
    "data": {
        "actionCategory": {
            "value": ""
        },
        "actionType": {
            "value": "passive"
        },
        "actions": {
            "value": ""
        },
        "description": {
            "chat": "",
            "unidentified": "",
            "value": "<p>Underestimating you is a grave mistake, but it's one others keep making. You've learned to take advantage of slips in your foes' defenses.</p>\n<p>When you @Compendium[pf2e.actionspf2e.Strike]{Strike} a @Compendium[pf2e.conditionitems.Flat-Footed]{Flat-Footed} creature using a melee weapon or unarmed attack that has the agile and finesse traits, it gains the backstabber trait.</p>"
        },
        "featType": {
            "value": "ancestry"
        },
        "level": {
            "value": "9"
        },
        "prerequisites": {
            "value": [
                ""
            ]
        },
        "rarity": {
            "value": "common"
        },
        "source": {
            "value": ""
        },
        "traits": {
            "rarity": {
                "value": "common"
            },
            "value": [
                "kobold"
            ]
        },
        "usage": {
            "value": ""
        }
    },
    "flags": {},
    "img": "systems/pf2e/icons/features/feats/feats.jpg",
    "name": "Between The Scales",
    "permission": {
        "default": 0
    },
    "type": "feat"
}
