{
    "_id": "VqzXfdbQQ2e8Hndr",
    "data": {
        "actionCategory": {
            "value": ""
        },
        "actionType": {
            "value": "passive"
        },
        "actions": {
            "value": ""
        },
        "description": {
            "chat": "",
            "unidentified": "",
            "value": "<p>Your faith and hope can't be shaken, and you won't flee when lives are at stake. You gain a +1 circumstance bonus on saves against fear effects and emotion effects that inflict despair. When you would gain the fleeing condition, you can choose to stand your ground and be stunned for the effect's duration as well, preventing you from running and allowing you to re-enter the fight more quickly when the effect ends.</p>"
        },
        "featType": {
            "value": "archetype"
        },
        "level": {
            "value": "8"
        },
        "prerequisites": {
            "value": [
                "Knight Vigilant",
                "expert in Will saves"
            ]
        },
        "rarity": {
            "value": "common"
        },
        "rules": [],
        "source": {
            "value": ""
        },
        "traits": {
            "custom": "",
            "rarity": {
                "value": "common"
            },
            "value": [
                "archetype"
            ]
        },
        "usage": {
            "value": "held-in-one-hand"
        }
    },
    "flags": {},
    "img": "systems/pf2e/icons/features/feats/feats.jpg",
    "name": "Unshakable Idealism",
    "permission": {
        "default": 0
    },
    "type": "feat"
}
