{
    "_id": "fYVFBnv9aVHv1UNg",
    "data": {
        "actionCategory": {
            "value": ""
        },
        "actionType": {
            "value": "reaction"
        },
        "actions": {
            "value": ""
        },
        "description": {
            "chat": "",
            "unidentified": "",
            "value": "<p><strong>Trigger</strong>You attempt a saving throw against a spell or magical effect, but haven't rolled yet.<br /></p>\n<hr />\n<p>You notice spirits that inhabit objects, learning which bring good fortune and which are unlucky. You focus on the power of a lucky object, granting you a +1 circumstance bonus to your saving throw against the triggering effect.</p>"
        },
        "featType": {
            "value": "ancestry"
        },
        "level": {
            "value": "1"
        },
        "prerequisites": {
            "value": [
                ""
            ]
        },
        "rarity": {
            "value": "common"
        },
        "source": {
            "value": ""
        },
        "traits": {
            "custom": "",
            "rarity": {
                "value": "common"
            },
            "value": [
                "leshy"
            ]
        },
        "usage": {
            "value": "held-in-one-hand"
        }
    },
    "flags": {},
    "img": "systems/pf2e/icons/features/feats/feats.jpg",
    "name": "Leshy Superstition",
    "permission": {
        "default": 0
    },
    "type": "feat"
}
