{
    "_id": "gS9FYlD0Vt8yyZkP",
    "data": {
        "actionCategory": {
            "value": ""
        },
        "actionType": {
            "value": "action"
        },
        "actions": {
            "value": "1"
        },
        "description": {
            "chat": "",
            "unidentified": "",
            "value": "<p>With obsequious words and begging gestures, you convince your foe you're less of a threat.</p>\n<p>You attempt to @Compendium[pf2e.actionspf2e.Feint]{Feint} against a creature. Unlike a normal Feint, the creature can be within 30 feet instead of in your melee reach, and you make your check against its Will DC instead of its Perception DC.</p>"
        },
        "featType": {
            "value": "ancestry"
        },
        "level": {
            "value": "5"
        },
        "prerequisites": {
            "value": [
                "trained in Deception"
            ]
        },
        "rarity": {
            "value": "common"
        },
        "source": {
            "value": ""
        },
        "traits": {
            "rarity": {
                "value": "common"
            },
            "value": [
                "auditory",
                "concentrate",
                "emotion",
                "kobold",
                "mental"
            ]
        },
        "usage": {
            "value": ""
        }
    },
    "flags": {},
    "img": "systems/pf2e/icons/features/feats/feats.jpg",
    "name": "Grovel",
    "permission": {
        "default": 0
    },
    "type": "feat"
}
