{
    "_id": "PSs31Xj5RfszMbAe",
    "description": "Table of 18th-Level Consumables Items",
    "displayRoll": true,
    "flags": {
        "core": {
            "sourceId": "RollTable.eVfmlS5THTDuAcwN"
        }
    },
    "formula": "1d18",
    "img": "icons/svg/d20-grey.svg",
    "name": "18th-Level Consumables",
    "permission": {
        "default": 0
    },
    "replacement": true,
    "results": [
        {
            "_id": "JUhkDL3C0e5g0N8w",
            "collection": "pf2e.equipment-srd",
            "drawn": false,
            "flags": {},
            "img": "systems/pf2e/icons/equipment/alchemical-items/alchemical-poisons/kings-sleep.jpg",
            "range": [
                1,
                6
            ],
            "resultId": "RkI3jKKrCozvEvfr",
            "text": "King's Sleep",
            "type": 2,
            "weight": 6
        },
        {
            "_id": "yHmHb5vJkmqmywHU",
            "collection": "pf2e.equipment-srd",
            "drawn": false,
            "flags": {},
            "img": "systems/pf2e/icons/equipment/consumables/potions/healing-potion.jpg",
            "range": [
                7,
                12
            ],
            "resultId": "p3ppzFSsZXFRe3H8",
            "text": "Healing Potion (Major)",
            "type": 2,
            "weight": 6
        },
        {
            "_id": "IyJWyGEjEFTlgBWX",
            "collection": "pf2e.equipment-srd",
            "drawn": false,
            "flags": {},
            "img": "systems/pf2e/icons/equipment/consumables/potions/potion-of-undetectability.jpg",
            "range": [
                13,
                18
            ],
            "resultId": "UblsH5cGyUdXypek",
            "text": "Potion of Undetectability",
            "type": 2,
            "weight": 6
        }
    ]
}
