{
    "_id": "wijzB1FDUT7SC86a",
    "data": {
        "actionCategory": {
            "value": ""
        },
        "actionType": {
            "value": "passive"
        },
        "actions": {
            "value": ""
        },
        "description": {
            "chat": "",
            "unidentified": "",
            "value": "<p>You've trained your mount to perform in unusual or even extreme circumstances, granting it abilities far beyond others of its kind. Your mount gains one specialization of your choice.</p>\n<p><strong>Special</strong> You can select this feat up to three times. Each time, add a different specialization to your mount. You mount can't have more than three specializations.</p>"
        },
        "featType": {
            "value": "archetype"
        },
        "level": {
            "value": "14"
        },
        "prerequisites": {
            "value": [
                "Incredible Mount"
            ]
        },
        "rarity": {
            "value": "common"
        },
        "rules": [],
        "source": {
            "value": ""
        },
        "traits": {
            "rarity": {
                "value": "common"
            },
            "value": [
                "archetype"
            ]
        },
        "usage": {
            "value": ""
        }
    },
    "flags": {},
    "img": "systems/pf2e/icons/features/feats/feats.jpg",
    "name": "Specialized Mount",
    "permission": {
        "default": 0
    },
    "type": "feat"
}
