{
    "_id": "iS7hAQMAaThHYE8g",
    "data": {
        "brokenThreshold": {
            "value": 0
        },
        "bulkCapacity": {
            "value": ""
        },
        "collapsed": {
            "value": false
        },
        "containerId": {
            "value": ""
        },
        "description": {
            "chat": "",
            "unidentified": "",
            "value": "<p>This ornate copper band has a small ruby set in the center, flanked by a pair of dwarven runes. The wearer of this ring gains the ability to understand, read, and speak one common language of their choice, selected each morning as part of their daily preparations.</p>\n<p>In addition, the wearer receives a +1 item bonus to Diplomacy checks to Make an Impression.</p>\n<hr />\n<p>Automatically applied effects:</p>\n<ul>\n<li>+1 item bonus to Diplomacy checks to Make an Impression.</li>\n</ul>"
        },
        "equipped": {
            "value": false
        },
        "equippedBulk": {
            "value": ""
        },
        "hardness": {
            "value": 0
        },
        "hp": {
            "value": 0
        },
        "identified": {
            "value": true
        },
        "invested": {
            "value": false
        },
        "level": {
            "value": "5"
        },
        "maxHp": {
            "value": 0
        },
        "negateBulk": {
            "value": ""
        },
        "preciousMaterial": {
            "value": ""
        },
        "preciousMaterialGrade": {
            "value": ""
        },
        "price": {
            "value": "160 gp"
        },
        "quantity": {
            "value": "1"
        },
        "rarity": {
            "value": "common"
        },
        "rules": [
            {
                "key": "PF2E.RuleElement.FlatModifier",
                "label": "Bort's Blessing (Make an Impression)",
                "predicate": {
                    "any": [
                        "make-an-impression"
                    ]
                },
                "selector": "diplomacy",
                "type": "item",
                "value": 1
            }
        ],
        "source": {
            "value": ""
        },
        "stackGroup": {
            "value": ""
        },
        "traits": {
            "custom": "",
            "rarity": {
                "value": "rare"
            },
            "usage": {
                "value": "worn"
            },
            "value": [
                "divination",
                "invested"
            ]
        },
        "usage": {
            "value": "held-in-one-hand"
        },
        "weight": {
            "value": "-"
        }
    },
    "flags": {},
    "img": "systems/pf2e/icons/equipment/worn-items/other-worn-items/borts-blessing.jpg",
    "name": "Bort's Blessing",
    "permission": {
        "default": 0
    },
    "type": "equipment"
}
