{
    "_id": "v66R7FdOf11l94im",
    "data": {
        "active": true,
        "alsoApplies": {
            "linked": [],
            "unlinked": []
        },
        "base": "Friendly",
        "description": {
            "chat": "",
            "unidentified": "",
            "value": "<p>This condition reflects a creature's disposition toward a particular character, and it affects only creatures that are not player characters. A creature that is friendly to a character likes that character. The character can attempt to make a @Compendium[pf2e.actionspf2e.Request]{Request} of a friendly creature, and the friendly creature is likely to agree to a simple and safe request that doesn't cost it much to fulfill. If the character or one of their allies uses hostile actions against the creature, the creature gains a worse attitude condition depending on the severity of the hostile action, as determined by the GM.</p>"
        },
        "duration": {
            "perpetual": true,
            "text": "",
            "value": 0
        },
        "group": "attitudes",
        "hud": {
            "img": {
                "useStatusName": true,
                "value": "systems/pf2e/icons/conditions-2/friendly.png"
            },
            "selectable": true,
            "statusName": "friendly"
        },
        "modifiers": [],
        "overrides": [
            "Friendly",
            "Hostile",
            "Indifferent",
            "Unfriendly"
        ],
        "rarity": {
            "value": "common"
        },
        "references": {
            "children": [],
            "immunityFrom": [],
            "overriddenBy": [],
            "overrides": []
        },
        "removable": true,
        "rules": [],
        "source": {
            "value": ""
        },
        "sources": {
            "hud": false
        },
        "traits": {
            "value": []
        },
        "usage": {
            "value": "held-in-one-hand"
        },
        "value": {
            "immutable": false,
            "isValued": false,
            "modifiers": [],
            "value": 1
        }
    },
    "effects": [],
    "flags": {
        "pf2e": {
            "condition": true
        }
    },
    "img": "systems/pf2e/icons/conditions/friendly.png",
    "name": "Friendly",
    "permission": {
        "default": 0
    },
    "type": "condition"
}
