{
    "_id": "EdVMwFRNV1LX1VWh",
    "data": {
        "actionCategory": {
            "value": ""
        },
        "actionType": {
            "value": "action"
        },
        "actions": {
            "value": "2"
        },
        "description": {
            "chat": "",
            "unidentified": "",
            "value": "<p>You can balance on your toes to step carefully over obstructions.</p>\n<p>You @Compendium[pf2e.actionspf2e.Stride]{Stride} and then @Compendium[pf2e.actionspf2e.Step]{Step}, or Step and then Stride, ignoring difficult terrain during this movement.</p>"
        },
        "featType": {
            "value": "ancestry"
        },
        "level": {
            "value": "5"
        },
        "prerequisites": {
            "value": [
                ""
            ]
        },
        "rarity": {
            "value": "common"
        },
        "source": {
            "value": ""
        },
        "traits": {
            "rarity": {
                "value": "common"
            },
            "value": [
                "catfolk"
            ]
        },
        "usage": {
            "value": ""
        }
    },
    "flags": {},
    "img": "systems/pf2e/icons/features/feats/feats.jpg",
    "name": "Light Paws",
    "permission": {
        "default": 0
    },
    "type": "feat"
}
