{
    "_id": "PCQtpTKiGfSSRwNV",
    "data": {
        "brokenThreshold": {
            "value": 0
        },
        "bulkCapacity": {
            "value": ""
        },
        "collapsed": {
            "value": false
        },
        "containerId": {
            "value": ""
        },
        "description": {
            "chat": "",
            "unidentified": "",
            "value": "<p>These simple lenses are alchemically treated to detect the faint smoke trail from a piece of specially formulated sandalwood incense. This incense has an odor undetectable by most people and a long burn time, making it perfect for discreetly tracking individuals. A stick of this incense costs 1 sp and can safely burn for up to 8 hours. While wearing the lenses, you see alchemical fumes in a distinct green tint, granting you a +1 item bonus to <em>Survival </em>checks to <em>Track </em>a creature marked with the incense and to Perception checks to <em>Seek </em>any alchemical vapors. If the smoke is fresh, Tracking via the incense's fumes might use a lower DC than normal for tracking a creature walking on firm surfaces.</p>"
        },
        "equipped": {
            "value": false
        },
        "equippedBulk": {
            "value": ""
        },
        "hardness": {
            "value": 0
        },
        "hp": {
            "value": 0
        },
        "identified": {
            "value": true
        },
        "invested": {
            "value": false
        },
        "level": {
            "value": "3"
        },
        "maxHp": {
            "value": 0
        },
        "negateBulk": {
            "value": "0"
        },
        "preciousMaterial": {
            "value": ""
        },
        "preciousMaterialGrade": {
            "value": ""
        },
        "price": {
            "value": "40 gp"
        },
        "quantity": {
            "value": "1"
        },
        "rarity": {
            "value": "common"
        },
        "rules": [],
        "source": {
            "value": ""
        },
        "stackGroup": {
            "value": ""
        },
        "traits": {
            "custom": "",
            "rarity": {
                "value": "rare"
            },
            "usage": {
                "value": "worneyepiece"
            },
            "value": [
                "alchemical"
            ]
        },
        "usage": {
            "value": "held-in-one-hand"
        },
        "weight": {
            "value": "L"
        }
    },
    "flags": {},
    "img": "systems/pf2e/icons/equipment/alchemical-items/alchemical-tools/vestige-lenses.jpg",
    "name": "Vestige Lenses",
    "permission": {
        "default": 0
    },
    "type": "equipment"
}
