{
    "_id": "HeRHBo2NaKy5IxhU",
    "data": {
        "description": {
            "chat": "",
            "unidentified": "",
            "value": "<p>Granted by @Compendium[pf2e.equipment-srd.Antiplague (Moderate)]{Antiplague (Moderate)}</p>\n<p>Implemented effects:</p>\n<ul>\n<li>+3 item bonus to Fortitude saves against diseases</li>\n</ul>"
        },
        "level": {
            "value": 6
        },
        "rarity": {
            "value": "common"
        },
        "rules": [
            {
                "key": "PF2E.RuleElement.FlatModifier",
                "label": "Antiplague Moderate(vs. disease)",
                "predicate": {
                    "all": [
                        "disease"
                    ]
                },
                "selector": "fortitude",
                "type": "item",
                "value": 3
            },
            {
                "key": "PF2E.RuleElement.TokenEffectIcon"
            }
        ],
        "source": {
            "value": ""
        },
        "traits": {
            "value": []
        },
        "usage": {
            "value": "held-in-one-hand"
        }
    },
    "effects": [],
    "flags": {},
    "img": "systems/pf2e/icons/equipment/alchemical-items/alchemical-elixirs/antiplague.jpg",
    "name": "Effect: Antiplague (Moderate)",
    "permission": {
        "default": 0
    },
    "type": "effect"
}
