{
    "_id": "Qfn7lmOeXfBtpG4O",
    "data": {
        "actionCategory": {
            "value": ""
        },
        "actionType": {
            "value": "action"
        },
        "actions": {
            "value": "1"
        },
        "description": {
            "chat": "",
            "unidentified": "",
            "value": "<p>You stab two foes with a single thrust or bash them together with one punch.</p>\n<p>Make a bludgeoning or piercing melee @Compendium[pf2e.actionspf2e.Strike]{Strike} and compare the attack roll result against the AC of up to two foes. One foe must be adjacent to you, and the other foe must be adjacent to and directly behind the first foe, in a straight line from your space. Roll damage once and apply it to each creature you hit.</p>\n<p>An Impaling Finisher counts as two attacks when calculating your multiple attack penalty.</p>"
        },
        "featType": {
            "value": "class"
        },
        "level": {
            "value": "4"
        },
        "prerequisites": {
            "value": [
                ""
            ]
        },
        "rarity": {
            "value": "common"
        },
        "source": {
            "value": ""
        },
        "traits": {
            "rarity": {
                "value": "common"
            },
            "value": [
                "finisher",
                "swashbuckler"
            ]
        },
        "usage": {
            "value": ""
        }
    },
    "flags": {},
    "img": "systems/pf2e/icons/features/feats/feats.jpg",
    "name": "Impaling Finisher",
    "permission": {
        "default": 0
    },
    "type": "feat"
}
