{
    "_id": "iKnFPR1X8mOAeVCV",
    "data": {
        "description": {
            "chat": "",
            "unidentified": "",
            "value": "<div><strong>Gear</strong> adventurer's pack, 2 sets of caltrops, religious symbol (wooden)</div>\n<div><strong>Options</strong> your deity's favored weapon (see the deity entries on pages 437-441; use the Price listed in this chapter), @Compendium[pf2e.equipment-srd.Hide]{hide armor} (2 gp)</div>"
        },
        "equippedBulk": {
            "value": ""
        },
        "items": {
            "t0j8k": {
                "id": "2req0jGaxz8hScdB",
                "img": "systems/pf2e/icons/equipment/adventuring-gear/adventurers-pack.jpg",
                "isContainer": true,
                "items": {},
                "name": "Adventurer's Pack",
                "pack": "pf2e.equipment-srd",
                "quantity": 1
            },
            "tmqlp": {
                "id": "7fSnvJ2xoSfa6JXD",
                "img": "systems/pf2e/icons/equipment/adventuring-gear/caltrops.jpg",
                "isContainer": false,
                "items": {},
                "name": "Caltrops",
                "pack": "pf2e.equipment-srd",
                "quantity": 2
            },
            "y2yug": {
                "id": "plplsXJsqrdqNQVI",
                "img": "systems/pf2e/icons/equipment/adventuring-gear/religious-symbol-wooden.jpg",
                "isContainer": false,
                "items": {},
                "name": "Religious Symbol (Wooden)",
                "pack": "pf2e.equipment-srd",
                "quantity": 1
            }
        },
        "price": {
            "value": "2 gp, 2 sp"
        },
        "rarity": {
            "value": "common"
        },
        "source": {
            "value": ""
        },
        "traits": {
            "custom": "",
            "rarity": {
                "value": "common"
            },
            "value": [
                "cleric"
            ]
        },
        "usage": {
            "value": "held-in-one-hand"
        },
        "weight": {
            "value": "-"
        }
    },
    "effects": [],
    "flags": {},
    "img": "systems/pf2e/icons/equipment/adventuring-gear/classkit-cleric.jpg",
    "name": "Class Kit (Cleric)",
    "permission": {
        "default": 0
    },
    "type": "kit"
}
