{
    "_id": "Y6qKcSXLEyBfW3lS",
    "content": "<p><span id=\"ctl00_MainContent_DetailedOutput\">With a strong back and an understanding of seasonal cycles, you tilled the land and tended crops. Your farm could have been razed by invaders, you could have lost the family tying you to the land, or you might have simply tired of the drudgery, but at some point you became an adventurer.<br /></span></p>\n<p><span id=\"ctl00_MainContent_DetailedOutput\">Choose two ability boosts. One must be to <strong>Constitution</strong> or <strong>Wisdom</strong>, and one is a free ability boost.<br /></span></p>\n<p><span id=\"ctl00_MainContent_DetailedOutput\">You're trained in the Athletics skill and the Farming Lore skill. You gain the @Compendium[pf2e.feats-srd.Assurance]{Assurance} skill feat with Athletics.</span></p>",
    "flags": {},
    "name": "Farmhand",
    "permission": {
        "default": 0
    }
}
