{
    "_id": "d3Wsm7KdS5NBsMwf",
    "content": "<p><span id=\"docs-internal-guid-983e0bff-7fff-63ac-59cd-bd3870ef8cd3\">Haircuts, dentistry, bloodletting, and surgery-if it takes a steady hand and a razor, you do it. You may have taken to the road to expand your skills, or to test yourself against a world that leaves your patients so battered and bruised. </span></p>\n<p><span id=\"docs-internal-guid-983e0bff-7fff-63ac-59cd-bd3870ef8cd3\">Choose two ability boosts. One must be to <strong>Dexterity</strong> or <strong>Wisdom</strong>, and one is a free ability boost. </span></p>\n<p><span id=\"docs-internal-guid-983e0bff-7fff-63ac-59cd-bd3870ef8cd3\">You're trained in the Medicine skill and the Surgery Lore skill. You gain the @Compendium[pf2e.feats-srd.Risky Surgery]{Risky Surgery} skill feat (page 208). </span></p>",
    "flags": {},
    "name": "Barber",
    "permission": {
        "default": 0
    }
}
