{
    "_id": "XttSGDuAsRDTuvgS",
    "data": {
        "actionCategory": {
            "value": ""
        },
        "actionType": {
            "value": "passive"
        },
        "actions": {
            "value": ""
        },
        "description": {
            "chat": "",
            "unidentified": "",
            "value": "<p>Disobeying your @Compendium[pf2e.actionspf2e.Iron Command]{Iron Command} has lasting consequences. If an enemy refuses to kneel to you, you can deal persistent mental damage instead of normal mental damage. You must decide whether the mental damage will be persistent before your enemy chooses whether to kneel or not. The amount of damage is unchanged.</p>"
        },
        "featType": {
            "value": "class"
        },
        "level": {
            "value": "1"
        },
        "prerequisites": {
            "value": [
                "tyrant cause"
            ]
        },
        "rarity": {
            "value": "common"
        },
        "source": {
            "value": ""
        },
        "traits": {
            "rarity": {
                "value": "common"
            },
            "value": [
                "uncommon",
                "champion"
            ]
        },
        "usage": {
            "value": ""
        }
    },
    "flags": {},
    "img": "systems/pf2e/icons/features/feats/feats.jpg",
    "name": "Iron Repercussions",
    "permission": {
        "default": 0
    },
    "type": "feat"
}
