{
    "_id": "Z9oPh462q82IYIZ6",
    "data": {
        "description": {
            "chat": "",
            "unidentified": "",
            "value": "<p>Granted by @Compendium[pf2e.equipment-srd.Elixir of Life (Greater)]{Elixir of Life (Greater)}</p>\n<p>Implemented effects:</p>\n<ul>\n<li>+2 item bonus to saving throws against diseases and poisons</li>\n</ul>\n<p>Unimplemented effects:</p>\n<ul>\n<li>Heal [[/r 7d6+18]] Hit Points</li>\n</ul>\n<p></p>"
        },
        "level": {
            "value": 13
        },
        "rarity": {
            "value": "common"
        },
        "rules": [
            {
                "key": "PF2E.RuleElement.FlatModifier",
                "label": "Elixir of Life, Greater (vs. disease & poison)",
                "predicate": {
                    "all": [
                        "disease and poison"
                    ]
                },
                "selector": "saving-throw",
                "type": "item",
                "value": 2
            },
            {
                "key": "PF2E.RuleElement.TokenEffectIcon"
            }
        ],
        "source": {
            "value": ""
        },
        "traits": {
            "value": []
        },
        "usage": {
            "value": "held-in-one-hand"
        }
    },
    "effects": [],
    "flags": {},
    "img": "systems/pf2e/icons/equipment/alchemical-items/alchemical-elixirs/elixir-of-life.jpg",
    "name": "Effect: Elixir of Life (Greater)",
    "permission": {
        "default": 0
    },
    "type": "effect"
}
