{
    "_id": "lgo65ldX7WkXC8Ir",
    "data": {
        "actionCategory": {
            "value": ""
        },
        "actionType": {
            "value": "passive"
        },
        "actions": {
            "value": ""
        },
        "description": {
            "chat": "",
            "unidentified": "",
            "value": "<p>You can play out a battle in your head, using brains rather than brawn to execute an attack.</p>\n<p>You gain the @Compendium[pf2e.actionspf2e.Devise a Stratagem]{Devise a Stratagem} action.</p>"
        },
        "featType": {
            "value": "classfeature"
        },
        "level": {
            "value": "1"
        },
        "prerequisites": {
            "value": ""
        },
        "rarity": {
            "value": "common"
        },
        "rules": [],
        "source": {
            "value": ""
        },
        "traits": {
            "custom": "",
            "rarity": {
                "value": "common"
            },
            "value": [
                "investigator"
            ]
        },
        "usage": {
            "value": "held-in-one-hand"
        }
    },
    "effects": [],
    "flags": {},
    "img": "systems/pf2e/icons/features/classes/devise-a-stratagem.jpg",
    "name": "Devise a Stratagem",
    "permission": {
        "default": 0
    },
    "type": "feat"
}
