{
    "_id": "O1C6pMTOxIrWBO3G",
    "data": {
        "actionCategory": {
            "value": ""
        },
        "actionType": {
            "value": "passive"
        },
        "actions": {
            "value": ""
        },
        "description": {
            "chat": "",
            "unidentified": "",
            "value": "<p>You make quick use of an opening from your daring stunts. At the end of a successful Daring Act, you can make a melee Strike against the target or attempt to @Compendium[pf2e.actionspf2e.Disarm]{Disarm} the target. The target is @Compendium[pf2e.conditionitems.Flat-Footed]{Flat-Footed} against the Strike you make during Daring Act as well as the next melee attack you attempt against it before the end of your turn.</p>"
        },
        "featType": {
            "value": "archetype"
        },
        "level": {
            "value": "10"
        },
        "prerequisites": {
            "value": [
                "Daring Act"
            ]
        },
        "rarity": {
            "value": "common"
        },
        "source": {
            "value": ""
        },
        "traits": {
            "custom": "",
            "rarity": {
                "value": "common"
            },
            "value": [
                "archetype"
            ]
        },
        "usage": {
            "value": "held-in-one-hand"
        }
    },
    "flags": {},
    "img": "systems/pf2e/icons/features/feats/feats.jpg",
    "name": "Daring Flourish",
    "permission": {
        "default": 0
    },
    "type": "feat"
}
