{
    "_id": "rfnEcjxIFqwlJwJT",
    "data": {
        "actionCategory": {
            "value": ""
        },
        "actionType": {
            "value": "action"
        },
        "actions": {
            "value": "2"
        },
        "description": {
            "chat": "",
            "unidentified": "",
            "value": "<p><strong>Requirements</strong> You are holding healer's tools, or you are wearing them and have a hand free.</p>\n<hr />\n<p>You treat an adjacent creature in an attempt to reduce the @Compendium[pf2e.conditionitems.Clumsy]{Clumsy}, @Compendium[pf2e.conditionitems.Enfeebled]{Enfeebled}, or @Compendium[pf2e.conditionitems.Sickened]{Sickened} condition. If a creature has multiple conditions from this list, choose one.</p>\n<p>Attempt a counteract check against the condition, using your Medicine modifier as your counteract modifier and the condition's source to determine the DC.</p>\n<p>You can't treat a condition that came from an artifact or effect above 20th level unless you have Legendary Medic; even if you do, the counteract DC increases by 10.</p>\n<p>Treating a Condition that is continually applied under certain circumstances (for instance, the enfeebled condition a good character gains from carrying an <em>unholy</em> weapon) has no effect as long as the circumstances continue.</p>\n<hr />\n<p><strong>Critical Success</strong> Reduce the condition value by 2.</p>\n<p><strong>Success</strong> Reduce the condition value by 1.</p>\n<p><strong>Critical Failure</strong> Increase the condition value by 1.</p>"
        },
        "featType": {
            "value": "skill"
        },
        "level": {
            "value": "4"
        },
        "prerequisites": {
            "value": [
                "Medic Dedication"
            ]
        },
        "rarity": {
            "value": "common"
        },
        "rules": [],
        "source": {
            "value": ""
        },
        "traits": {
            "rarity": {
                "value": "common"
            },
            "value": [
                "archetype",
                "healing",
                "manipulate",
                "skill"
            ]
        },
        "usage": {
            "value": ""
        }
    },
    "flags": {},
    "img": "systems/pf2e/icons/features/feats/feats.jpg",
    "name": "Treat Condition",
    "permission": {
        "default": 0
    },
    "type": "feat"
}
