{
    "_id": "ymhcfbqpaiXrcCPW",
    "data": {
        "abilities": {
            "cha": {
                "min": 3,
                "mod": 1,
                "value": 12
            },
            "con": {
                "min": 3,
                "mod": 4,
                "value": 18
            },
            "dex": {
                "min": 3,
                "mod": 3,
                "value": 16
            },
            "int": {
                "min": 3,
                "mod": 0,
                "value": 10
            },
            "str": {
                "min": 3,
                "mod": "+4",
                "value": 18
            },
            "wis": {
                "min": 3,
                "mod": 2,
                "value": 14
            }
        },
        "attributes": {
            "ac": {
                "check": 0,
                "details": "",
                "dex": 0,
                "item": 0,
                "min": 0,
                "value": "18"
            },
            "allSaves": {
                "value": "+1 status to saves vs. magic, +4 status to saves vs. mental"
            },
            "ancestryhp": 0,
            "bonusEncumbranceBulk": 0,
            "bonusLimitBulk": 0,
            "classDC": {
                "ability": "str",
                "breakdown": "",
                "item": 0,
                "rank": 0,
                "value": 0
            },
            "classhp": 0,
            "flatbonushp": 0,
            "flatbonussp": 0,
            "hp": {
                "details": "",
                "max": "30",
                "min": 0,
                "temp": 0,
                "tempmax": 0,
                "value": "30"
            },
            "init": {
                "bonus": 0,
                "value": 0
            },
            "initiative": {
                "ability": "",
                "circumstance": 0,
                "status": 0
            },
            "levelbonushp": 0,
            "levelbonussp": 0,
            "perception": {
                "ability": "wis",
                "breakdown": "",
                "item": 0,
                "rank": 0,
                "value": 10
            },
            "resolve": {
                "value": 0
            },
            "shield": {
                "ac": 0,
                "brokenThreshold": 0,
                "hardness": 0,
                "max": 0,
                "min": 0,
                "value": 0
            },
            "sp": {
                "details": "",
                "max": 0,
                "min": 0,
                "value": 0
            },
            "speed": {
                "otherSpeeds": [],
                "special": "",
                "value": "30 feet"
            }
        },
        "currency": {
            "cp": {
                "value": 0
            },
            "gp": {
                "value": 0
            },
            "pp": {
                "value": 0
            },
            "sp": {
                "value": 0
            }
        },
        "details": {
            "alignment": {
                "value": "NE"
            },
            "ancestry": {
                "value": ""
            },
            "biography": {
                "public": "",
                "value": ""
            },
            "class": {
                "value": ""
            },
            "creatureType": "Aberration",
            "deity": {
                "image": "systems/pf2e/assets/sheet/deity.png",
                "value": ""
            },
            "flavorText": "Sinspawn were created by one of seven ancient wizards known collectively as runelords-each of whom embraced and embodied one of seven sins. The first sinspawn was created by the Runelord of Wrath, utilizing techniques that have since gone on to influence fleshwarping practices. It wasn't long before the technique used to create sinspawn fell into the hands of the other runelords, and while each tried their own hand at crafting variants of their own design, today sinspawn of wrath remain the most numerous and notorious of their kind. Bearing only a vague resemblance to the humanoids from whose flesh they were formed, sinspawn generally appear horrifically emaciated and have unnaturally long arms and digitigrade legs, each with a trio of stubby, taloned digits. Veins bulge across sinspawn's bodies in sanguine patterns that suspiciously resemble twisted runes, and their flesh is pale and hairless. Their heads are elongated, bearing only slits for a nose, red eyes, and disturbing lower jaws that split in half at the chin, revealing pedipalps that end in tiny, three-fingered hands and framing a long, lolling tongue. Sinspawn stand 6-1/2 feet tall and typically weigh as much as an emaciated human of their size. They behave in a manner consistent with their associated sin and have physical characteristics that hint at these qualities. For example, greedspawn's veins appear to run with gold while envyspawn appear even more wasted than the rest of their kin.Sinspawn Sins When a sinspawn is created, it becomes associated with one of the seven sins: envoy, gluttony, greed, lust, pride, sloth, or wrath. A sinspawn's sin is determined by the runewell that spawned it or by its creator's preferred sin, and cannot be changed. Each sin grants sinspawn associated with it additional benefits and abilities beyond those described by the sinspawn stat block, as detailed below.Envyspawn An envyspawn has Deception +7 and typically carries a halberd. They tend to be shorter and thinner than other sinspawn.<br /> Melee <img class=\"actiondark\" alt=\"Single Action\" style=\"height:15px; padding:0px 2px 0px 2px\" src=\"Images\\Actions\\OneAction.png\"><img class=\"actionlight\" alt=\"Single Action\" style=\"height:15px; padding:0px 2px 0px 2px\" src=\"Images\\Actions\\OneAction_I.png\"> halberd +10 (reach 10 feet, versatile S), Damage 1d10+4 piercing<br /> Sinful Bite Creatures that critically fail their saves against an envyspawn's sinful bite are enfeebled 2 for 1 minute. Gluttonyspawn A gluttonyspawn has Survival +10 and usually carries a scythe. They are obese, but hardy and strong.<br /> Melee <img class=\"actiondark\" alt=\"Single Action\" style=\"height:15px; padding:0px 2px 0px 2px\" src=\"Images\\Actions\\OneAction.png\"><img class=\"actionlight\" alt=\"Single Action\" style=\"height:15px; padding:0px 2px 0px 2px\" src=\"Images\\Actions\\OneAction_I.png\"> scythe +10 (deadly d10, trip), Damage 1d10+4 slashing<br /> Sinful Bite Creatures that critically fail their saves against a gluttonyspawn's sinful bite are drained 1. Greedspawn A greedspawn has Thievery +9 and typically wields a glaive. They are the tallest of sinspawn, often 7 feet in height, and with gold-tinged veins.<br /> Melee <img class=\"actiondark\" alt=\"Single Action\" style=\"height:15px; padding:0px 2px 0px 2px\" src=\"Images\\Actions\\OneAction.png\"><img class=\"actionlight\" alt=\"Single Action\" style=\"height:15px; padding:0px 2px 0px 2px\" src=\"Images\\Actions\\OneAction_I.png\"> glaive +10 (deadly d8, forceful, reach 10 feet), Damage 1d8+4 slashing<br /> Sinful Bite Creatures that critically fail their saves against a greedspawn's sinful bite are clumsy 2 for 1 minute. Lustspawn A lustspawn has Diplomacy +7 and usually carries a guisarme. They have attractive bodies, but hideous faces.<br /> Melee <img class=\"actiondark\" alt=\"Single Action\" style=\"height:15px; padding:0px 2px 0px 2px\" src=\"Images\\Actions\\OneAction.png\"><img class=\"actionlight\" alt=\"Single Action\" style=\"height:15px; padding:0px 2px 0px 2px\" src=\"Images\\Actions\\OneAction_I.png\"> guisarme +10 (reach 10 feet, trip), Damage 1d10+4 slashing<br /> Sinful Bite Creatures that critically fail their saves against a lustspawn's sinful bite are stupefied 2 for 1 minute. Pridespawn A pridespawn has Intimidation +7 and often wields a maul. They are nearly skeletal in their gauntness, and often seek out fine clothes or jewelry to wear, taking strange pleasure in appearing elegant and regal.<br /> Melee <img class=\"actiondark\" alt=\"Single Action\" style=\"height:15px; padding:0px 2px 0px 2px\" src=\"Images\\Actions\\OneAction.png\"><img class=\"actionlight\" alt=\"Single Action\" style=\"height:15px; padding:0px 2px 0px 2px\" src=\"Images\\Actions\\OneAction_I.png\"> maul +10 (shove), Damage 1d12+4 bludgeoning<br /> Sinful Bite Creatures that critically fail their saves against a pridespawn's sinful bite are clumsy 1 and enfeebled 1 for 1 minute. Slothspawn A slothspawn has Society +6 and usually carries a longspear. Thick rolls of excess skin drape the slothspawn's hunched frame.<br /> Melee <img class=\"actiondark\" alt=\"Single Action\" style=\"height:15px; padding:0px 2px 0px 2px\" src=\"Images\\Actions\\OneAction.png\"><img class=\"actionlight\" alt=\"Single Action\" style=\"height:15px; padding:0px 2px 0px 2px\" src=\"Images\\Actions\\OneAction_I.png\"> longspear +10 (reach 10 feet), Damage 1d8+4 piercing<br /> Sinful Bite Creatures that critically fail their saves against a slothspawn's sinful bite take a -10-foot status penalty to their Speeds for 1 minute. Wrathspawn The most commonly encountered of the sinspawn, a wrathspawn has Athletics +12 and typically wields a ranseur. These sinspawn are the bulkiest looking of their kind.<br /> Melee <img class=\"actiondark\" alt=\"Single Action\" style=\"height:15px; padding:0px 2px 0px 2px\" src=\"Images\\Actions\\OneAction.png\"><img class=\"actionlight\" alt=\"Single Action\" style=\"height:15px; padding:0px 2px 0px 2px\" src=\"Images\\Actions\\OneAction_I.png\"> ranseur + 10 (disarm, reach 10 feet, Damage 1d10+4 piercing<br /> Sinful Bite Creatures that critically fail their saves against a wrathspawn's sinful bite are drained 1 as well as enfeebled 1 for 1 minute.<br /><br />",
            "flavourText": "",
            "heritage": {
                "value": ""
            },
            "keyability": {
                "value": "str"
            },
            "level": {
                "min": 1,
                "value": "2"
            },
            "nethysUrl": "https://2e.aonprd.com/Monsters.aspx?ID=371",
            "recallKnowledgeText": "Recall Knowledge : DC 16",
            "sidebarText": "<h3 class=\"title\">Born of Sin</h3>Unable to procreate themselves, sinspawn retreated from the world for many centuries following the collapse of the runelords&#x2019; empire, but in recent years they have emerged from ancient dungeons, strange magical pools, and other forgotten ruins. In certain cases, incredibly powerful artifacts crafted by the runelords known as runewells can siphon off fragments of sinful memories and emotions related to the runewells&#x2019; associated sins from the souls of people dying nearby, fueling the spontaneous creation of new sinspawn. When enough sinful energies have been gathered within a runewell, it vomits forth a fully grown sinspawn with no prior loyalty to a long-lost runelord. All sinspawn inherently understand the runewells&#x2019; role in the propagation of their kind, and they often establish small villages near awakened runewells, hunting down sentient beings they can use to propagate their communities.<h3 class=\"title\">Sinspawn Locations</h3>Sinspawn are found in regions where sources for their creation remain buried in ancient ruins&#x2014;in Golarion, this currently limits them to the frontier lands of Varisia. But as they spread, so to does the potential knowledge of crafting more of them, and fleshwarpers around the world are hoping to someday soon craft new sinspawn of their own.",
            "source": {
                "value": "Bestiary pg. 297"
            }
        },
        "martial": {
            "advanced": {
                "breakdown": "",
                "rank": 0,
                "value": 0
            },
            "heavy": {
                "breakdown": "",
                "rank": 0,
                "value": 0
            },
            "light": {
                "breakdown": "",
                "rank": 0,
                "value": 0
            },
            "martial": {
                "breakdown": "",
                "rank": 0,
                "value": 0
            },
            "medium": {
                "breakdown": "",
                "rank": 0,
                "value": 0
            },
            "simple": {
                "breakdown": "",
                "rank": 0,
                "value": 0
            },
            "unarmed": {
                "breakdown": "",
                "rank": 0,
                "value": 0
            },
            "unarmored": {
                "breakdown": "",
                "rank": 0,
                "value": 0
            }
        },
        "saves": {
            "fortitude": {
                "ability": "con",
                "breakdown": "",
                "item": 0,
                "rank": 0,
                "saveDetail": "",
                "value": 10
            },
            "reflex": {
                "ability": "dex",
                "breakdown": "",
                "item": 0,
                "rank": 0,
                "saveDetail": "",
                "value": 9
            },
            "will": {
                "ability": "wis",
                "breakdown": "",
                "item": 0,
                "rank": 0,
                "saveDetail": "",
                "value": 6
            }
        },
        "schema": {
            "version": {
                "value": ""
            }
        },
        "skills": {
            "acr": {
                "ability": "dex",
                "armor": 1,
                "breakdown": "",
                "item": 0,
                "mod": 0,
                "rank": 0,
                "value": 0
            },
            "arc": {
                "ability": "int",
                "breakdown": "",
                "item": 0,
                "mod": 0,
                "rank": 0,
                "value": 0
            },
            "ath": {
                "ability": "str",
                "armor": 1,
                "breakdown": "",
                "item": 0,
                "mod": 0,
                "rank": 0,
                "value": 0
            },
            "cra": {
                "ability": "int",
                "breakdown": "",
                "item": 0,
                "mod": 0,
                "rank": 0,
                "value": 0
            },
            "dec": {
                "ability": "cha",
                "breakdown": "",
                "item": 0,
                "mod": 0,
                "rank": 0,
                "value": 0
            },
            "dip": {
                "ability": "cha",
                "breakdown": "",
                "item": 0,
                "mod": 0,
                "rank": 0,
                "value": 0
            },
            "itm": {
                "ability": "cha",
                "breakdown": "",
                "item": 0,
                "mod": 0,
                "rank": 0,
                "value": 0
            },
            "med": {
                "ability": "wis",
                "breakdown": "",
                "item": 0,
                "mod": 0,
                "rank": 0,
                "value": 0
            },
            "nat": {
                "ability": "wis",
                "breakdown": "",
                "item": 0,
                "mod": 0,
                "rank": 0,
                "value": 0
            },
            "occ": {
                "ability": "int",
                "breakdown": "",
                "item": 0,
                "mod": 0,
                "rank": 0,
                "value": 0
            },
            "prf": {
                "ability": "cha",
                "breakdown": "",
                "item": 0,
                "mod": 0,
                "rank": 0,
                "value": 0
            },
            "rel": {
                "ability": "wis",
                "breakdown": "",
                "item": 0,
                "mod": 0,
                "rank": 0,
                "value": 0
            },
            "soc": {
                "ability": "int",
                "breakdown": "",
                "item": 0,
                "mod": 0,
                "rank": 0,
                "value": 0
            },
            "ste": {
                "ability": "dex",
                "armor": 1,
                "breakdown": "",
                "item": 0,
                "mod": 0,
                "rank": 0,
                "value": 0
            },
            "sur": {
                "ability": "wis",
                "breakdown": "",
                "item": 0,
                "mod": 0,
                "rank": 0,
                "value": 0
            },
            "thi": {
                "ability": "dex",
                "armor": 1,
                "breakdown": "",
                "item": 0,
                "mod": 0,
                "rank": 0,
                "value": 0
            }
        },
        "spells": {
            "spell0": {
                "max": 0
            },
            "spell1": {
                "max": 0
            },
            "spell10": {
                "max": 0
            },
            "spell11": {
                "max": 0
            },
            "spell2": {
                "max": 0
            },
            "spell3": {
                "max": 0
            },
            "spell4": {
                "max": 0
            },
            "spell5": {
                "max": 0
            },
            "spell6": {
                "max": 0
            },
            "spell7": {
                "max": 0
            },
            "spell8": {
                "max": 0
            },
            "spell9": {
                "max": 0
            }
        },
        "statusEffects": [],
        "traits": {
            "ci": [],
            "di": {
                "custom": "",
                "value": [
                    "controlled"
                ]
            },
            "dr": [
                {
                    "label": "Mental",
                    "type": "mental",
                    "value": "5"
                }
            ],
            "dv": [],
            "languages": {
                "custom": "",
                "selected": [],
                "value": [
                    "aklo"
                ]
            },
            "rarity": {
                "value": "common"
            },
            "senses": {
                "value": "darkvision, sin scent (imprecise) 30 feet"
            },
            "size": {
                "value": "med"
            },
            "traits": {
                "custom": "",
                "value": [
                    "aberration"
                ]
            }
        }
    },
    "flags": {
        "pf2e_updatednpcsheet": {}
    },
    "img": "icons/svg/mystery-man.svg",
    "items": [
        {
            "_id": "XhD9U9BHhxu7X2ev",
            "data": {
                "brokenThreshold": {
                    "value": 0
                },
                "bulkCapacity": {
                    "value": ""
                },
                "collapsed": {
                    "value": false
                },
                "containerId": {
                    "value": ""
                },
                "description": {
                    "chat": "",
                    "label": "Description",
                    "type": "String",
                    "unidentified": "",
                    "value": ""
                },
                "equipped": {
                    "value": false
                },
                "equippedBulk": {
                    "value": ""
                },
                "hardness": {
                    "value": 0
                },
                "hp": {
                    "value": 0
                },
                "identified": {
                    "value": false
                },
                "invested": {
                    "value": false
                },
                "level": {
                    "value": 0
                },
                "maxHp": {
                    "value": 0
                },
                "negateBulk": {
                    "value": "0"
                },
                "preciousMaterial": {
                    "value": ""
                },
                "preciousMaterialGrade": {
                    "value": ""
                },
                "price": {
                    "value": 0
                },
                "quantity": {
                    "value": 1
                },
                "rarity": {
                    "value": "common"
                },
                "source": {
                    "value": ""
                },
                "stackGroup": {
                    "value": ""
                },
                "traits": {
                    "value": []
                },
                "usage": {
                    "value": "held-in-one-hand"
                },
                "weight": {
                    "value": 0
                }
            },
            "flags": {},
            "img": "icons/svg/mystery-man.svg",
            "name": "one weapon determined by its sin",
            "sort": 100000,
            "type": "equipment"
        },
        {
            "_id": "lOGhyEufGuD2T8aX",
            "data": {
                "attack": {
                    "value": ""
                },
                "attackEffects": {
                    "value": [
                        "sinful bite"
                    ]
                },
                "bonus": {
                    "total": 10,
                    "value": 10
                },
                "brokenThreshold": {
                    "value": 0
                },
                "bulkCapacity": {
                    "value": ""
                },
                "collapsed": {
                    "value": false
                },
                "containerId": {
                    "value": ""
                },
                "damage": {
                    "damageType": "piercing",
                    "die": "1d8+4"
                },
                "damageRolls": [
                    {
                        "damage": "1d8+4",
                        "damageType": "piercing"
                    }
                ],
                "description": {
                    "chat": "",
                    "unidentified": "",
                    "value": ""
                },
                "equipped": {
                    "value": false
                },
                "equippedBulk": {
                    "value": ""
                },
                "hardness": {
                    "value": 0
                },
                "hp": {
                    "value": 0
                },
                "identified": {
                    "value": false
                },
                "invested": {
                    "value": false
                },
                "maxHp": {
                    "value": 0
                },
                "negateBulk": {
                    "value": "0"
                },
                "preciousMaterial": {
                    "value": ""
                },
                "preciousMaterialGrade": {
                    "value": ""
                },
                "price": {
                    "value": 0
                },
                "property1": {
                    "critDamage": "",
                    "critDamageType": "",
                    "critDice": 0,
                    "critDie": "",
                    "damageType": "",
                    "dice": 0,
                    "die": "",
                    "value": ""
                },
                "property2": {
                    "critDamage": "",
                    "critDamageType": "",
                    "critDice": 0,
                    "critDie": "",
                    "damageType": "",
                    "dice": 0,
                    "die": "",
                    "value": ""
                },
                "property3": {
                    "critDamage": "",
                    "critDamageType": "",
                    "critDice": 0,
                    "critDie": "",
                    "damageType": "",
                    "dice": 0,
                    "die": "",
                    "value": ""
                },
                "quantity": {
                    "value": 1
                },
                "rarity": {
                    "value": "common"
                },
                "source": {
                    "value": ""
                },
                "stackGroup": {
                    "value": ""
                },
                "traits": {
                    "value": [
                        "agile"
                    ]
                },
                "usage": {
                    "value": "held-in-one-hand"
                },
                "weight": {
                    "value": 0
                }
            },
            "flags": {
                "pf2e_updatednpcsheet": {}
            },
            "img": "icons/svg/mystery-man.svg",
            "name": "Jaws",
            "sort": 200000,
            "type": "melee"
        },
        {
            "_id": "El6yEwdcVoYxSpbv",
            "data": {
                "attack": {
                    "value": ""
                },
                "attackEffects": {
                    "value": []
                },
                "bonus": {
                    "total": 10,
                    "value": 10
                },
                "brokenThreshold": {
                    "value": 0
                },
                "bulkCapacity": {
                    "value": ""
                },
                "collapsed": {
                    "value": false
                },
                "containerId": {
                    "value": ""
                },
                "damage": {
                    "damageType": "slashing",
                    "die": "1d6+4"
                },
                "damageRolls": [
                    {
                        "damage": "1d6+4",
                        "damageType": "slashing"
                    }
                ],
                "description": {
                    "chat": "",
                    "unidentified": "",
                    "value": ""
                },
                "equipped": {
                    "value": false
                },
                "equippedBulk": {
                    "value": ""
                },
                "hardness": {
                    "value": 0
                },
                "hp": {
                    "value": 0
                },
                "identified": {
                    "value": false
                },
                "invested": {
                    "value": false
                },
                "maxHp": {
                    "value": 0
                },
                "negateBulk": {
                    "value": "0"
                },
                "preciousMaterial": {
                    "value": ""
                },
                "preciousMaterialGrade": {
                    "value": ""
                },
                "price": {
                    "value": 0
                },
                "property1": {
                    "critDamage": "",
                    "critDamageType": "",
                    "critDice": 0,
                    "critDie": "",
                    "damageType": "",
                    "dice": 0,
                    "die": "",
                    "value": ""
                },
                "property2": {
                    "critDamage": "",
                    "critDamageType": "",
                    "critDice": 0,
                    "critDie": "",
                    "damageType": "",
                    "dice": 0,
                    "die": "",
                    "value": ""
                },
                "property3": {
                    "critDamage": "",
                    "critDamageType": "",
                    "critDice": 0,
                    "critDie": "",
                    "damageType": "",
                    "dice": 0,
                    "die": "",
                    "value": ""
                },
                "quantity": {
                    "value": 1
                },
                "rarity": {
                    "value": "common"
                },
                "source": {
                    "value": ""
                },
                "stackGroup": {
                    "value": ""
                },
                "traits": {
                    "value": []
                },
                "usage": {
                    "value": "held-in-one-hand"
                },
                "weight": {
                    "value": 0
                }
            },
            "flags": {
                "pf2e_updatednpcsheet": {}
            },
            "img": "icons/svg/mystery-man.svg",
            "name": "Claw",
            "sort": 300000,
            "type": "melee"
        },
        {
            "_id": "hk7qH9BpvzM7rFGe",
            "data": {
                "actionCategory": {
                    "value": "interaction"
                },
                "actionType": {
                    "value": "passive"
                },
                "actions": {
                    "value": ""
                },
                "description": {
                    "chat": "",
                    "unidentified": "",
                    "value": "A sinspawn can smell creatures that reflect its sin, as the scent ability. The GM determines which creatures are appropriately sinful."
                },
                "rarity": {
                    "value": "common"
                },
                "requirements": {
                    "value": ""
                },
                "skill_requirements": {
                    "rank": "",
                    "skill": ""
                },
                "source": {
                    "value": ""
                },
                "traits": {
                    "value": []
                },
                "trigger": {
                    "value": ""
                },
                "usage": {
                    "value": "held-in-one-hand"
                },
                "weapon": {
                    "value": ""
                }
            },
            "flags": {},
            "img": "icons/svg/mystery-man.svg",
            "name": "Sin Scent",
            "sort": 400000,
            "type": "action"
        },
        {
            "_id": "2aUjv7gzQDEoNqSX",
            "data": {
                "actionCategory": {
                    "value": "defensive"
                },
                "actionType": {
                    "value": "reaction"
                },
                "actions": {
                    "value": ""
                },
                "description": {
                    "chat": "",
                    "unidentified": "",
                    "value": "<b>Trigger</b> A creature within the monster's reach uses a manipulate action or a move action, makes a ranged attack, or leaves a square during a move action it's using. <b>Effect</b> The monster attempts a melee Strike against the triggering creature. If the attack is a critical hit and the trigger was a manipulate action, the monster disrupts that action. This Strike doesn't count toward the monster's multiple attack penalty, and its multiple attack penalty doesn't apply to this Strike."
                },
                "rarity": {
                    "value": "common"
                },
                "requirements": {
                    "value": ""
                },
                "skill_requirements": {
                    "rank": "",
                    "skill": ""
                },
                "source": {
                    "value": ""
                },
                "traits": {
                    "value": []
                },
                "trigger": {
                    "value": ""
                },
                "usage": {
                    "value": "held-in-one-hand"
                },
                "weapon": {
                    "value": ""
                }
            },
            "flags": {},
            "img": "icons/svg/mystery-man.svg",
            "name": "Attack of Opportunity",
            "sort": 500000,
            "type": "action"
        },
        {
            "_id": "gezplfWhuCWM3Qni",
            "data": {
                "actionCategory": {
                    "value": "offensive"
                },
                "actionType": {
                    "value": "passive"
                },
                "actions": {
                    "value": ""
                },
                "description": {
                    "chat": "",
                    "unidentified": "",
                    "value": "A sinspawn gains an additional skill based on its sin, as well as a weapon that reflects the preferences of its kinds' ancient creators. The seven sins and the benefits they confer upon a sinspawn are noted in the Sinspawn Sins section."
                },
                "rarity": {
                    "value": "common"
                },
                "requirements": {
                    "value": ""
                },
                "skill_requirements": {
                    "rank": "",
                    "skill": ""
                },
                "source": {
                    "value": ""
                },
                "traits": {
                    "value": []
                },
                "trigger": {
                    "value": ""
                },
                "usage": {
                    "value": "held-in-one-hand"
                },
                "weapon": {
                    "value": ""
                }
            },
            "flags": {},
            "img": "icons/svg/mystery-man.svg",
            "name": "Sin",
            "sort": 600000,
            "type": "action"
        },
        {
            "_id": "MpNlJrdPvv9bECNE",
            "data": {
                "actionCategory": {
                    "value": "offensive"
                },
                "actionType": {
                    "value": "passive"
                },
                "actions": {
                    "value": ""
                },
                "description": {
                    "chat": "",
                    "unidentified": "",
                    "value": " A creature hit by the jaws of a sinspawn must attempt a DC 18 Will save as it is assailed by sinful thoughts.<br /> <b>Critical Success</b> Unaffected.<br /> <b>Success</b> @Compendium[pf2e.conditionitems.Sickened]{Sickened} 1.<br /> <b>Failure</b> @Compendium[pf2e.conditionitems.Sickened]{Sickened} 2.<br /> <b>Critical Failure</b> @Compendium[pf2e.conditionitems.Sickened]{Sickened} 2 plus an additional penalty, determined by the sinspawn's sin, while it remains sickened."
                },
                "rarity": {
                    "value": "common"
                },
                "requirements": {
                    "value": ""
                },
                "skill_requirements": {
                    "rank": "",
                    "skill": ""
                },
                "source": {
                    "value": ""
                },
                "traits": {
                    "value": [
                        "arcane",
                        "emotion",
                        "mental"
                    ]
                },
                "trigger": {
                    "value": ""
                },
                "usage": {
                    "value": "held-in-one-hand"
                },
                "weapon": {
                    "value": ""
                }
            },
            "flags": {},
            "img": "icons/svg/mystery-man.svg",
            "name": "Sinful Bite",
            "sort": 700000,
            "type": "action"
        },
        {
            "_id": "76Z0vwdSFO58Qyst",
            "data": {
                "description": {
                    "chat": "",
                    "unidentified": "",
                    "value": ""
                },
                "featType": "",
                "item": {
                    "value": 0
                },
                "mod": {
                    "value": 9
                },
                "proficient": {
                    "value": 0
                },
                "rarity": {
                    "value": "common"
                },
                "source": {
                    "value": ""
                },
                "traits": {
                    "value": []
                },
                "usage": {
                    "value": "held-in-one-hand"
                }
            },
            "flags": {},
            "img": "icons/svg/mystery-man.svg",
            "name": "Acrobatics",
            "sort": 800000,
            "type": "lore"
        },
        {
            "_id": "8CWA7tEl2pIhpfng",
            "data": {
                "description": {
                    "chat": "",
                    "unidentified": "",
                    "value": ""
                },
                "featType": "",
                "item": {
                    "value": 0
                },
                "mod": {
                    "value": 8
                },
                "proficient": {
                    "value": 0
                },
                "rarity": {
                    "value": "common"
                },
                "source": {
                    "value": ""
                },
                "traits": {
                    "value": []
                },
                "usage": {
                    "value": "held-in-one-hand"
                }
            },
            "flags": {},
            "img": "icons/svg/mystery-man.svg",
            "name": "Athletics",
            "sort": 900000,
            "type": "lore"
        },
        {
            "_id": "MBslomLirTgCVl2r",
            "data": {
                "description": {
                    "chat": "",
                    "unidentified": "",
                    "value": ""
                },
                "featType": "",
                "item": {
                    "value": 0
                },
                "mod": {
                    "value": 9
                },
                "proficient": {
                    "value": 0
                },
                "rarity": {
                    "value": "common"
                },
                "source": {
                    "value": ""
                },
                "traits": {
                    "value": []
                },
                "usage": {
                    "value": "held-in-one-hand"
                }
            },
            "flags": {},
            "img": "icons/svg/mystery-man.svg",
            "name": "Stealth",
            "sort": 1000000,
            "type": "lore"
        },
        {
            "_id": "5ggL1ZeBZga24qxI",
            "data": {
                "description": {
                    "chat": "",
                    "unidentified": "",
                    "value": ""
                },
                "featType": "",
                "item": {
                    "value": 0
                },
                "mod": {
                    "value": 6
                },
                "proficient": {
                    "value": 0
                },
                "rarity": {
                    "value": "common"
                },
                "source": {
                    "value": ""
                },
                "traits": {
                    "value": []
                },
                "usage": {
                    "value": "held-in-one-hand"
                }
            },
            "flags": {},
            "img": "icons/svg/mystery-man.svg",
            "name": "Survival",
            "sort": 1100000,
            "type": "lore"
        }
    ],
    "name": "Sinspawn",
    "permission": {
        "default": 0
    },
    "token": {
        "actorData": {},
        "actorId": "ymhcfbqpaiXrcCPW",
        "actorLink": false,
        "bar1": {
            "attribute": "attributes.hp"
        },
        "bar2": {},
        "brightLight": 0,
        "brightSight": 0,
        "dimLight": 0,
        "dimSight": 0,
        "displayBars": 20,
        "displayName": 20,
        "disposition": -1,
        "flags": {},
        "height": 1,
        "img": "icons/svg/mystery-man.svg",
        "lightAlpha": 1,
        "lightAngle": 360,
        "lockRotation": false,
        "name": "Sinspawn",
        "randomImg": false,
        "rotation": 0,
        "scale": 1,
        "sightAngle": 360,
        "tint": null,
        "vision": false,
        "width": 1
    },
    "type": "npc"
}
