{
    "_id": "su4TRBOoso4vjkoK",
    "data": {
        "attributes": {
            "ac": {
                "value": 10
            },
            "hardness": 0,
            "hasHealth": false,
            "hp": {
                "details": "",
                "max": 0,
                "temp": 0,
                "tempmax": 0,
                "value": 0
            },
            "stealth": {
                "details": "(trained)",
                "value": 21
            }
        },
        "creatureType": "",
        "details": {
            "description": "An object haunted by the echoes of a vicious mind attempts to kill someone who comes near.",
            "disable": "Religion DC 29 (master) to exorcise the spirit or Diplomacy DC 31 (expert) to talk it down",
            "isComplex": false,
            "level": 10,
            "reset": "",
            "routine": ""
        },
        "flavourText": "",
        "nethysUrl": "",
        "recallKnowledgeText": "",
        "saves": {
            "fortitude": {
                "rank": 0,
                "saveDetail": "",
                "value": 0
            },
            "reflex": {
                "rank": 0,
                "saveDetail": "",
                "value": 0
            },
            "will": {
                "rank": 0,
                "saveDetail": "",
                "value": 0
            }
        },
        "schema": {
            "version": {
                "value": ""
            }
        },
        "sidebarText": "",
        "source": {
            "value": ""
        },
        "statusEffects": [],
        "traits": {
            "ci": [],
            "di": {
                "custom": "",
                "selected": {},
                "value": []
            },
            "dr": [],
            "dv": [],
            "traits": {
                "custom": "",
                "value": [
                    "haunt"
                ]
            }
        }
    },
    "flags": {},
    "img": "icons/svg/mystery-man.svg",
    "items": [
        {
            "_id": "0FpzSygcs7G688GT",
            "data": {
                "actionCategory": {
                    "value": ""
                },
                "actionType": {
                    "value": "reaction"
                },
                "actions": {
                    "value": ""
                },
                "description": {
                    "chat": "",
                    "unidentified": "",
                    "value": "<b>Trigger</b> A creature moves within 10 feet of the haunted object. <br /><b>Effect</b> The haunt takes control of the triggering creature, forcing it to attack itself. The creature must attempt a DC 29 Will save.<br /><br /><b>Critical Success</b> The target is unaffected.<br /><b>Success</b> The target makes a Strike against itself and automatically hits; the target also becomes frightened 1.<br /><b>Failure</b> The target makes a Strike against itself and automatically scores a critical hit; the target also becomes frightened 2.<br /><b>Critical Failure </b>The target attempts a Fortitude save. If the target succeeds, it is subject to the effects of a failure instead. If the target fails, it is reduced to 0 Hit Points and dies."
                },
                "rarity": {
                    "value": "common"
                },
                "requirements": {
                    "value": ""
                },
                "skill_requirements": {
                    "rank": "",
                    "skill": ""
                },
                "source": {
                    "value": ""
                },
                "traits": {
                    "custom": "",
                    "value": [
                        "death",
                        "emotion",
                        "fear",
                        "illusion",
                        "mental",
                        "occult"
                    ]
                },
                "trigger": {
                    "value": ""
                },
                "usage": {
                    "value": "held-in-one-hand"
                },
                "weapon": {
                    "value": ""
                }
            },
            "flags": {},
            "img": "systems/pf2e/icons/actions/Reaction.png",
            "name": "Quietus",
            "type": "action"
        }
    ],
    "name": "Bloodthirsty Urge",
    "permission": {
        "default": 0
    },
    "token": {
        "actorData": {},
        "actorId": "su4TRBOoso4vjkoK",
        "actorLink": false,
        "bar1": {},
        "bar2": {},
        "brightLight": 0,
        "brightSight": 0,
        "dimLight": 0,
        "dimSight": 0,
        "displayBars": 0,
        "displayName": 0,
        "disposition": -1,
        "flags": {},
        "height": 1,
        "img": "icons/svg/mystery-man.svg",
        "lightAlpha": 1,
        "lightAngle": 360,
        "lockRotation": false,
        "name": "Bloodthirsty Urge",
        "randomImg": false,
        "rotation": 0,
        "scale": 1,
        "sightAngle": 360,
        "tint": null,
        "vision": false,
        "width": 1
    },
    "type": "hazard"
}
