{
    "_id": "cDnFXfl3i5Z2l7JP",
    "data": {
        "actionCategory": {
            "value": ""
        },
        "actionType": {
            "value": "passive"
        },
        "actions": {
            "value": ""
        },
        "description": {
            "chat": "",
            "unidentified": "",
            "value": "<p>Your patron grants you the power to command incredible works of magic. You gain a single 10th-level spell slot and can prepare a spell in that slot using witch spellcasting.</p>\n<p>Unlike with other spell slots, these spell slots can't be used for abilities that let you cast spells without expending spell slots or abilities that give you more spell slots. You don't gain more 10th-level spells as you level up, though you can take the Patron's Truth feat (page 105) to gain a second slot.</p>"
        },
        "featType": {
            "value": "classfeature"
        },
        "level": {
            "value": "19"
        },
        "prerequisites": {
            "value": ""
        },
        "rarity": {
            "value": "common"
        },
        "rules": [],
        "source": {
            "value": ""
        },
        "traits": {
            "custom": "",
            "rarity": {
                "value": "common"
            },
            "value": [
                "witch"
            ]
        },
        "usage": {
            "value": "held-in-one-hand"
        }
    },
    "effects": [],
    "flags": {},
    "img": "systems/pf2e/icons/features/classes/patrons-gift.jpg",
    "name": "Patron's Gift",
    "permission": {
        "default": 0
    },
    "type": "feat"
}
