{
    "_id": "3O5lvuX4VHqtpCkU",
    "data": {
        "description": {
            "chat": "",
            "unidentified": "",
            "value": "<p>Granted by activating @Compendium[pf2e.equipment-srd.Lover's Gloves]{Lover's Gloves}</p>\n<hr />\n<p>Automatically applied effects:</p>\n<ul>\n<li>+1 status bonus to saving throws</li>\n<li>gain 10 temporary Hit Points&nbsp;</li>\n</ul>"
        },
        "level": {
            "value": 8
        },
        "rarity": {
            "value": "common"
        },
        "rules": [
            {
                "key": "PF2E.RuleElement.FlatModifier",
                "selector": "saving-throw",
                "type": "status",
                "value": 1
            },
            {
                "key": "PF2E.RuleElement.TempHP",
                "value": 10
            },
            {
                "key": "PF2E.RuleElement.TokenEffectIcon"
            }
        ],
        "source": {
            "value": ""
        },
        "traits": {
            "value": []
        },
        "usage": {
            "value": "held-in-one-hand"
        }
    },
    "effects": [],
    "flags": {
        "core": {
            "sourceId": "Item.RndtV6HnAsEBwcBP"
        }
    },
    "img": "systems/pf2e/icons/equipment/worn-items/other-worn-items/lovers-gloves.jpg",
    "name": "Effect: Lover's Gloves",
    "permission": {
        "default": 0
    },
    "type": "effect"
}
