{
    "_id": "JcXzKwrdMkNszrJQ",
    "data": {
        "actionCategory": {
            "value": ""
        },
        "actionType": {
            "value": "action"
        },
        "actions": {
            "value": "1"
        },
        "description": {
            "chat": "",
            "unidentified": "",
            "value": "<p>You pour invigorating positive energy into a living ally. If the next action you use is to cast @Compendium[pf2e.spells-srd.Heal]{Heal} to restore Hit Points to a single living creature, the target deals an additional [[/r 1d6 #positive]] positive damage with its melee weapons and unarmed attacks until the end of its next turn.</p>\n<p>If the <em>heal</em> spell is at least 5th level, this damage increases to [[/r 2d6 #positive]], or [[/r 3d6 #positive]] if the spell is at least 8th level.</p>"
        },
        "featType": {
            "value": "class"
        },
        "level": {
            "value": "4"
        },
        "prerequisites": {
            "value": [
                "good alignment",
                "healing font"
            ]
        },
        "rarity": {
            "value": "common"
        },
        "rules": [],
        "source": {
            "value": ""
        },
        "traits": {
            "rarity": {
                "value": "common"
            },
            "value": [
                "cleric",
                "concentrate",
                "metamagic"
            ]
        },
        "usage": {
            "value": ""
        }
    },
    "flags": {},
    "img": "systems/pf2e/icons/features/feats/feats.jpg",
    "name": "Radiant Infusion",
    "permission": {
        "default": 0
    },
    "type": "feat"
}
