{
    "_id": "owJorCBZmUi5lIV0",
    "data": {
        "actionCategory": {
            "value": ""
        },
        "actionType": {
            "value": "passive"
        },
        "actions": {
            "value": ""
        },
        "description": {
            "chat": "",
            "unidentified": "",
            "value": "<p>Your @Compendium[pf2e.classfeatures.Advanced Alchemy]{Advanced Alchemy} level for herbalism increases to your level -3.</p>\n<p>You gain the formulas for elixirs of life as soon as your advanced alchemy level is high enough to create them: @Compendium[pf2e.equipment-srd.Elixir of Life (Lesser)]{lesser} at 8th level, @Compendium[pf2e.equipment-srd.Elixir of Life (Moderate)]{moderate} at 12th level, @Compendium[pf2e.equipment-srd.Elixir of Life (Greater)]{greater} at 16th level, and @Compendium[pf2e.equipment-srd.Elixir of Life (Major)]{major} at 18th level.</p>"
        },
        "featType": {
            "value": "archetype"
        },
        "level": {
            "value": "6"
        },
        "prerequisites": {
            "value": [
                "Herbalist Dedication",
                "expert in Nature"
            ]
        },
        "rarity": {
            "value": "common"
        },
        "source": {
            "value": ""
        },
        "traits": {
            "rarity": {
                "value": "common"
            },
            "value": [
                "archetype"
            ]
        },
        "usage": {
            "value": ""
        }
    },
    "flags": {},
    "img": "systems/pf2e/icons/features/feats/feats.jpg",
    "name": "Expert Herbalism",
    "permission": {
        "default": 0
    },
    "type": "feat"
}
