{
    "_id": "FSu6ZKxr3xdS75wq",
    "data": {
        "ability": {
            "value": ""
        },
        "area": {
            "areaType": "emanation",
            "value": 30
        },
        "areasize": {
            "value": "30-foot emanation"
        },
        "components": {
            "value": "somatic, verbal"
        },
        "cost": {
            "value": ""
        },
        "damage": {
            "applyMod": false,
            "value": ""
        },
        "damageType": {
            "value": ""
        },
        "description": {
            "chat": "",
            "unidentified": "",
            "value": "<p>You channel the might of dragons into your voice, letting out a roar that engenders respect in dragonkind but that instills fear in most other creatures. The impressive roar grants you a +2 circumstance bonus to Diplomacy checks for 10 minutes against dragons that were in the area at the time of casting. All enemies within the area other than dragons must attempt a Will save; to these enemies, <em>roar of the wyrm</em> is a fear effect.<br /><br /><em>Roar of the wyrm</em> affects non-dragon creatures with deep ties to dragonkind (such as a barbarian with the draconic instinct, a sorcerer with the draconic bloodline, or a member of a culture that reveres dragons) as if they had the dragon trait. The GM decides if a creature is aligned enough with dragonkind to be affected in this way.</p>\n<hr />\n<p><span><strong>Critical Success</strong> The creature is unaffected.</span></p>\n<p><span><strong>Success</strong> The creature is @Compendium[pf2e.conditionitems.Frightened]{Frightened} 1.</span></p>\n<p><span><strong>Failure</strong> The creature is Frightened 2.</span></p>\n<p><span><strong>Critical Failure</strong> The creature is Frightened 3 and @Compendium[pf2e.conditionitems.Fleeing]{Fleeing} for 1 round. </span></p>"
        },
        "duration": {
            "value": "varies"
        },
        "level": {
            "value": 4
        },
        "location": {
            "value": ""
        },
        "materials": {
            "value": ""
        },
        "prepared": {
            "value": ""
        },
        "primarycheck": {
            "value": ""
        },
        "range": {
            "value": ""
        },
        "rarity": {
            "value": "common"
        },
        "rules": [],
        "save": {
            "basic": "",
            "value": "will"
        },
        "scaling": {
            "formula": "",
            "mode": "none"
        },
        "school": {
            "value": "enc"
        },
        "secondarycasters": {
            "value": ""
        },
        "secondarycheck": {
            "value": ""
        },
        "source": {
            "value": ""
        },
        "spellCategorie": {
            "value": "focus"
        },
        "spellCategory": {
            "value": ""
        },
        "spellType": {
            "value": "save"
        },
        "sustained": {
            "value": false
        },
        "target": {
            "value": ""
        },
        "time": {
            "value": "2"
        },
        "traditions": {
            "custom": "",
            "value": [
                "focus"
            ]
        },
        "traits": {
            "custom": "",
            "rarity": {
                "value": "uncommon"
            },
            "value": [
                "cleric",
                "emotion",
                "enchantment",
                "mental"
            ]
        },
        "usage": {
            "value": "held-in-one-hand"
        }
    },
    "effects": [],
    "flags": {},
    "img": "systems/pf2e/icons/spells/roar-of-the-wyrm.jpg",
    "name": "Roar of the Wyrm",
    "permission": {
        "default": 0
    },
    "type": "spell"
}
