{
    "_id": "E4B02mJmNexQLa8F",
    "data": {
        "description": {
            "chat": "",
            "unidentified": "",
            "value": "<p>Granted by @Compendium[pf2e.equipment-srd.Inspiring Spotlight]{Inspiring Spotlight}.</p>\n<p>Automatically applied effects:</p>\n<ul>\n<li>+1 item bonus to saving throws</li>\n<li>+1 item bonus to Charisma-based skill checks (Diplomacy, Deception, Intimidation, Performance)</li>\n</ul>"
        },
        "level": {
            "value": 9
        },
        "rarity": {
            "value": "common"
        },
        "rules": [
            {
                "key": "PF2E.RuleElement.FlatModifier",
                "selector": "saving-throw",
                "type": "item",
                "value": 1
            },
            {
                "key": "PF2E.RuleElement.FlatModifier",
                "selector": "deception",
                "type": "item",
                "value": 1
            },
            {
                "key": "PF2E.RuleElement.FlatModifier",
                "selector": "diplomacy",
                "type": "item",
                "value": 1
            },
            {
                "key": "PF2E.RuleElement.FlatModifier",
                "selector": "intimidation",
                "type": "item",
                "value": 1
            },
            {
                "key": "PF2E.RuleElement.FlatModifier",
                "selector": "performance",
                "type": "item",
                "value": 1
            },
            {
                "key": "PF2E.RuleElement.TokenEffectIcon"
            }
        ],
        "source": {
            "value": ""
        },
        "traits": {
            "value": []
        },
        "usage": {
            "value": "held-in-one-hand"
        }
    },
    "effects": [],
    "flags": {
        "core": {
            "sourceId": "Item.h49amWGp5Pa0eGsQ"
        }
    },
    "img": "systems/pf2e/icons/equipment/held-items/inspiring-spotlight.jpg",
    "name": "Effect: Inspiring Spotlight",
    "permission": {
        "default": 0
    },
    "type": "effect"
}
