{
    "_id": "n8nmqJdfHrDfuG1J",
    "data": {
        "brokenThreshold": {
            "value": 0
        },
        "bulkCapacity": {
            "value": ""
        },
        "collapsed": {
            "value": false
        },
        "containerId": {
            "value": ""
        },
        "description": {
            "chat": "",
            "unidentified": "",
            "value": "<p><strong>Activate</strong> 1 minute (Interact)</p>\n<hr />\n<p>Astrolabes can be used for navigation in unfamiliar or featureless locations. To use an astrolabe, the holder must be trained in Survival. By spending 1 minute to measure the height of the stars and planets, a holder who knows the time and date can determine the latitude, and a holder who knows their latitude can determine the date and time. An astrolabe also grants a +1 item bonus on checks to identify celestial bodies. A standard astrolabe only functions on steady ground.</p>"
        },
        "equipped": {
            "value": false
        },
        "equippedBulk": {
            "value": ""
        },
        "hardness": {
            "value": 0
        },
        "hp": {
            "value": 0
        },
        "identified": {
            "value": true
        },
        "invested": {
            "value": false
        },
        "level": {
            "value": "2"
        },
        "maxHp": {
            "value": 0
        },
        "negateBulk": {
            "value": "0"
        },
        "preciousMaterial": {
            "value": ""
        },
        "preciousMaterialGrade": {
            "value": ""
        },
        "price": {
            "value": "30 gp"
        },
        "quantity": {
            "value": "1"
        },
        "rarity": {
            "value": "common"
        },
        "rules": [],
        "source": {
            "value": ""
        },
        "stackGroup": {
            "value": ""
        },
        "traits": {
            "rarity": {
                "value": "uncommon"
            },
            "usage": {
                "value": "held-in-two-hands"
            },
            "value": []
        },
        "usage": {
            "value": "held-in-one-hand"
        },
        "weight": {
            "value": "L"
        }
    },
    "effects": [],
    "flags": {
        "core": {
            "sourceId": "Item.Y2n3DfKJq1QrL7QF"
        }
    },
    "img": "systems/pf2e/icons/equipment/adventuring-gear/astrolabe.jpg",
    "name": "Standard Astrolabe",
    "permission": {
        "default": 0
    },
    "type": "equipment"
}
