{
    "_id": "epNrbgmjZDjJe7Ry",
    "data": {
        "actionCategory": {
            "value": ""
        },
        "actionType": {
            "value": "passive"
        },
        "actions": {
            "value": ""
        },
        "description": {
            "chat": "",
            "unidentified": "",
            "value": "<p>You and your mount move like one being, effortlessly reading each other's signals. Whenever you are riding your mount, you are @Compendium[pf2e.conditionitems.Quickened]{Quickened}; you can use the extra action only to command your mount using the @Compendium[pf2e.actionspf2e.Command an Animal]{Command an Animal} skill action.</p>"
        },
        "featType": {
            "value": "archetype"
        },
        "level": {
            "value": "20"
        },
        "prerequisites": {
            "value": [
                "Cavalier Dedication"
            ]
        },
        "rarity": {
            "value": "common"
        },
        "source": {
            "value": ""
        },
        "traits": {
            "rarity": {
                "value": "common"
            },
            "value": [
                "archetype"
            ]
        },
        "usage": {
            "value": ""
        }
    },
    "flags": {},
    "img": "systems/pf2e/icons/features/feats/feats.jpg",
    "name": "Legendary Rider",
    "permission": {
        "default": 0
    },
    "type": "feat"
}
