{
    "_id": "yvabfuAO74pvH8hh",
    "data": {
        "description": {
            "chat": "",
            "unidentified": "",
            "value": "<p>Granted by activating  @Compendium[pf2e.equipment-srd.Aeon Stone (Orange Prism)]{Aeon Stone (Orange Prism)} when the last spell you cast was an Arcane spell.</p>\n<hr />\n<p>Automatically applied effects:</p>\n<ul>\n<li>+2 item bonus to Arcana</li>\n</ul>"
        },
        "level": {
            "value": 16
        },
        "rarity": {
            "value": "common"
        },
        "rules": [
            {
                "key": "PF2E.RuleElement.FlatModifier",
                "label": "Aeon Stone (Orange Prism)",
                "selector": "arcana",
                "type": "item",
                "value": 2
            },
            {
                "key": "PF2E.RuleElement.TokenEffectIcon"
            }
        ],
        "source": {
            "value": ""
        },
        "traits": {
            "value": []
        },
        "usage": {
            "value": "held-in-one-hand"
        }
    },
    "effects": [],
    "flags": {},
    "img": "systems/pf2e/icons/equipment/worn-items/other-worn-items/aeon-stone-orange-prism.jpg",
    "name": "Effect: Aeon Stone (Orange Prism) (Arcana)",
    "permission": {
        "default": 0
    },
    "type": "effect"
}
