{
    "_id": "qHj5VrGgd0Gze9LL",
    "content": "<p>Among your fellow guards who patrol the Foreign Quarter, you're something of a big deal. Your good work and big personality have made a big enough splash that word has gotten out about your status as a rising star among the watchdogs of Absalom. Your popularity has also earned you the trust of many citizens of the Foreign Quarter.</p>\n<p>Your laudable performance has earned you a transfer to the newly formed Edgewatch in the Precipice Quarter, where you'll put your formidable reputation to good use by patrolling the Radiant Festival and ensuring the safety of Absalom's most vulnerable visitors.</p>\n<p>Choose two ability boosts. One must be to <span style=\"text-decoration: underline;\">Wisdom</span> or <span style=\"text-decoration: underline;\">Charisma</span>, and one is a free ability boost.</p>\n<p>You're trained in the <span style=\"text-decoration: underline;\">Society</span>, plus either <span style=\"text-decoration: underline;\">Gladiatorial Lore</span> or <span style=\"text-decoration: underline;\">Genealogy Lore</span>. You gain a +1 circumstance bonus to <span style=\"text-decoration: underline;\">Deception</span>, <span style=\"text-decoration: underline;\">Diplomacy</span>, and <span style=\"text-decoration: underline;\">Intimidation </span>checks to @Compendium[pf2e.actionspf2e.Interact]{Interact} with members of the Sleepless Suns and residents of the Foreign Quarter. You gain the @Compendium[pf2e.feats-srd.Multilingual]{Multilingual} skill feat.</p>",
    "flags": {},
    "name": "Sleepless Suns Star",
    "permission": {
        "default": 0
    }
}
