{
    "_id": "dqaCLzINHBiKjh4J",
    "data": {
        "ability": {
            "value": ""
        },
        "area": {
            "value": ""
        },
        "areasize": {
            "value": "20-foot emanation"
        },
        "components": {
            "value": "verbal"
        },
        "cost": {
            "value": ""
        },
        "damage": {
            "applyMod": false,
            "value": ""
        },
        "damageType": {
            "value": ""
        },
        "description": {
            "chat": "",
            "unidentified": "",
            "value": "<p><strong>Trigger</strong> You are about to roll for initiative.</p>\n<hr />\n<p>You cry out a call to arms, inspiring your allies to enter the fray. Each ally in the area gains a +2 status bonus to their initiative roll and gains temporary Hit Points equal to the spell's level; these temporary Hit Points last for the spell's duration.</p>\n<hr />\n<p><strong>Heightened (6th)</strong> The bonus increases to +3.</p>\n<p><strong>Heightened (9th)</strong> The bonus increases to +4.</p>"
        },
        "duration": {
            "value": "1 minute"
        },
        "level": {
            "value": 1
        },
        "location": {
            "value": ""
        },
        "materials": {
            "value": ""
        },
        "prepared": {
            "value": ""
        },
        "primarycheck": {
            "value": ""
        },
        "range": {
            "value": ""
        },
        "rarity": {
            "value": "common"
        },
        "rules": [],
        "save": {
            "basic": "",
            "value": ""
        },
        "scaling": {
            "formula": "",
            "mode": "none"
        },
        "school": {
            "value": "enc"
        },
        "secondarycasters": {
            "value": ""
        },
        "secondarycheck": {
            "value": ""
        },
        "source": {
            "value": ""
        },
        "spellCategorie": {
            "value": "focus"
        },
        "spellCategory": {
            "value": ""
        },
        "spellType": {
            "value": "utility"
        },
        "sustained": {
            "value": false
        },
        "target": {
            "value": ""
        },
        "time": {
            "value": "reaction"
        },
        "traditions": {
            "value": []
        },
        "traits": {
            "custom": "",
            "rarity": {
                "value": "uncommon"
            },
            "value": [
                "auditory",
                "emotion",
                "enchantment",
                "mental",
                "oracle"
            ]
        },
        "usage": {
            "value": "held-in-one-hand"
        }
    },
    "effects": [],
    "flags": {},
    "img": "systems/pf2e/icons/spells/call-to-arms.jpg",
    "name": "Call to Arms",
    "permission": {
        "default": 0
    },
    "type": "spell"
}
