{
    "_id": "RzfWrOqHL2GcK0rr",
    "data": {
        "actionCategory": {
            "value": ""
        },
        "actionType": {
            "value": "free"
        },
        "actions": {
            "value": ""
        },
        "description": {
            "chat": "",
            "unidentified": "",
            "value": "<p><strong>Trigger</strong> You apply a debilitation to a creature.<br /><strong>Frequency</strong> once per minute<br /></p>\n<hr />\n<p>You can make your debilitation last an exceptionally long time. The triggering debilitation lasts for 1 minute instead of until the end of your next turn.</p>"
        },
        "featType": {
            "value": "class"
        },
        "level": {
            "value": "20"
        },
        "prerequisites": {
            "value": [
                "Debilitating Strike"
            ]
        },
        "rarity": {
            "value": "common"
        },
        "source": {
            "value": ""
        },
        "traits": {
            "custom": "",
            "rarity": {
                "value": "common"
            },
            "value": [
                "rogue"
            ]
        },
        "usage": {
            "value": "held-in-one-hand"
        }
    },
    "flags": {},
    "img": "systems/pf2e/icons/features/feats/feats.jpg",
    "name": "Enduring Debilitation",
    "permission": {
        "default": 0
    },
    "type": "feat"
}
