{
    "_id": "gRh3Scs2RvtJM8wq",
    "content": "<p>It's a well-known secret that for every playhouse in the Ivy District, there's an underground criminal element lurking somewhere in the shadows. To get intel on the occultists, assassins, and thieves' guilds that pull the strings of power in the Ivy District, the Lotus Guard trains some of the best undercover agents and operatives in all of Absalom. You're one such agent, and you've put your life on the line more times than you can count by getting close to the Ivy's most dangerous criminals. Your risky missions and thrill-seeking derring-do have earned you many accolades-but also no shortage of enemies.</p>\n<p>You transferred to the Edgewatch after your cover was unexpectedly blown and you needed a safe place to lie low away from the Ivy District. With your mastery of disguise and your ability to confidently converse with criminal masterminds, it won't be long before you've made yourself an indispensable undercover operator in this precinct as well.</p>\n<p>Choose two ability boosts. One must be to <span style=\"text-decoration: underline;\">Intelligence</span> or <span style=\"text-decoration: underline;\">Charisma</span>, and one is a free ability boost.</p>\n<p>You're trained in the <span style=\"text-decoration: underline;\">Deception</span> skill, <span style=\"text-decoration: underline;\">Art Lore</span>, and <span style=\"text-decoration: underline;\">Underworld Lore</span>. You gain a +1 circumstance bonus to <span style=\"text-decoration: underline;\">Deception</span>, <span style=\"text-decoration: underline;\">Diplomacy</span>, and <span style=\"text-decoration: underline;\">Intimidation</span> checks to @Compendium[pf2e.actionspf2e.Interact]{Interact} with Lotus Guards and high-ranking criminals like guild masters, gang leaders, and mob bosses. You gain the @Compendium[pf2e.feats-srd.Charming Liar]{Charming Liar} skill feat.</p>",
    "flags": {},
    "name": "Undercover Lotus Guard",
    "permission": {
        "default": 0
    }
}
