{
    "_id": "Dwxi1q1OWB1ufFvy",
    "data": {
        "actionCategory": {
            "value": ""
        },
        "actionType": {
            "value": "action"
        },
        "actions": {
            "value": "1"
        },
        "description": {
            "chat": "",
            "unidentified": "",
            "value": "<p>You control your breathing and align it with your ki, exhaling with controlled force in order to overcome your opponent's resistance. If you use your next action to @Compendium[pf2e.actionspf2e.Cast a Spell]{Cast a Spell} that has the monk trait and no duration, the spell and any @Compendium[pf2e.actionspf2e.Strike]{Strikes} you make as a result of casting it ignore an amount of the target's resistance to physical damage equal to your level.</p>"
        },
        "featType": {
            "value": "class"
        },
        "level": {
            "value": "12"
        },
        "prerequisites": {
            "value": [
                "ki spells"
            ]
        },
        "rarity": {
            "value": "common"
        },
        "source": {
            "value": ""
        },
        "traits": {
            "rarity": {
                "value": "common"
            },
            "value": [
                "concentrate",
                "metamagic",
                "monk"
            ]
        },
        "usage": {
            "value": ""
        }
    },
    "flags": {},
    "img": "systems/pf2e/icons/features/feats/feats.jpg",
    "name": "Overwhelming Breath",
    "permission": {
        "default": 0
    },
    "type": "feat"
}
