{
    "_id": "s0VbbQJNlSgPocui",
    "data": {
        "actionCategory": {
            "value": ""
        },
        "actionType": {
            "value": "passive"
        },
        "actions": {
            "value": ""
        },
        "description": {
            "chat": "",
            "unidentified": "",
            "value": "<h2 class=\"title\" style=\"box-sizing: border-box; user-select: text; font-weight: 600; color: #191813; font-family: Roboto, system, -apple-system, sans-serif;\">Composition Spells</h2>\n<p style=\"box-sizing: border-box; user-select: text; color: #191813; font-family: Roboto, system, -apple-system, sans-serif;\">You can infuse your performances with magic to create unique effects called compositions. Compositions are a special type of spell that often require you to use the Performance skill when casting them. Composition spells are a type of focus spell. It costs 1 Focus Point to cast a focus spell, and you start with a focus pool of 1 Focus Point. You refill your focus pool during your daily preparations, and you can regain 1 Focus Point by spending 10 minutes using the Refocus activity to perform, write a new composition, or otherwise engage your muse.</p>\n<p style=\"box-sizing: border-box; user-select: text; color: #191813; font-family: Roboto, system, -apple-system, sans-serif;\">Focus spells are automatically heightened to half your level rounded up, much like cantrips. Focus spells don't require spell slots, and you can't cast them using spell slots. Taking feats can give you more focus spells and increase the size of your focus pool, though your focus pool can never hold more than 3 Focus Points. The full rules for focus spells appear on page 300.</p>\n<p style=\"box-sizing: border-box; user-select: text; color: #191813; font-family: Roboto, system, -apple-system, sans-serif;\">You learn the @Compendium[pf2e.spells-srd.Counter Performance]{Counter Performance} composition spell (page 386), protecting against auditory and visual effects.</p>\n<h3 class=\"title\" style=\"box-sizing: border-box; user-select: text; font-weight: 600; color: #191813; font-family: Roboto, system, -apple-system, sans-serif;\"><strong style=\"box-sizing: border-box; user-select: text;\">Composition Cantrips</strong></h3>\n<p style=\"box-sizing: border-box; user-select: text; color: #191813; font-family: Roboto, system, -apple-system, sans-serif;\">  Composition cantrips are special composition spells that don't cost Focus Points, so you can use them as often as you like. Composition cantrips are in addition to the cantrips you choose from the occult list. Generally, only feats can give you more composition cantrips. Unlike other cantrips, you can't swap out composition cantrips gained from bard feats at a later level, unless you swap out the specific feat via retraining (page 481). You learn the @Compendium[pf2e.spells-srd.Inspire Courage]{Inspire Courage} composition cantrip, which boosts your allies' attacks, damage, and defense against fear.</p>"
        },
        "featType": {
            "value": "classfeature"
        },
        "level": {
            "value": "0"
        },
        "prerequisites": {
            "value": ""
        },
        "rarity": {
            "value": "common"
        },
        "source": {
            "value": ""
        },
        "traits": {
            "rarity": {
                "value": "common"
            },
            "selected": {},
            "value": []
        },
        "usage": {
            "value": "held-in-one-hand"
        }
    },
    "flags": {},
    "img": "systems/pf2e/icons/equipment/adventuring-gear/musical-instrument-handheld.jpg",
    "name": "Composition Spells",
    "permission": {
        "default": 0
    },
    "type": "feat"
}
