{
    "_id": "2fVNJ23gb3dixVu8",
    "data": {
        "brokenThreshold": {
            "value": 0
        },
        "bulkCapacity": {
            "value": ""
        },
        "collapsed": {
            "value": false
        },
        "containerId": {
            "value": ""
        },
        "description": {
            "chat": "",
            "unidentified": "",
            "value": "<p>This canvas vest has been filled with cork shavings, tightly folded, and sewn shut. Wearing a buoyancy vest allows you to float in water with a lowered risk of sinking. If you end your turn in water while wearing a buoyancy vest and haven't succeeded at a Swim action that turn, attempt a DC 5 flat check.</p>\n<p>On a success, you do not sink, though you can still get moved by the current, as determined by the GM. The GM can also determine whether the vest is more or less effective in different weather conditions, raising the DC in rough waters or lowering the DC in calm water.</p>"
        },
        "equipped": {
            "value": false
        },
        "equippedBulk": {
            "value": ""
        },
        "hardness": {
            "value": 0
        },
        "hp": {
            "value": 0
        },
        "identified": {
            "value": true
        },
        "invested": {
            "value": false
        },
        "level": {
            "value": "0"
        },
        "maxHp": {
            "value": 0
        },
        "negateBulk": {
            "value": "0"
        },
        "preciousMaterial": {
            "value": ""
        },
        "preciousMaterialGrade": {
            "value": ""
        },
        "price": {
            "value": "5 gp"
        },
        "quantity": {
            "value": "1"
        },
        "rarity": {
            "value": "common"
        },
        "rules": [],
        "source": {
            "value": ""
        },
        "stackGroup": {
            "value": ""
        },
        "traits": {
            "rarity": {
                "value": "common"
            },
            "usage": {
                "value": "worngarment"
            },
            "value": []
        },
        "usage": {
            "value": "held-in-one-hand"
        },
        "weight": {
            "value": "1"
        }
    },
    "effects": [],
    "flags": {
        "core": {
            "sourceId": "Item.Y87UqqwAghcPzDrQ"
        }
    },
    "img": "systems/pf2e/icons/equipment/adventuring-gear/buoyancy-vest.jpg",
    "name": "Buoyancy Vest",
    "permission": {
        "default": 0
    },
    "type": "equipment"
}
