{
    "_id": "25WDi1cVUrW92sUj",
    "data": {
        "actionCategory": {
            "value": ""
        },
        "actionType": {
            "value": "reaction"
        },
        "actions": {
            "value": ""
        },
        "description": {
            "chat": "",
            "unidentified": "",
            "value": "<p><strong>Frequency</strong> once per 10 minutes<br /><strong>Trigger</strong> Another creature attempts a check to investigate a lead you're pursuing</p>\n<hr />\n<p>You share information with the triggering creature. They gain a circumstance bonus to their check equal to your circumstance bonus to checks investigating your subject from @Compendium[pf2e.actionspf2e.Pursue a Lead]{Pursue a Lead}. The GM can add any relevant traits to this reaction depending on the situation, such as auditory and linguistic if you're conveying information verbally.</p>"
        },
        "rarity": {
            "value": "common"
        },
        "requirements": {
            "value": ""
        },
        "rules": [],
        "skill_requirement": {
            "skill": {
                "rank": "",
                "skill": ""
            }
        },
        "skill_requirements": {
            "rank": "",
            "skill": ""
        },
        "source": {
            "value": ""
        },
        "traits": {
            "custom": "",
            "value": [
                "concentrate",
                "investigator"
            ]
        },
        "trigger": {
            "value": ""
        },
        "usage": {
            "value": "held-in-one-hand"
        },
        "weapon": {
            "value": ""
        }
    },
    "effects": [],
    "flags": {},
    "img": "systems/pf2e/icons/actions/Reaction.png",
    "name": "Clue In",
    "permission": {
        "default": 0
    },
    "type": "action"
}
