{
    "_id": "RL7faGkymMFLAqTU",
    "data": {
        "actionCategory": {
            "value": ""
        },
        "actionType": {
            "value": "passive"
        },
        "actions": {
            "value": ""
        },
        "description": {
            "chat": "",
            "unidentified": "",
            "value": "<p>Your forceful blows shatter objects with ease. While you are raging, your melee @Compendium[pf2e.actionspf2e.Strike]{Strikes} ignore 5 points of an object's Hardness. If you have the devastator class feature, you instead ignore 10 points of an object's Hardness.</p>"
        },
        "featType": {
            "value": "class"
        },
        "level": {
            "value": "16"
        },
        "prerequisites": {
            "value": [
                ""
            ]
        },
        "rarity": {
            "value": "common"
        },
        "rules": [],
        "source": {
            "value": ""
        },
        "traits": {
            "rarity": {
                "value": "common"
            },
            "value": [
                "barbarian",
                "rage"
            ]
        },
        "usage": {
            "value": ""
        }
    },
    "flags": {},
    "img": "systems/pf2e/icons/features/feats/feats.jpg",
    "name": "Shattering Blows",
    "permission": {
        "default": 0
    },
    "type": "feat"
}
