{
    "_id": "lGMSYgWqZrg2SaTH",
    "content": "<p><span id=\"ctl00_MainContent_DetailedOutput\">The strands of fate are clear to you, as you have learned many traditional forms by which laypeople can divine the future. You might have used these skills to guide your community, or simply to make money. But even the slightest peek into these practices connects you to the occult mysteries of the universe.<br /></span></p>\n<p><span id=\"ctl00_MainContent_DetailedOutput\">Choose two ability boosts. One must be to <strong>Intelligence</strong> or <strong>Charisma</strong>, and one is a free ability boost.<br /></span></p>\n<p><span id=\"ctl00_MainContent_DetailedOutput\">You're trained in the Occultism skill and the Fortune-Telling Lore skill. You gain the @Compendium[pf2e.feats-srd.Oddity Identification]{Oddity Identification} skill feat.</span></p>",
    "flags": {},
    "name": "Fortune Teller",
    "permission": {
        "default": 0
    }
}
