\relax 
\@writefile{toc}{\contentsline {section}{\numberline {I}THE THREE TASKS}{1}}
\@writefile{toc}{\contentsline {section}{\numberline {II}MODEL BASED APPROACH WITH GP}{1}}
\@writefile{toc}{\contentsline {subsection}{\numberline {II-A}PILCO}{1}}
\@writefile{toc}{\contentsline {subsection}{\numberline {II-B}Results}{1}}
\@writefile{toc}{\contentsline {paragraph}{\numberline {II-B.0.a}MSD-system}{1}}
\@writefile{toc}{\contentsline {paragraph}{\numberline {II-B.0.b}cart-pole (CP)}{1}}
\@writefile{toc}{\contentsline {paragraph}{\numberline {II-B.0.c}double pendulum (DP)}{1}}
\@writefile{toc}{\contentsline {section}{\numberline {III}POWER-algorithm}{1}}
\@writefile{loa}{\contentsline {algocf}{\numberline {1}{\ignorespaces POWER-algorithm}}{1}}
\@writefile{toc}{\contentsline {subsection}{\numberline {III-A}results}{1}}
\@writefile{toc}{\contentsline {section}{\numberline {IV}Q-LEARNING}{1}}
\bibcite{c1}{1}
\bibcite{c1}{2}
\bibcite{c1}{3}
\@writefile{lof}{\contentsline {figure}{\numberline {1}{\ignorespaces POWER-algorithm pushing MSD-system to the goal state}}{2}}
\newlabel{fig:damper}{{1}{2}}
\@writefile{toc}{\contentsline {subsection}{\numberline {IV-A}Algorithm}{2}}
\@writefile{loa}{\contentsline {algocf}{\numberline {2}{\ignorespaces Q}}{2}}
\@writefile{toc}{\contentsline {section}{\numberline {V}COMPARISON AND DISCUSSION}{2}}
\newlabel{COMPARISON}{{V}{2}}
\@writefile{toc}{\contentsline {paragraph}{\numberline {V-.0.d}accuracy}{2}}
\@writefile{toc}{\contentsline {paragraph}{\numberline {V-.0.e}number of interactions with the external world}{2}}
\@writefile{toc}{\contentsline {paragraph}{\numberline {V-.0.f}learning time}{2}}
\@writefile{toc}{\contentsline {paragraph}{\numberline {V-.0.g}prior knowledge required}{2}}
\@writefile{toc}{\contentsline {paragraph}{\numberline {V-.0.h}control energy}{2}}
\@writefile{toc}{\contentsline {paragraph}{\numberline {V-.0.i}implementation complexity}{2}}
\@writefile{toc}{\contentsline {section}{\numberline {VI}CONCLUSIONS}{2}}
\@writefile{toc}{\contentsline {section}{References}{2}}
\newlabel{pilco}{{1}{2}}
