<mxfile host="Electron" modified="2023-12-12T16:15:57.522Z" agent="Mozilla/5.0 (X11; Linux x86_64) AppleWebKit/537.36 (KHTML, like Gecko) draw.io/22.1.2 Chrome/114.0.5735.289 Electron/25.9.4 Safari/537.36" etag="gm3SUiuuzJg6rY8_I2DQ" version="22.1.2" type="device">
  <diagram name="Page-1" id="mL6DOgV5Ov8pAtu58Sbv">
    <mxGraphModel dx="988" dy="586" grid="1" gridSize="10" guides="1" tooltips="1" connect="1" arrows="1" fold="1" page="1" pageScale="1" pageWidth="850" pageHeight="1100" math="0" shadow="0">
      <root>
        <mxCell id="0" />
        <mxCell id="1" parent="0" />
        <mxCell id="7zW7WfafBQHXKKHIUJ7Q-17" value="rfdc_adc_config_0.hdl" style="rounded=0;whiteSpace=wrap;html=1;strokeWidth=2;fontStyle=1;verticalAlign=top;fontSize=10;" vertex="1" parent="1">
          <mxGeometry x="340" y="950" width="120" height="60" as="geometry" />
        </mxCell>
        <mxCell id="7zW7WfafBQHXKKHIUJ7Q-16" value="rfdc_adc_config_0.hdl" style="rounded=0;whiteSpace=wrap;html=1;strokeWidth=2;fontStyle=1;verticalAlign=top;fontSize=10;" vertex="1" parent="1">
          <mxGeometry x="330" y="940" width="120" height="60" as="geometry" />
        </mxCell>
        <mxCell id="7zW7WfafBQHXKKHIUJ7Q-15" value="rfdc_adc_config_0.hdl" style="rounded=0;whiteSpace=wrap;html=1;strokeWidth=2;fontStyle=1;verticalAlign=top;fontSize=10;" vertex="1" parent="1">
          <mxGeometry x="320" y="930" width="120" height="60" as="geometry" />
        </mxCell>
        <mxCell id="7zW7WfafBQHXKKHIUJ7Q-13" value="rfdc_dac_config_0.hdl" style="rounded=0;whiteSpace=wrap;html=1;strokeWidth=2;fontStyle=1;verticalAlign=top;fontSize=10;" vertex="1" parent="1">
          <mxGeometry x="340" y="830" width="120" height="60" as="geometry" />
        </mxCell>
        <mxCell id="7zW7WfafBQHXKKHIUJ7Q-7" style="edgeStyle=orthogonalEdgeStyle;rounded=0;orthogonalLoop=1;jettySize=auto;html=1;entryX=0.5;entryY=0;entryDx=0;entryDy=0;exitX=1;exitY=1;exitDx=0;exitDy=0;" edge="1" parent="1" source="7zW7WfafBQHXKKHIUJ7Q-1" target="7zW7WfafBQHXKKHIUJ7Q-3">
          <mxGeometry relative="1" as="geometry">
            <mxPoint x="470" y="630" as="sourcePoint" />
          </mxGeometry>
        </mxCell>
        <mxCell id="7zW7WfafBQHXKKHIUJ7Q-9" style="edgeStyle=orthogonalEdgeStyle;rounded=0;orthogonalLoop=1;jettySize=auto;html=1;exitX=0.75;exitY=1;exitDx=0;exitDy=0;entryX=0.5;entryY=0;entryDx=0;entryDy=0;" edge="1" parent="1" source="7zW7WfafBQHXKKHIUJ7Q-1" target="7zW7WfafBQHXKKHIUJ7Q-2">
          <mxGeometry relative="1" as="geometry" />
        </mxCell>
        <mxCell id="7zW7WfafBQHXKKHIUJ7Q-10" style="edgeStyle=orthogonalEdgeStyle;rounded=0;orthogonalLoop=1;jettySize=auto;html=1;exitX=0.25;exitY=1;exitDx=0;exitDy=0;entryX=0.5;entryY=0;entryDx=0;entryDy=0;" edge="1" parent="1" source="7zW7WfafBQHXKKHIUJ7Q-1" target="7zW7WfafBQHXKKHIUJ7Q-4">
          <mxGeometry relative="1" as="geometry">
            <Array as="points">
              <mxPoint x="390" y="650" />
              <mxPoint x="300" y="650" />
              <mxPoint x="300" y="790" />
              <mxPoint x="370" y="790" />
            </Array>
          </mxGeometry>
        </mxCell>
        <mxCell id="7zW7WfafBQHXKKHIUJ7Q-1" value="drc.rcc" style="rounded=0;whiteSpace=wrap;html=1;strokeWidth=2;fontStyle=1;verticalAlign=top;fontSize=10;" vertex="1" parent="1">
          <mxGeometry x="360" y="560" width="120" height="60" as="geometry" />
        </mxCell>
        <mxCell id="7zW7WfafBQHXKKHIUJ7Q-2" value="rfdc.hdl" style="rounded=0;whiteSpace=wrap;html=1;strokeWidth=2;fontStyle=1;verticalAlign=top;fontSize=10;" vertex="1" parent="1">
          <mxGeometry x="310" y="700" width="120" height="60" as="geometry" />
        </mxCell>
        <mxCell id="7zW7WfafBQHXKKHIUJ7Q-8" style="edgeStyle=orthogonalEdgeStyle;rounded=0;orthogonalLoop=1;jettySize=auto;html=1;exitX=0.5;exitY=1;exitDx=0;exitDy=0;entryX=0.5;entryY=0;entryDx=0;entryDy=0;" edge="1" parent="1" source="7zW7WfafBQHXKKHIUJ7Q-3" target="7zW7WfafBQHXKKHIUJ7Q-5">
          <mxGeometry relative="1" as="geometry" />
        </mxCell>
        <mxCell id="7zW7WfafBQHXKKHIUJ7Q-3" value="lmx2594_proxy.rcc" style="rounded=0;whiteSpace=wrap;html=1;strokeWidth=2;fontStyle=1;verticalAlign=top;fontSize=10;" vertex="1" parent="1">
          <mxGeometry x="480" y="700" width="120" height="60" as="geometry" />
        </mxCell>
        <mxCell id="7zW7WfafBQHXKKHIUJ7Q-5" value="lmx2594.hdl" style="rounded=0;whiteSpace=wrap;html=1;strokeWidth=2;fontStyle=1;verticalAlign=top;fontSize=10;" vertex="1" parent="1">
          <mxGeometry x="480" y="800" width="120" height="60" as="geometry" />
        </mxCell>
        <mxCell id="7zW7WfafBQHXKKHIUJ7Q-6" value="rfdc_adc_config_0.hdl" style="rounded=0;whiteSpace=wrap;html=1;strokeWidth=2;fontStyle=1;verticalAlign=top;fontSize=10;" vertex="1" parent="1">
          <mxGeometry x="310" y="920" width="120" height="60" as="geometry" />
        </mxCell>
        <mxCell id="7zW7WfafBQHXKKHIUJ7Q-12" value="rfdc_dac_config_0.hdl" style="rounded=0;whiteSpace=wrap;html=1;strokeWidth=2;fontStyle=1;verticalAlign=top;fontSize=10;" vertex="1" parent="1">
          <mxGeometry x="330" y="820" width="120" height="60" as="geometry" />
        </mxCell>
        <mxCell id="7zW7WfafBQHXKKHIUJ7Q-11" value="rfdc_dac_config_0.hdl" style="rounded=0;whiteSpace=wrap;html=1;strokeWidth=2;fontStyle=1;verticalAlign=top;fontSize=10;" vertex="1" parent="1">
          <mxGeometry x="320" y="810" width="120" height="60" as="geometry" />
        </mxCell>
        <mxCell id="7zW7WfafBQHXKKHIUJ7Q-4" value="rfdc_dac_config_0.hdl" style="rounded=0;whiteSpace=wrap;html=1;strokeWidth=2;fontStyle=1;verticalAlign=top;fontSize=10;" vertex="1" parent="1">
          <mxGeometry x="310" y="800" width="120" height="60" as="geometry" />
        </mxCell>
        <mxCell id="7zW7WfafBQHXKKHIUJ7Q-14" style="edgeStyle=orthogonalEdgeStyle;rounded=0;orthogonalLoop=1;jettySize=auto;html=1;exitX=0;exitY=1;exitDx=0;exitDy=0;entryX=0.461;entryY=0.043;entryDx=0;entryDy=0;entryPerimeter=0;" edge="1" parent="1" source="7zW7WfafBQHXKKHIUJ7Q-1" target="7zW7WfafBQHXKKHIUJ7Q-6">
          <mxGeometry relative="1" as="geometry">
            <Array as="points">
              <mxPoint x="360" y="640" />
              <mxPoint x="290" y="640" />
              <mxPoint x="290" y="910" />
              <mxPoint x="365" y="910" />
              <mxPoint x="365" y="923" />
            </Array>
          </mxGeometry>
        </mxCell>
      </root>
    </mxGraphModel>
  </diagram>
</mxfile>
