<?xml version="1.0" encoding="UTF-8"?>
<svg width="20px" height="20px" viewBox="0 0 20 20" version="1.1" xmlns="http://www.w3.org/2000/svg" xmlns:xlink="http://www.w3.org/1999/xlink">
    <!-- Generator: Sketch 54.1 (76490) - https://sketchapp.com -->
    <title>Fortress</title>
    <desc>Created with Sketch.</desc>
    <g id="Fortress" stroke="none" stroke-width="1" fill="none" fill-rule="evenodd">
        <circle id="path814" stroke="#9600AE" fill="#FFFFFF" fill-rule="nonzero" cx="10" cy="10" r="9.5"></circle>
        <path d="M8.99999924,14.9999982 L10.666666,15 C10.666666,14.1666666 10.666666,12.4999982 9.83333297,12.4999982 C8.99999924,12.4999982 8.99999924,14.1666666 8.99999924,14.9999982 Z M4,5 L4,6.66666641 L8.16666598,6.66666641 L8.16666598,5 L7.33333294,5 L7.33333294,5.83333315 L6.49999956,5.83333315 L6.5,5 L5.66666641,5 L5.66666641,5.83333315 L4.83333338,5.83333315 L4.83333338,5 L4,5 Z M11.4999992,5 L11.4999992,6.66666641 L15.6666636,6.66666641 L15.6666636,5 L14.8333302,5 L14.8333302,5.83333315 L13.999998,5.83333315 L13.9999992,5 L13.1666646,5 L13.1666646,5.83333315 L12.3333324,5.83333315 L12.3333324,5 L11.4999992,5 Z M4,7.49999921 L4,14.9999992 L8.16666598,15 C8.16666598,14.1666666 8.16666598,11.6666648 9.83333297,11.6666648 C11.4999992,11.6666648 11.4999992,14.1666666 11.5,14.9999992 L15.6666636,15 L15.6666636,7.49999921 L11.5,7.49999921 L11.4999992,9.16666539 L9.83333297,9.16666539 L8.16666598,9.16666539 L8.16666598,7.49999921 L4,7.49999921 Z M5.66666641,9.16666539 L6.49999956,9.16666539 L6.49999956,9.99999854 L6.0833331,10.8333317 L5.66666641,9.99999854 L5.66666641,9.16666539 Z M13.1666646,9.16666539 L13.999998,9.16666539 L13.999998,9.99999854 L13.5833296,10.8333317 L13.1666646,9.99999854 L13.1666646,9.16666539 Z" id="fortress" fill="#9600AE" fill-rule="nonzero"></path>
    </g>
</svg>