<?xml version="1.0" encoding="UTF-8"?>
<svg width="27px" height="31px" viewBox="0 0 27 31" version="1.1" xmlns="http://www.w3.org/2000/svg" xmlns:xlink="http://www.w3.org/1999/xlink">
    <!-- Generator: Sketch 54.1 (76490) - https://sketchapp.com -->
    <title>MenuIconTower</title>
    <desc>Created with Sketch.</desc>
    <g id="MenuIconTower" stroke="none" stroke-width="1" fill="none" fill-rule="evenodd">
        <path d="M4.16332293,1 L4.16332293,7.27998427 L23.1432675,7.27998427 L23.1432675,1 L19.9799395,1 L19.9799395,3.09332907 L15.7621715,3.09332907 L15.7621715,1 L11.5444091,1 L11.5444091,3.09332907 L7.32664827,3.09332907 L7.32664827,1 L4.16332293,1 Z M5.21776373,9.37331227 L4.16332293,28.2132643 L1,28.2132643 L1,30.3065923 L10.4899683,30.3065923 C10.4899683,28.2132643 11.0742229,25.0732723 13.6532941,25.0732723 C16.3396995,25.1291923 16.8166168,28.2132643 16.8166168,30.3065923 L26.3065928,30.3065923 L26.3065928,28.2132643 L23.1432675,28.2132643 L22.0888221,9.37331227 L5.21776373,9.37331227 Z M13.6532941,13.5599683 C15.7621715,13.5599683 15.7621715,15.6532963 15.7621715,15.6532963 L15.7621715,17.7466243 L11.5444091,17.7466243 L11.5444091,15.6532963 C11.5444091,15.6532963 11.5444091,13.5599683 13.6532941,13.5599683 Z" id="Shape" fill="#FFFFFF" fill-rule="nonzero"></path>
    </g>
</svg>