<?xml version="1.0" encoding="UTF-8"?>
<svg width="20px" height="20px" viewBox="0 0 20 20" version="1.1" xmlns="http://www.w3.org/2000/svg" xmlns:xlink="http://www.w3.org/1999/xlink">
    <!-- Generator: Sketch 54.1 (76490) - https://sketchapp.com -->
    <title>TowerRuin</title>
    <desc>Created with Sketch.</desc>
    <g id="TowerRuin" stroke="none" stroke-width="1" fill="none" fill-rule="evenodd">
        <circle id="path9" stroke="#9600AE" fill="#FFFFFF" fill-rule="nonzero" cx="10" cy="10" r="9.5"></circle>
        <path d="M6.30329239,3.81077762 L6.30329239,6.38220619 L11.7692522,6.38220619 L11.7491633,6.34872362 C11.7476805,6.34738648 11.7455633,6.34687219 11.7441405,6.34537219 C11.7415176,6.34261219 11.7408491,6.33875505 11.7391176,6.33532734 C11.7383192,6.33290162 11.7367605,6.33098162 11.7357662,6.32863305 C11.7352999,6.32751877 11.7345062,6.32642162 11.7340948,6.32528162 L11.7340948,6.32361019 L11.7324233,6.32193877 L11.7307519,6.32026734 C11.7294833,6.31915305 11.7285148,6.31810734 11.7274005,6.31691591 C11.7263719,6.31485877 11.7265923,6.31232162 11.7257291,6.31022162 L11.1615514,5.39950528 L10.7112165,5.24883568 L10.0767299,4.74995171 L10.0867745,4.73655885 L9.94782362,4.15396958 L9.30329239,3.89615709 L9.30329239,4.66792048 L7.58900668,4.66792048 L7.58900668,3.81077762 L6.30329239,3.81077762 Z M6.73186382,7.23934905 L6.30329239,14.9536348 L5.01757811,14.9536348 L5.01757811,15.8107776 L8.87472097,15.8107776 C8.87472097,14.9536348 9.11218802,13.6679205 10.1604353,13.6679205 C11.2523108,13.6908233 11.4461495,14.9536348 11.4461495,15.8107776 L15.3032923,15.8107776 L15.3032923,14.9536348 L14.019252,14.9536348 L14.010852,14.9687033 L13.2960077,14.5150202 L13.3998026,13.4854442 L13.2558292,13.2795293 C13.2548006,13.2766151 13.2566863,13.2785008 13.2541149,13.2761865 L12.7619975,12.5747282 L12.7117745,11.3978312 L12.6397879,11.3141258 C12.6420965,11.3144015 12.6377255,11.3123633 12.6364397,11.3107776 L12.6297433,11.3040812 L12.1576451,10.7666928 L12.5175781,9.80073294 L11.4695871,9.08086691 L11.5214844,8.35932671 L10.4919085,7.81189374 L10.4282924,7.69805437 L10.2692522,7.42015262 L10.1654576,7.23934905 L6.73186382,7.23934905 Z M10.1604353,8.95363477 C11.0175781,8.95363477 11.0175781,9.81077762 11.0175781,9.81077762 L11.0175781,10.6679205 L9.30329239,10.6679205 L9.30329239,9.81077762 C9.30329239,9.81077762 9.30329239,8.95363477 10.1604353,8.95363477 Z" id="watchtower" fill="#9600AE" fill-rule="nonzero"></path>
    </g>
</svg>