{
    "niv": {
        "branch": "master",
        "description": "Easy dependency management for Nix projects",
        "homepage": "https://github.com/nmattia/niv",
        "owner": "nmattia",
        "repo": "niv",
        "rev": "9d35b9e4837ab88517210b1701127612c260eccf",
        "sha256": "0q50xhnm8g2yfyakrh0nly4swyygxpi0a8cb9gp65wcakcgvzvdh",
        "type": "tarball",
        "url": "https://github.com/nmattia/niv/archive/9d35b9e4837ab88517210b1701127612c260eccf.tar.gz",
        "url_template": "https://github.com/<owner>/<repo>/archive/<rev>.tar.gz"
    },
    "nixpkgs": {
        "branch": "nixos-unstable",
        "description": "Nix Packages collection",
        "homepage": "",
        "owner": "NixOS",
        "repo": "nixpkgs",
        "rev": "84d74ae9c9cbed73274b8e4e00be14688ffc93fe",
        "sha256": "0ww70kl08rpcsxb9xdx8m48vz41dpss4hh3vvsmswll35l158x0v",
        "type": "tarball",
        "url": "https://github.com/NixOS/nixpkgs/archive/84d74ae9c9cbed73274b8e4e00be14688ffc93fe.tar.gz",
        "url_template": "https://github.com/<owner>/<repo>/archive/<rev>.tar.gz"
    }
}
