<?xml version="1.0" encoding="UTF-8" standalone="no"?>
<!-- Created with Inkscape (http://www.inkscape.org/) -->

<svg
        xmlns:dc="http://purl.org/dc/elements/1.1/"
        xmlns:cc="http://creativecommons.org/ns#"
        xmlns:rdf="http://www.w3.org/1999/02/22-rdf-syntax-ns#"
        xmlns="http://www.w3.org/2000/svg"
        xmlns:sodipodi="http://sodipodi.sourceforge.net/DTD/sodipodi-0.dtd"
        xmlns:inkscape="http://www.inkscape.org/namespaces/inkscape"
        width="64"
        height="64"
        id="svg2"
        version="1.1"
        inkscape:version="0.47 r22583"
        sodipodi:docname="water_well.svg"
        inkscape:export-filename="D:\water_well20.png"
        inkscape:export-xdpi="31.809999"
        inkscape:export-ydpi="31.809999">
    <defs
            id="defs4">
        <inkscape:perspective
                sodipodi:type="inkscape:persp3d"
                inkscape:vp_x="0 : 526.18109 : 1"
                inkscape:vp_y="0 : 1000 : 0"
                inkscape:vp_z="744.09448 : 526.18109 : 1"
                inkscape:persp3d-origin="372.04724 : 350.78739 : 1"
                id="perspective10"/>
    </defs>
    <sodipodi:namedview
            id="base"
            pagecolor="#ffffff"
            bordercolor="#666666"
            borderopacity="1.0"
            inkscape:pageopacity="0.0"
            inkscape:pageshadow="2"
            inkscape:zoom="5.6"
            inkscape:cx="66.814755"
            inkscape:cy="62.857143"
            inkscape:document-units="px"
            inkscape:current-layer="layer1"
            showgrid="false"
            inkscape:window-width="1600"
            inkscape:window-height="1110"
            inkscape:window-x="-4"
            inkscape:window-y="-4"
            inkscape:window-maximized="1"/>
    <metadata
            id="metadata7">
        <rdf:RDF>
            <cc:Work
                    rdf:about="">
                <dc:format>image/svg+xml</dc:format>
                <dc:type
                        rdf:resource="http://purl.org/dc/dcmitype/StillImage"/>
                <dc:title></dc:title>
            </cc:Work>
        </rdf:RDF>
    </metadata>
    <g
            inkscape:label="Ebene 1"
            inkscape:groupmode="layer"
            id="layer1"
            transform="translate(0,-988.36218)">
        <rect
                style="fill:#803300;fill-opacity:1;stroke:none"
                id="rect2816"
                width="34.49947"
                height="19.528002"
                x="8.399621"
                y="1029.2986"/>
        <rect
                y="1000.0067"
                x="4.4940224"
                height="3.2546666"
                width="43.612537"
                id="rect3596"
                style="fill:#666666;fill-opacity:1;stroke:none"/>
        <rect
                style="fill:#666666;fill-opacity:1;stroke:none"
                id="rect3598"
                width="16.590097"
                height="3.2546666"
                x="1000.0067"
                y="-50.90094"
                transform="matrix(0,1,-1,0,0,0)"/>
        <rect
                transform="scale(-1,-1)"
                y="-1015.7065"
                x="-61.076149"
                height="3.2546666"
                width="13.018668"
                id="rect3600"
                style="fill:#666666;fill-opacity:1;stroke:none"/>
        <rect
                transform="matrix(0,1,-1,0,0,0)"
                y="-24.434872"
                x="999.08606"
                height="1.6436887"
                width="24.755795"
                id="rect3602"
                style="fill:#d45500;fill-opacity:1;stroke:none"/>
        <rect
                y="-42.248158"
                x="994.79919"
                height="4.4380765"
                width="28.943405"
                id="rect3592"
                style="fill:#803300;fill-opacity:1;stroke:none"
                transform="matrix(0,1,-1,0,0,0)"/>
        <rect
                transform="matrix(0,1,-1,0,0,0)"
                style="fill:#803300;fill-opacity:1;stroke:none"
                id="rect3604"
                width="28.943405"
                height="4.4380765"
                x="994.56897"
                y="-14.401254"/>
        <rect
                style="fill:#d45500;fill-opacity:1;stroke:none"
                id="rect3606"
                width="9.8960066"
                height="6.9041915"
                x="21.716177"
                y="997.68939"/>
        <rect
                style="fill:#552200;fill-opacity:1;stroke:none"
                id="rect3590"
                width="41.65974"
                height="6.5093336"
                x="5.1449552"
                y="1023.4403"/>
    </g>
</svg>
