<?xml version="1.0" encoding="UTF-8" standalone="no"?>
<!-- Created with Inkscape (http://www.inkscape.org/) -->
<svg
        xmlns:dc="http://purl.org/dc/elements/1.1/"
        xmlns:cc="http://web.resource.org/cc/"
        xmlns:rdf="http://www.w3.org/1999/02/22-rdf-syntax-ns#"
        xmlns="http://www.w3.org/2000/svg"
        xmlns:sodipodi="http://sodipodi.sourceforge.net/DTD/sodipodi-0.dtd"
        xmlns:inkscape="http://www.inkscape.org/namespaces/inkscape"
        width="32"
        height="32"
        id="svg2"
        sodipodi:version="0.32"
        inkscape:version="0.45.1"
        version="1.0"
        sodipodi:docbase="/home/tweety/svn.openstreetmap.org/applications/share/map-icons/svg/misc/landmark/power"
        sodipodi:docname="tower.svg"
        inkscape:output_extension="org.inkscape.output.svg.inkscape">
    <defs
            id="defs4"/>
    <sodipodi:namedview
            id="base"
            pagecolor="#ffffff"
            bordercolor="#666666"
            borderopacity="1.0"
            gridtolerance="10000"
            guidetolerance="10"
            objecttolerance="10"
            inkscape:pageopacity="0.0"
            inkscape:pageshadow="2"
            inkscape:zoom="22.4"
            inkscape:cx="20.891323"
            inkscape:cy="12.927264"
            inkscape:document-units="px"
            inkscape:current-layer="layer1"
            width="32px"
            height="32px"
            inkscape:window-width="906"
            inkscape:window-height="897"
            inkscape:window-x="486"
            inkscape:window-y="74"/>
    <metadata
            id="metadata7">
        <rdf:RDF>
            <cc:Work
                    rdf:about="">
                <dc:format>image/svg+xml</dc:format>
                <dc:type
                        rdf:resource="http://purl.org/dc/dcmitype/StillImage"/>
                <cc:license
                        rdf:resource="http://web.resource.org/cc/PublicDomain"/>
            </cc:Work>
            <cc:License
                    rdf:about="http://web.resource.org/cc/PublicDomain">
                <cc:permits
                        rdf:resource="http://web.resource.org/cc/Reproduction"/>
                <cc:permits
                        rdf:resource="http://web.resource.org/cc/Distribution"/>
                <cc:permits
                        rdf:resource="http://web.resource.org/cc/DerivativeWorks"/>
            </cc:License>
        </rdf:RDF>
    </metadata>
    <g
            inkscape:label="Layer 1"
            inkscape:groupmode="layer"
            id="layer1">
        <path
                style="fill:#010101;fill-opacity:1;fill-rule:evenodd;stroke:#000000;stroke-width:0.52399784;stroke-linecap:butt;stroke-linejoin:miter;stroke-miterlimit:4;stroke-dasharray:none;stroke-opacity:1"
                d="M 12.488001,2.9048561 L 2.1870957,20.421199 L 7.1536037,17.946062 L 1.0834271,31.273714 L 10.648553,14.899742 L 5.1302107,17.374878 L 12.488001,2.9048561 z "
                id="path3443"
                sodipodi:nodetypes="ccccccc"/>
        <path
                style="fill:none;fill-rule:evenodd;stroke:#000000;stroke-width:0.3;stroke-linecap:butt;stroke-linejoin:miter;stroke-opacity:1;stroke-miterlimit:4;stroke-dasharray:none"
                d="M 20.625,31.464286 L 24.196429,1.5535714 L 28.303571,31.375"
                id="path2158"/>
        <path
                style="fill:none;fill-rule:evenodd;stroke:#000000;stroke-width:0.3;stroke-linecap:butt;stroke-linejoin:miter;stroke-opacity:1;stroke-miterlimit:4;stroke-dasharray:none"
                d="M 18.571429,4.5892857 L 29.910714,4.5892857"
                id="path2160"
                sodipodi:nodetypes="cc"/>
        <path
                style="fill:none;fill-rule:evenodd;stroke:#000000;stroke-width:0.30000001;stroke-linecap:butt;stroke-linejoin:miter;stroke-miterlimit:4;stroke-dasharray:none;stroke-opacity:1"
                d="M 20,7.625 L 28.660715,7.625"
                id="path2162"
                sodipodi:nodetypes="cc"/>
        <path
                style="fill:none;fill-rule:evenodd;stroke:#000000;stroke-width:0.19748697;stroke-linecap:butt;stroke-linejoin:miter;stroke-miterlimit:4;stroke-dasharray:none;stroke-opacity:1"
                d="M 22.453815,17 L 26.206897,17"
                id="path3134"
                sodipodi:nodetypes="cc"/>
        <path
                style="fill:none;fill-rule:evenodd;stroke:#000000;stroke-width:0.17750704;stroke-linecap:butt;stroke-linejoin:miter;stroke-miterlimit:4;stroke-dasharray:none;stroke-opacity:1"
                d="M 22.79199,13.026786 L 25.824082,13.026786"
                id="path3136"
                sodipodi:nodetypes="cc"/>
        <path
                style="fill:none;fill-rule:evenodd;stroke:#000000;stroke-width:0.22755696;stroke-linecap:butt;stroke-linejoin:miter;stroke-miterlimit:4;stroke-dasharray:none;stroke-opacity:1"
                d="M 21.905818,21.598214 L 26.888825,21.598214"
                id="path3138"
                sodipodi:nodetypes="cc"/>
        <path
                style="fill:none;fill-rule:evenodd;stroke:#000000;stroke-width:0.25672871;stroke-linecap:butt;stroke-linejoin:miter;stroke-miterlimit:4;stroke-dasharray:none;stroke-opacity:1"
                d="M 21.270717,26.151786 L 27.613211,26.151786"
                id="path3140"
                sodipodi:nodetypes="cc"/>
    </g>
</svg>
