<?xml version="1.0" encoding="UTF-8" standalone="no"?>
<!-- Created with Inkscape (http://www.inkscape.org/) -->
<svg
        xmlns:dc="http://purl.org/dc/elements/1.1/"
        xmlns:cc="http://web.resource.org/cc/"
        xmlns:rdf="http://www.w3.org/1999/02/22-rdf-syntax-ns#"
        xmlns="http://www.w3.org/2000/svg"
        xmlns:sodipodi="http://sodipodi.sourceforge.net/DTD/sodipodi-0.dtd"
        xmlns:inkscape="http://www.inkscape.org/namespaces/inkscape"
        width="12"
        height="12"
        id="svg2160"
        sodipodi:version="0.32"
        inkscape:version="0.45.1"
        version="1.0"
        sodipodi:docbase="C:\Dokumente und Einstellungen\ulfl\Eigene Dateien\svn.openstreetmap.org\applications\share\map-icons\svg\vehicle\restrictions"
        sodipodi:docname="bollard.svg"
        inkscape:output_extension="org.inkscape.output.svg.inkscape"
        inkscape:export-filename="/home/ms/OSM-Icon-Schutzhütte.png"
        inkscape:export-xdpi="180"
        inkscape:export-ydpi="180">
    <defs
            id="defs2162">
        <linearGradient
                id="linearGradient5233">
            <stop
                    style="stop-color:#ffffff;stop-opacity:1;"
                    offset="0"
                    id="stop5235"/>
            <stop
                    style="stop-color:#ffffff;stop-opacity:0;"
                    offset="1"
                    id="stop5237"/>
        </linearGradient>
    </defs>
    <sodipodi:namedview
            id="base"
            pagecolor="#ffffff"
            bordercolor="#666666"
            borderopacity="1.0"
            inkscape:pageopacity="0.0"
            inkscape:pageshadow="2"
            inkscape:zoom="45.254834"
            inkscape:cx="9.6580518"
            inkscape:cy="5.5856187"
            inkscape:current-layer="layer4"
            showgrid="true"
            inkscape:grid-bbox="true"
            inkscape:document-units="px"
            width="12px"
            height="12px"
            units="px"
            gridempspacing="4"
            gridspacingx="0.25px"
            gridspacingy="0.25px"
            inkscape:window-width="1018"
            inkscape:window-height="712"
            inkscape:window-x="110"
            inkscape:window-y="145"
            gridoriginx="6px"
            gridoriginy="6px"/>
    <metadata
            id="metadata2165">
        <rdf:RDF>
            <cc:Work
                    rdf:about="">
                <dc:format>image/svg+xml</dc:format>
                <dc:type
                        rdf:resource="http://purl.org/dc/dcmitype/StillImage"/>
                <cc:license
                        rdf:resource="http://web.resource.org/cc/PublicDomain"/>
            </cc:Work>
            <cc:License
                    rdf:about="http://web.resource.org/cc/PublicDomain">
                <cc:permits
                        rdf:resource="http://web.resource.org/cc/Reproduction"/>
                <cc:permits
                        rdf:resource="http://web.resource.org/cc/Distribution"/>
                <cc:permits
                        rdf:resource="http://web.resource.org/cc/DerivativeWorks"/>
            </cc:License>
        </rdf:RDF>
    </metadata>
    <g
            inkscape:groupmode="layer"
            id="layer3"
            inkscape:label="Layout"
            style="display:none">
        <rect
                style="fill:none;stroke:#000000;stroke-width:0.1;stroke-miterlimit:4;stroke-dasharray:none;stroke-opacity:1;display:inline"
                id="rect4134"
                width="10"
                height="10"
                x="1"
                y="1"/>
        <rect
                style="fill:none;stroke:#000000;stroke-width:0.1;stroke-miterlimit:4;stroke-dasharray:none;stroke-opacity:1;display:inline"
                id="rect4136"
                width="8"
                height="8"
                x="2"
                y="2"/>
    </g>
    <g
            inkscape:groupmode="layer"
            id="layer5"
            inkscape:label="Schatten"
            style="display:inline"/>
    <g
            inkscape:groupmode="layer"
            id="layer1"
            inkscape:label="Rahmen"
            style="display:inline"/>
    <g
            inkscape:groupmode="layer"
            id="layer2"
            inkscape:label="Streifen"
            style="display:inline"/>
    <g
            inkscape:groupmode="layer"
            id="layer4"
            inkscape:label="glanz"
            style="display:inline">
        <g
                id="g5618">
            <path
                    sodipodi:nodetypes="cscscc"
                    id="path5584"
                    d="M 4.8698904,9.4954858 C 4.8698904,9.4954858 5.7431163,8.3830756 5.9931163,8.1330756 C 6.2431163,7.8830756 5.6102253,7.692437 5.2353038,7.7033881 C 4.8821061,7.7103135 4.2645766,7.8269881 3.9931163,8.1330756 C 3.5239366,8.6621034 3.0069672,9.2438827 3.0069672,9.2438827 L 4.8698904,9.4954858 z "
                    style="fill:#000000;fill-opacity:1;fill-rule:evenodd;stroke:#000000;stroke-width:0.40000001;stroke-linecap:butt;stroke-linejoin:round;stroke-miterlimit:4;stroke-dasharray:none;stroke-opacity:1;display:inline"/>
            <rect
                    rx="1"
                    ry="0.50390625"
                    y="2.25"
                    x="3"
                    height="7.5"
                    width="2"
                    id="rect5588"
                    style="fill:#ffffff;fill-opacity:1;fill-rule:evenodd;stroke:#000000;stroke-width:0.40000001;stroke-linejoin:miter;stroke-miterlimit:4;stroke-dasharray:none;stroke-opacity:1;display:inline"/>
            <rect
                    rx="1"
                    ry="0.50390625"
                    y="2.25"
                    x="3"
                    height="7.5"
                    width="2"
                    id="rect4213"
                    style="fill:#d50000;fill-opacity:1;fill-rule:evenodd;stroke:none;stroke-width:0.40000001;stroke-linejoin:miter;stroke-miterlimit:4;stroke-dasharray:none;stroke-opacity:1;display:inline"/>
            <rect
                    ry="0.50390625"
                    rx="0.9296875"
                    y="5.5"
                    x="3"
                    height="3"
                    width="2"
                    id="rect5188"
                    style="fill:#d2d2d2;fill-opacity:1;fill-rule:evenodd;stroke:none;stroke-width:0.40000001;stroke-linejoin:miter;stroke-miterlimit:4;stroke-dasharray:none;stroke-opacity:1;display:inline"/>
            <rect
                    ry="0.50390625"
                    rx="0.9296875"
                    y="3.5"
                    x="3"
                    height="3"
                    width="2"
                    id="rect5184"
                    style="fill:#d50000;fill-opacity:1;fill-rule:evenodd;stroke:none;stroke-width:0.40000001;stroke-linejoin:miter;stroke-miterlimit:4;stroke-dasharray:none;stroke-opacity:1;display:inline"/>
            <rect
                    ry="0.50390625"
                    rx="0.9296875"
                    y="2.25"
                    x="3"
                    height="2.25"
                    width="2"
                    id="rect5186"
                    style="fill:#d2d2d2;fill-opacity:1;fill-rule:evenodd;stroke:none;stroke-width:0.40000001;stroke-linejoin:miter;stroke-miterlimit:4;stroke-dasharray:none;stroke-opacity:1;display:inline"/>
            <path
                    sodipodi:nodetypes="csssc"
                    id="path5212"
                    d="M 3,2.75 C 3,3.0912603 3.4505635,3.407152 4,3.4096272 C 4.5519855,3.412114 4.9959964,3.0928343 5,2.75 C 4.9959962,2.9807125 4.5519854,3.1163708 4,3.1146973 C 3.4505635,3.1130315 3,2.9796532 3,2.75 z "
                    style="fill:#ffffff;fill-opacity:1;fill-rule:evenodd;stroke:none;stroke-width:0.40000001;stroke-linejoin:miter;stroke-miterlimit:4;stroke-dasharray:none;stroke-opacity:1;display:inline"/>
            <path
                    transform="matrix(1,0,0,0.962963,0,0.1203704)"
                    id="path5223"
                    d="M 4,3.25 L 3.75,5.25 L 4,10 L 4.25,5.25 L 4,3.25 z "
                    style="fill:#ffffff;fill-opacity:0.875;fill-rule:evenodd;stroke:none;stroke-width:1px;stroke-linecap:butt;stroke-linejoin:miter;stroke-opacity:1;filter:url(#filter5579)"/>
        </g>
        <g
                style="display:inline"
                id="g5628"
                transform="translate(4.000005,0)">
            <path
                    sodipodi:nodetypes="cscscc"
                    id="path5630"
                    d="M 4.8698904,9.4954858 C 4.8698904,9.4954858 5.7431163,8.3830756 5.9931163,8.1330756 C 6.2431163,7.8830756 5.6102253,7.692437 5.2353038,7.7033881 C 4.8821061,7.7103135 4.2645766,7.8269881 3.9931163,8.1330756 C 3.5239366,8.6621034 3.0069672,9.2438827 3.0069672,9.2438827 L 4.8698904,9.4954858 z "
                    style="fill:#000000;fill-opacity:1;fill-rule:evenodd;stroke:#000000;stroke-width:0.40000001;stroke-linecap:butt;stroke-linejoin:round;stroke-miterlimit:4;stroke-dasharray:none;stroke-opacity:1;display:inline"/>
            <rect
                    rx="1"
                    ry="0.50390625"
                    y="2.25"
                    x="3"
                    height="7.5"
                    width="2"
                    id="rect5632"
                    style="fill:#ffffff;fill-opacity:1;fill-rule:evenodd;stroke:#000000;stroke-width:0.40000001;stroke-linejoin:miter;stroke-miterlimit:4;stroke-dasharray:none;stroke-opacity:1;display:inline"/>
            <rect
                    rx="1"
                    ry="0.50390625"
                    y="2.25"
                    x="3"
                    height="7.5"
                    width="2"
                    id="rect5634"
                    style="fill:#d50000;fill-opacity:1;fill-rule:evenodd;stroke:none;stroke-width:0.40000001;stroke-linejoin:miter;stroke-miterlimit:4;stroke-dasharray:none;stroke-opacity:1;display:inline"/>
            <rect
                    ry="0.50390625"
                    rx="0.9296875"
                    y="5.5"
                    x="3"
                    height="3"
                    width="2"
                    id="rect5636"
                    style="fill:#d2d2d2;fill-opacity:1;fill-rule:evenodd;stroke:none;stroke-width:0.40000001;stroke-linejoin:miter;stroke-miterlimit:4;stroke-dasharray:none;stroke-opacity:1;display:inline"/>
            <rect
                    ry="0.50390625"
                    rx="0.9296875"
                    y="3.5"
                    x="3"
                    height="3"
                    width="2"
                    id="rect5638"
                    style="fill:#d50000;fill-opacity:1;fill-rule:evenodd;stroke:none;stroke-width:0.40000001;stroke-linejoin:miter;stroke-miterlimit:4;stroke-dasharray:none;stroke-opacity:1;display:inline"/>
            <rect
                    ry="0.50390625"
                    rx="0.9296875"
                    y="2.25"
                    x="3"
                    height="2.25"
                    width="2"
                    id="rect5640"
                    style="fill:#d2d2d2;fill-opacity:1;fill-rule:evenodd;stroke:none;stroke-width:0.40000001;stroke-linejoin:miter;stroke-miterlimit:4;stroke-dasharray:none;stroke-opacity:1;display:inline"/>
            <path
                    sodipodi:nodetypes="csssc"
                    id="path5642"
                    d="M 3,2.75 C 3,3.0912603 3.4505635,3.407152 4,3.4096272 C 4.5519855,3.412114 4.9959964,3.0928343 5,2.75 C 4.9959962,2.9807125 4.5519854,3.1163708 4,3.1146973 C 3.4505635,3.1130315 3,2.9796532 3,2.75 z "
                    style="fill:#ffffff;fill-opacity:1;fill-rule:evenodd;stroke:none;stroke-width:0.40000001;stroke-linejoin:miter;stroke-miterlimit:4;stroke-dasharray:none;stroke-opacity:1;display:inline"/>
            <path
                    transform="matrix(1,0,0,0.962963,0,0.1203704)"
                    id="path5644"
                    d="M 4,3.25 L 3.75,5.25 L 4,10 L 4.25,5.25 L 4,3.25 z "
                    style="fill:#ffffff;fill-opacity:0.875;fill-rule:evenodd;stroke:none;stroke-width:1px;stroke-linecap:butt;stroke-linejoin:miter;stroke-opacity:1;filter:url(#filter5579)"/>
        </g>
    </g>
</svg>
