<?xml version="1.0" encoding="UTF-8" standalone="no"?>
<!-- Created with Inkscape (http://www.inkscape.org/) -->
<svg
        xmlns:dc="http://purl.org/dc/elements/1.1/"
        xmlns:cc="http://web.resource.org/cc/"
        xmlns:rdf="http://www.w3.org/1999/02/22-rdf-syntax-ns#"
        xmlns="http://www.w3.org/2000/svg"
        xmlns:sodipodi="http://sodipodi.sourceforge.net/DTD/sodipodi-0.dtd"
        xmlns:inkscape="http://www.inkscape.org/namespaces/inkscape"
        width="171.42857"
        height="365.71426"
        id="svg2"
        sodipodi:version="0.32"
        inkscape:version="0.45.1"
        version="1.0"
        sodipodi:docbase="C:\Dokumente und Einstellungen\ulfl\Eigene Dateien"
        sodipodi:docname="memorial.svg"
        inkscape:output_extension="org.inkscape.output.svg.inkscape">
    <defs
            id="defs4">
        <marker
                id="ArrowEnd"
                markerHeight="3"
                markerUnits="strokeWidth"
                markerWidth="4"
                orient="auto"
                refX="0"
                refY="5"
                viewBox="0 0 10 10">
            <path
                    d="M 0,0 L 10,5 L 0,10 L 0,0 z "
                    id="path1512"/>
        </marker>
        <marker
                id="ArrowStart"
                markerHeight="3"
                markerUnits="strokeWidth"
                markerWidth="4"
                orient="auto"
                refX="10"
                refY="5"
                viewBox="0 0 10 10">
            <path
                    d="M 10,0 L 0,5 L 10,10 L 10,0 z "
                    id="path1515"/>
        </marker>
    </defs>
    <sodipodi:namedview
            id="base"
            pagecolor="#ffffff"
            bordercolor="#666666"
            borderopacity="1.0"
            inkscape:pageopacity="0.0"
            inkscape:pageshadow="2"
            inkscape:zoom="0.49497475"
            inkscape:cx="39.778054"
            inkscape:cy="259.65371"
            inkscape:document-units="px"
            inkscape:current-layer="layer1"
            inkscape:window-width="797"
            inkscape:window-height="573"
            inkscape:window-x="301"
            inkscape:window-y="258"/>
    <metadata
            id="metadata7">
        <rdf:RDF>
            <cc:Work
                    rdf:about="">
                <dc:format>image/svg+xml</dc:format>
                <dc:type
                        rdf:resource="http://purl.org/dc/dcmitype/StillImage"/>
                <cc:license
                        rdf:resource="http://web.resource.org/cc/PublicDomain"/>
                <dc:creator>
                    <cc:Agent>
                        <dc:title>Ulf Lamping</dc:title>
                    </cc:Agent>
                </dc:creator>
            </cc:Work>
            <cc:License
                    rdf:about="http://web.resource.org/cc/PublicDomain">
                <cc:permits
                        rdf:resource="http://web.resource.org/cc/Reproduction"/>
                <cc:permits
                        rdf:resource="http://web.resource.org/cc/Distribution"/>
                <cc:permits
                        rdf:resource="http://web.resource.org/cc/DerivativeWorks"/>
            </cc:License>
        </rdf:RDF>
    </metadata>
    <g
            inkscape:label="Ebene 1"
            inkscape:groupmode="layer"
            id="layer1"
            transform="translate(-282.85715,-220.93361)">
        <path
                style="fill:#999999;fill-opacity:1;stroke:none;stroke-width:10;stroke-linecap:round;stroke-miterlimit:4;stroke-dashoffset:0;stroke-opacity:1"
                d="M 283.53058,289.65994 L 369.24487,220.93361 L 454.95915,289.65994 L 454.95915,586.64788 L 283.53058,586.64788 L 283.53058,289.65994 z "
                id="rect2160"
                sodipodi:nodetypes="cccccc"/>
        <path
                style="fill:#ffd42a;fill-rule:evenodd;stroke:#ffd42a;stroke-width:10.07386494;stroke-linecap:butt;stroke-linejoin:miter;stroke-miterlimit:4;stroke-dasharray:40.29545975, 10.07386494;stroke-dashoffset:0;stroke-opacity:1"
                d="M 313.617,440.8657 L 424.87273,441.00105"
                id="path3139"
                sodipodi:nodetypes="cc"/>
        <g
                style="fill:#ffd42a;fill-opacity:1"
                id="g3293"
                transform="matrix(0.6686826,0,0,1.2524888,305.13693,289.76346)">
            <path
                    d="M 95.872,81.671 C 118.422,81.671 136.706,63.387 136.706,40.835 C 136.706,18.284 118.422,0 95.872,0 C 73.319,0 55.038,18.284 55.038,40.835 C 55.038,63.387 73.319,81.671 95.872,81.671 z "
                    id="path3295"
                    style="fill:#ffd42a;fill-opacity:1;stroke:none"/>
            <path
                    id="path3297"
                    style="fill:#ffd42a;fill-opacity:1;stroke:none"
                    d=""/>
        </g>
        <g
                style="fill:#000000;fill-opacity:1"
                id="g2248"
                transform="matrix(0.3223502,0,0,0.6037843,338.34051,316.25363)">
            <path
                    d="M 95.872,81.671 C 118.422,81.671 136.706,63.387 136.706,40.835 C 136.706,18.284 118.422,0 95.872,0 C 73.319,0 55.038,18.284 55.038,40.835 C 55.038,63.387 73.319,81.671 95.872,81.671 z "
                    id="path2250"
                    style="fill:#000000;fill-opacity:1;stroke:none"/>
            <path
                    id="path2252"
                    style="fill:#000000;fill-opacity:1;stroke:none"
                    d=""/>
        </g>
        <path
                style="fill:#ffd42a;fill-rule:evenodd;stroke:#ffd42a;stroke-width:10.07386494;stroke-linecap:butt;stroke-linejoin:miter;stroke-miterlimit:4;stroke-dasharray:40.29545975, 10.07386494;stroke-dashoffset:0;stroke-opacity:1"
                d="M 424.87273,483.54464 L 313.617,483.67999"
                id="path3299"
                sodipodi:nodetypes="cc"/>
    </g>
</svg>
