<?xml version="1.0" encoding="UTF-8" standalone="no"?>
<svg
        xmlns:dc="http://purl.org/dc/elements/1.1/"
        xmlns:cc="http://web.resource.org/cc/"
        xmlns:rdf="http://www.w3.org/1999/02/22-rdf-syntax-ns#"
        xmlns="http://www.w3.org/2000/svg"
        xmlns:sodipodi="http://sodipodi.sourceforge.net/DTD/sodipodi-0.dtd"
        xmlns:inkscape="http://www.inkscape.org/namespaces/inkscape"
        xml:space="default"
        width="250"
        height="250"
        id="svg2"
        sodipodi:version="0.32"
        inkscape:version="0.45.1"
        sodipodi:docname="shinto.svg"
        inkscape:output_extension="org.inkscape.output.svg.inkscape"
        sodipodi:docbase="C:\Dokumente und Einstellungen\ulfl\Eigene Dateien\svn.openstreetmap.org\applications\share\map-icons\svg\religion\church">
    <metadata
            id="metadata19">
        <rdf:RDF>
            <cc:Work
                    rdf:about="">
                <dc:format>image/svg+xml</dc:format>
                <dc:type
                        rdf:resource="http://purl.org/dc/dcmitype/StillImage"/>
                <cc:license
                        rdf:resource="http://web.resource.org/cc/PublicDomain"/>
            </cc:Work>
            <cc:License
                    rdf:about="http://web.resource.org/cc/PublicDomain">
                <cc:permits
                        rdf:resource="http://web.resource.org/cc/Reproduction"/>
                <cc:permits
                        rdf:resource="http://web.resource.org/cc/Distribution"/>
                <cc:permits
                        rdf:resource="http://web.resource.org/cc/DerivativeWorks"/>
            </cc:License>
        </rdf:RDF>
    </metadata>
    <defs
            id="defs17"/>
    <sodipodi:namedview
            inkscape:window-height="573"
            inkscape:window-width="797"
            inkscape:pageshadow="2"
            inkscape:pageopacity="0.0"
            guidetolerance="10.0"
            gridtolerance="10.0"
            objecttolerance="10.0"
            borderopacity="1.0"
            bordercolor="#666666"
            pagecolor="#ffffff"
            id="base"
            inkscape:zoom="1.508"
            inkscape:cx="125"
            inkscape:cy="125"
            inkscape:window-x="44"
            inkscape:window-y="58"
            inkscape:current-layer="svg2"/>
    <title
            id="title4">日本の地図記号 - 神社
    </title>
    <line
            stroke="black"
            stroke-width="30px"
            x1="15"
            y1="45"
            x2="235"
            y2="45"
            id="line8"/>
    <line
            stroke="black"
            stroke-width="30px"
            x1="50"
            y1="95"
            x2="200"
            y2="95"
            id="line10"/>
    <line
            stroke="black"
            stroke-width="30px"
            x1="50"
            y1="45"
            x2="50"
            y2="215"
            id="line12"/>
    <line
            stroke="black"
            stroke-width="30px"
            x1="200"
            y1="45"
            x2="200"
            y2="215"
            id="line14"/>
</svg>
