<?xml version="1.0" encoding="UTF-8" standalone="no"?>
<!-- Created with Inkscape (http://www.inkscape.org/) -->
<svg
        xmlns:dc="http://purl.org/dc/elements/1.1/"
        xmlns:cc="http://creativecommons.org/ns#"
        xmlns:rdf="http://www.w3.org/1999/02/22-rdf-syntax-ns#"
        xmlns="http://www.w3.org/2000/svg"
        xmlns:sodipodi="http://sodipodi.sourceforge.net/DTD/sodipodi-0.dtd"
        xmlns:inkscape="http://www.inkscape.org/namespaces/inkscape"
        width="223.36542"
        height="399.15063"
        id="svg2"
        sodipodi:version="0.32"
        inkscape:version="0.46"
        version="1.0"
        sodipodi:docname="pole.svg"
        inkscape:output_extension="org.inkscape.output.svg.inkscape"
        inkscape:export-filename="D:\pole.png"
        inkscape:export-xdpi="3.6076605"
        inkscape:export-ydpi="3.6076605">
    <defs
            id="defs4">
        <inkscape:perspective
                sodipodi:type="inkscape:persp3d"
                inkscape:vp_x="0 : 526.18109 : 1"
                inkscape:vp_y="0 : 1000 : 0"
                inkscape:vp_z="744.09448 : 526.18109 : 1"
                inkscape:persp3d-origin="372.04724 : 350.78739 : 1"
                id="perspective10"/>
    </defs>
    <sodipodi:namedview
            id="base"
            pagecolor="#ffffff"
            bordercolor="#666666"
            borderopacity="1.0"
            inkscape:pageopacity="0.0"
            inkscape:pageshadow="2"
            inkscape:zoom="0.35"
            inkscape:cx="-158.57143"
            inkscape:cy="520"
            inkscape:document-units="px"
            inkscape:current-layer="layer1"
            showgrid="false"
            inkscape:window-width="1600"
            inkscape:window-height="1110"
            inkscape:window-x="-4"
            inkscape:window-y="-4"/>
    <metadata
            id="metadata7">
        <rdf:RDF>
            <cc:Work
                    rdf:about="">
                <dc:format>image/svg+xml</dc:format>
                <dc:type
                        rdf:resource="http://purl.org/dc/dcmitype/StillImage"/>
            </cc:Work>
        </rdf:RDF>
    </metadata>
    <g
            inkscape:label="Ebene 1"
            inkscape:groupmode="layer"
            id="layer1"
            transform="translate(-266.88872,-309.92582)">
        <path
                style="fill:#aa4400;fill-rule:evenodd;stroke:#aa4c00;stroke-width:22;stroke-linecap:butt;stroke-linejoin:miter;stroke-miterlimit:4;stroke-dasharray:none;stroke-opacity:1"
                d="M 378.57143,320.93361 L 378.57143,698.07647"
                id="path2383"/>
        <path
                id="path3155"
                d="M 482.10349,318.07647 L 275.03937,318.07647"
                style="fill:#aa4400;fill-rule:evenodd;stroke:#aa4c00;stroke-width:16.30129623;stroke-linecap:butt;stroke-linejoin:miter;stroke-miterlimit:4;stroke-dasharray:none;stroke-opacity:1"/>
        <path
                sodipodi:type="arc"
                style="opacity:1;fill:#808080;fill-opacity:1;stroke:#7e7d7e;stroke-width:22;stroke-miterlimit:4;stroke-dasharray:none;stroke-dashoffset:0;stroke-opacity:1"
                id="path3157"
                sodipodi:cx="175.71428"
                sodipodi:cy="556.64789"
                sodipodi:rx="1.4285715"
                sodipodi:ry="7.1428571"
                d="M 177.14285,556.64789 A 1.4285715,7.1428571 0 1 1 174.28571,556.64789 A 1.4285715,7.1428571 0 1 1 177.14285,556.64789 z"
                transform="matrix(2.4860042,0,0,0.6231851,-139.1549,-10.246777)"/>
        <path
                transform="matrix(2.4860042,0,0,0.6231851,23.702243,-7.3896341)"
                d="M 177.14285,556.64789 A 1.4285715,7.1428571 0 1 1 174.28571,556.64789 A 1.4285715,7.1428571 0 1 1 177.14285,556.64789 z"
                sodipodi:ry="7.1428571"
                sodipodi:rx="1.4285715"
                sodipodi:cy="556.64789"
                sodipodi:cx="175.71428"
                id="path3161"
                style="opacity:1;fill:#808080;fill-opacity:1;stroke:#7e7d7e;stroke-width:22;stroke-miterlimit:4;stroke-dasharray:none;stroke-dashoffset:0;stroke-opacity:1"
                sodipodi:type="arc"/>
    </g>
</svg>
