<svg enable-background="new 0 0 15 15" height="15" viewBox="15" width="15" xmlns="http://www.w3.org/2000/svg">
    <path d="M12.7,2.3v10.4H2.3V2.3H12.7 M13,1H2C1.4477,1,1,1.4477,1,2v11c0,0.5523,0.4477,1,1,1h11c0.5523,0,1-0.4477,1-1V2
	C14,1.4477,13.5523,1,13,1L13,1z" fill="param(fill)" fill-opacity="param(fill-opacity)" stroke="param(outline)"
          stroke-opacity="param(outline-opacity)" stroke-width="param(outline-width)"/>
</svg>