<svg fill="#000000" height="800" width="800" xmlns="http://www.w3.org/2000/svg"
     viewBox="0 0 512.3 512.3" xml:space="preserve">

		<path d="M256.1,289.4c-12.3,0-22.3,10-22.3,22.3s10,22.3,22.3,22.3c12.3-0.1,22.3-10.1,22.3-22.3
			C278.4,299.4,268.4,289.4,256.1,289.4z"/>

    <path d="M456.4,244.9h-66.8v-22.3c12.3,0,22.3-10,22.3-22.3v-66.8c0-12.3-10-22.3-22.3-22.3h-2C377,48.2,322.1,0,256.1,0
			S135.2,48.2,124.6,111.3h-2c-12.3,0-22.3,10-22.3,22.3v66.8c0,12.3,10,22.3,22.3,22.3V245H55.8c-12.3,0-22.3,10-22.3,22.3v89
			c0,12.3,10,22.3,22.3,22.3h66.8v22.3c-12.3,0-22.3,10-22.3,22.3V490c0,12.3,10,22.3,22.3,22.3h267.1c12.3,0,22.3-10,22.3-22.3v-67
			c0-12.3-10-22.3-22.3-22.3v-22.3h66.8c12.3,0,22.3-10,22.3-22.3v-89C478.7,254.8,468.8,244.9,456.4,244.9z M122.5,333.9H78v-44.5
			h44.5V333.9z M367.4,467.5H144.8v-22.3h222.6V467.5z M189.3,311.7c0-36.8,30-66.8,66.8-66.8s66.8,30,66.8,66.8
			s-29.9,66.8-66.8,66.8C219.3,378.4,189.3,348.5,189.3,311.7z M367.4,178.1H144.8v-22.3h222.6V178.1z M434.2,333.9h-44.5v-44.5
			h44.5V333.9z"/>

</svg>