<svg enable-background="new 0 0 15 15" height="15" viewBox="15" width="15" xmlns="http://www.w3.org/2000/svg">
    <path d="M3,2v11h5v-3h3v3h1V2H3z M7,12H4v-2h3V12z M7,9H4V7h3V9z M7,6H4V4h3V6z M11,9H8V7h3V9z M11,6H8V4h3V6z"
          fill="param(fill)" fill-opacity="param(fill-opacity)" stroke="param(outline)"
          stroke-opacity="param(outline-opacity)" stroke-width="param(outline-width)"/>
</svg>