<?xml version="1.0" encoding="UTF-8" standalone="no"?>
<!-- Created with Inkscape (http://www.inkscape.org/) -->
<svg
        xmlns:dc="http://purl.org/dc/elements/1.1/"
        xmlns:cc="http://web.resource.org/cc/"
        xmlns:rdf="http://www.w3.org/1999/02/22-rdf-syntax-ns#"
        xmlns="http://www.w3.org/2000/svg"
        xmlns:sodipodi="http://sodipodi.sourceforge.net/DTD/sodipodi-0.dtd"
        xmlns:inkscape="http://www.inkscape.org/namespaces/inkscape"
        width="32"
        height="32"
        id="svg2"
        sodipodi:version="0.32"
        inkscape:version="0.45.1"
        version="1.0"
        sodipodi:docbase="C:\Dokumente und Einstellungen\ulfl\Eigene Dateien\svn.openstreetmap.org\applications\share\map-icons\svg\misc\landmark"
        sodipodi:docname="peak.svg"
        inkscape:output_extension="org.inkscape.output.svg.inkscape">
    <defs
            id="defs4"/>
    <sodipodi:namedview
            id="base"
            pagecolor="#ffffff"
            bordercolor="#666666"
            borderopacity="1.0"
            gridtolerance="10000"
            guidetolerance="10"
            objecttolerance="10"
            inkscape:pageopacity="0.0"
            inkscape:pageshadow="2"
            inkscape:zoom="11.2"
            inkscape:cx="7.2627332"
            inkscape:cy="12.927264"
            inkscape:document-units="px"
            inkscape:current-layer="layer1"
            width="32px"
            height="32px"
            inkscape:window-width="906"
            inkscape:window-height="897"
            inkscape:window-x="163"
            inkscape:window-y="46"/>
    <metadata
            id="metadata7">
        <rdf:RDF>
            <cc:Work
                    rdf:about="">
                <dc:format>image/svg+xml</dc:format>
                <dc:type
                        rdf:resource="http://purl.org/dc/dcmitype/StillImage"/>
                <cc:license
                        rdf:resource="http://web.resource.org/cc/PublicDomain"/>
            </cc:Work>
            <cc:License
                    rdf:about="http://web.resource.org/cc/PublicDomain">
                <cc:permits
                        rdf:resource="http://web.resource.org/cc/Reproduction"/>
                <cc:permits
                        rdf:resource="http://web.resource.org/cc/Distribution"/>
                <cc:permits
                        rdf:resource="http://web.resource.org/cc/DerivativeWorks"/>
            </cc:License>
        </rdf:RDF>
    </metadata>
    <g
            inkscape:label="Layer 1"
            inkscape:groupmode="layer"
            id="layer1">
        <path
                style="fill:#f100ff;fill-opacity:1;fill-rule:evenodd;stroke:none;stroke-width:1.24079525px;stroke-linecap:butt;stroke-linejoin:miter;stroke-opacity:1"
                d="M 4.6739691,29.334246 L 15.017493,7.8346835 L 25.14746,29.29924 L 4.6739691,29.334246 z "
                id="path3382"
                sodipodi:nodetypes="cccc"/>
    </g>
</svg>
