<?xml version="1.0" encoding="UTF-8" standalone="no"?>
<!-- Created with Inkscape (http://www.inkscape.org/) -->
<svg
        xmlns:dc="http://purl.org/dc/elements/1.1/"
        xmlns:cc="http://web.resource.org/cc/"
        xmlns:rdf="http://www.w3.org/1999/02/22-rdf-syntax-ns#"
        xmlns="http://www.w3.org/2000/svg"
        xmlns:sodipodi="http://sodipodi.sourceforge.net/DTD/sodipodi-0.dtd"
        xmlns:inkscape="http://www.inkscape.org/namespaces/inkscape"
        width="32"
        height="32"
        id="svg3269"
        sodipodi:version="0.32"
        inkscape:version="0.45.1"
        version="1.0"
        sodipodi:docbase="/home/tweety/svn.openstreetmap.org/applications/share/map-icons/svg/religion/church"
        sodipodi:docname="protestant.svg"
        inkscape:output_extension="org.inkscape.output.svg.inkscape">
    <defs
            id="defs3271"/>
    <sodipodi:namedview
            id="base"
            pagecolor="#ffffff"
            bordercolor="#666666"
            borderopacity="1.0"
            gridtolerance="10000"
            guidetolerance="10"
            objecttolerance="10"
            inkscape:pageopacity="0.0"
            inkscape:pageshadow="2"
            inkscape:zoom="5.6"
            inkscape:cx="16.966315"
            inkscape:cy="1.9539889"
            inkscape:document-units="px"
            inkscape:current-layer="layer1"
            width="32px"
            height="32px"
            inkscape:window-width="906"
            inkscape:window-height="596"
            inkscape:window-x="485"
            inkscape:window-y="420"
            borderlayer="false"
            inkscape:showpageshadow="true"/>
    <metadata
            id="metadata3274">
        <rdf:RDF>
            <cc:Work
                    rdf:about="">
                <dc:format>image/svg+xml</dc:format>
                <dc:type
                        rdf:resource="http://purl.org/dc/dcmitype/StillImage"/>
                <cc:license
                        rdf:resource="http://web.resource.org/cc/PublicDomain"/>
            </cc:Work>
            <cc:License
                    rdf:about="http://web.resource.org/cc/PublicDomain">
                <cc:permits
                        rdf:resource="http://web.resource.org/cc/Reproduction"/>
                <cc:permits
                        rdf:resource="http://web.resource.org/cc/Distribution"/>
                <cc:permits
                        rdf:resource="http://web.resource.org/cc/DerivativeWorks"/>
            </cc:License>
        </rdf:RDF>
    </metadata>
    <g
            inkscape:label="Layer 1"
            inkscape:groupmode="layer"
            id="layer1">
        <rect
                style="fill:#1f48ed;fill-opacity:1;stroke:#000000;stroke-width:1.079;stroke-linecap:butt;stroke-linejoin:miter;stroke-miterlimit:2;stroke-dasharray:none;stroke-dashoffset:18;stroke-opacity:1"
                id="rect3277"
                width="11.196519"
                height="14.220005"
                x="10.031717"
                y="15.427862"
                transform="matrix(0.9999985,-1.7096011e-3,1.7096011e-3,0.9999985,0,0)"/>
        <rect
                style="fill:#000000;fill-opacity:1;stroke:none;stroke-width:1;stroke-linecap:square;stroke-linejoin:miter;stroke-miterlimit:1;stroke-dasharray:none;stroke-dashoffset:18;stroke-opacity:1"
                id="rect3279"
                width="2.6737955"
                height="14.220005"
                x="14.366482"
                y="1.5518639"
                transform="matrix(0.999933,-1.1572613e-2,1.1572613e-2,0.999933,0,0)"/>
        <rect
                style="fill:#000000;fill-opacity:1;stroke:none;stroke-width:1;stroke-linecap:square;stroke-linejoin:miter;stroke-miterlimit:1;stroke-dasharray:none;stroke-dashoffset:18;stroke-opacity:1"
                id="rect3281"
                width="9.1490421"
                height="2.3008301"
                x="11.098649"
                y="4.4968739"
                transform="matrix(0.9998848,-1.5178291e-2,8.8233038e-3,0.9999611,0,0)"/>
    </g>
</svg>
