<?xml version="1.0" encoding="UTF-8" standalone="no"?>
<svg
        xmlns:dc="http://purl.org/dc/elements/1.1/"
        xmlns:cc="http://creativecommons.org/ns#"
        xmlns:rdf="http://www.w3.org/1999/02/22-rdf-syntax-ns#"
        xmlns="http://www.w3.org/2000/svg"
        xmlns:sodipodi="http://sodipodi.sourceforge.net/DTD/sodipodi-0.dtd"
        xmlns:inkscape="http://www.inkscape.org/namespaces/inkscape"
        width="725"
        height="725"
        version="1.1"
        id="svg2"
        sodipodi:version="0.32"
        inkscape:version="0.46"
        sodipodi:docname="foot.svg"
        inkscape:output_extension="org.inkscape.output.svg.inkscape"
        inkscape:export-filename="C:\Dokumente und Einstellungen\ulfl\Eigene Dateien\osm\svn.openstreetmap.org\applications\share\map-icons\svg\vehicle\restrictions\foot.png"
        inkscape:export-xdpi="2"
        inkscape:export-ydpi="2">
    <metadata
            id="metadata16">
        <rdf:RDF>
            <cc:Work
                    rdf:about="">
                <dc:format>image/svg+xml</dc:format>
                <dc:type
                        rdf:resource="http://purl.org/dc/dcmitype/StillImage"/>
                <cc:license
                        rdf:resource="http://creativecommons.org/licenses/publicdomain/"/>
            </cc:Work>
            <cc:License
                    rdf:about="http://creativecommons.org/licenses/publicdomain/">
                <cc:permits
                        rdf:resource="http://creativecommons.org/ns#Reproduction"/>
                <cc:permits
                        rdf:resource="http://creativecommons.org/ns#Distribution"/>
                <cc:permits
                        rdf:resource="http://creativecommons.org/ns#DerivativeWorks"/>
            </cc:License>
        </rdf:RDF>
    </metadata>
    <defs
            id="defs14">
        <inkscape:perspective
                sodipodi:type="inkscape:persp3d"
                inkscape:vp_x="0 : 362.5 : 1"
                inkscape:vp_y="0 : 1000 : 0"
                inkscape:vp_z="725 : 362.5 : 1"
                inkscape:persp3d-origin="362.5 : 241.66667 : 1"
                id="perspective18"/>
    </defs>
    <sodipodi:namedview
            inkscape:window-height="480"
            inkscape:window-width="640"
            inkscape:pageshadow="2"
            inkscape:pageopacity="0.0"
            guidetolerance="10.0"
            gridtolerance="10.0"
            objecttolerance="10.0"
            borderopacity="1.0"
            bordercolor="#666666"
            pagecolor="#ffffff"
            id="base"
            showgrid="false"/>
    <circle
            style="fill: rgb(255, 255, 255); stroke: rgb(0, 0, 0); stroke-width: 2.5px;"
            r="350"
            cx="362.5"
            cy="362.5"
            id="circle4"/>
    <circle
            cx="362.5"
            cy="362.5"
            r="290"
            style="stroke: rgb(204, 0, 0); stroke-width: 93.75; fill: none;"
            id="circle6"/>
    <g
            id="PedestrianSymbol"
            transform="matrix(0.594656, 0, 0, 0.594656, 244.082, 120.638)">
        <circle
                r="56"
                cx="188"
                cy="105"
                style="fill: black; stroke: none;"
                id="circle9"/>
        <path
                style="fill: black; stroke: none;"
                d="M 22.000000,427.00000 C 173.66667,190.33333 159.33333,183.66667 216.00000,182.00000 C 249.00000,183.00000 250.00000,192.00000 306.00000,236.00000 C 375.00000,286.66667 370.00000,287.33333 369.00000,343.00000 C 368.66667,410.00000 373.33333,405.00000 320.00000,430.00000 L 320.00000,317.00000 L 273.00000,275.00000 L 273.00000,434.00000 L 161.00000,433.00000 L 160.00000,307.00000 C 68.000000,449.00000 74.000000,441.00000 22.000000,427.00000 z     M 163.00000,450.00000 L 272.00000,450.00000 C 272.00000,475.00000 280.00000,473.00000 338.00000,582.00000 C 399.00000,694.33333 400.00000,686.66667 365.00000,751.00000 L 214.00000,480.00000 C 71.000000,756.66667 89.000000,748.33333 10.000000,743.00000 L 89.000000,595.00000 C 156.66667,472.66667 160.33333,472.33333 163.00000,450.00000 z "
                id="path11"/>
    </g>
</svg>
