<?xml version="1.0" encoding="UTF-8" standalone="no"?>
<!-- Generator: Adobe Illustrator 10.0, SVG Export Plug-In . SVG Version: 3.0.0 Build 77)  -->
<svg
        xmlns:a="http://ns.adobe.com/AdobeSVGViewerExtensions/3.0/"
        xmlns:i="http://ns.adobe.com/AdobeIllustrator/10.0/"
        xmlns:dc="http://purl.org/dc/elements/1.1/"
        xmlns:cc="http://web.resource.org/cc/"
        xmlns:rdf="http://www.w3.org/1999/02/22-rdf-syntax-ns#"
        xmlns="http://www.w3.org/2000/svg"
        xmlns:xlink="http://www.w3.org/1999/xlink"
        xmlns:sodipodi="http://sodipodi.sourceforge.net/DTD/sodipodi-0.dtd"
        xmlns:inkscape="http://www.inkscape.org/namespaces/inkscape"
        enable-background="new 0 0 455.148 454.788"
        height="348.54398"
        i:pageBounds="0 792 612 0"
        i:rulerOrigin="0 0"
        i:viewOrigin="78 623"
        overflow="visible"
        space="preserve"
        viewBox="0 0 455.148 454.788"
        width="393.01099"
        id="svg2"
        sodipodi:version="0.32"
        inkscape:version="0.44.1"
        sodipodi:docname="pool.svg"
        sodipodi:docbase="/home/src/apps/gpsdrive/gpsdrive-work/data/map-icons/svg/sports"
        version="1.0">
    <defs
            id="defs124">
        <foreignObject
                id="foreignObject8"
                y="0"
                x="0"
                width="1"
                requiredExtensions="http://ns.adobe.com/AdobeIllustrator/10.0/"
                height="1">
            <i:pgfRef
                    xlink:href="#adobe_illustrator_pgf"/>
        </foreignObject>
        <linearGradient
                y2="227.73579"
                y1="227.73579"
                x2="455.14841"
                x1="424.36719"
                id="XMLID_1_"
                gradientUnits="userSpaceOnUse">
            <stop
                    id="stop16"
                    style="stop-color:#E5E5E5"
                    offset="0"/>
            <stop
                    id="stop18"
                    style="stop-color:#E2E2E2"
                    offset="0.1696"/>
            <stop
                    id="stop20"
                    style="stop-color:#D8D8D8"
                    offset="0.3059"/>
            <stop
                    id="stop22"
                    style="stop-color:#C7C7C7"
                    offset="0.4306"/>
            <stop
                    id="stop24"
                    style="stop-color:#B0B0B0"
                    offset="0.5484"/>
            <stop
                    id="stop26"
                    style="stop-color:#919191"
                    offset="0.6614"/>
            <stop
                    id="stop28"
                    style="stop-color:#6B6B6B"
                    offset="0.7707"/>
            <stop
                    id="stop30"
                    style="stop-color:#3E3E3E"
                    offset="0.8772"/>
            <stop
                    id="stop32"
                    style="stop-color:#0C0C0C"
                    offset="0.9788"/>
            <stop
                    id="stop34"
                    style="stop-color:#000000"
                    offset="1"/>
            <a:midPointStop
                    style="stop-color:#E5E5E5"
                    offset="0"/>
            <a:midPointStop
                    style="stop-color:#E5E5E5"
                    offset="0.75"/>
            <a:midPointStop
                    style="stop-color:#000000"
                    offset="1"/>
        </linearGradient>
        <linearGradient
                y2="227.37601"
                y1="227.37601"
                x2="0.0713"
                x1="30.851601"
                id="XMLID_2_"
                gradientUnits="userSpaceOnUse">
            <stop
                    id="stop39"
                    style="stop-color:#E5E5E5"
                    offset="0"/>
            <stop
                    id="stop41"
                    style="stop-color:#E2E2E2"
                    offset="0.2675"/>
            <stop
                    id="stop43"
                    style="stop-color:#D8D8D8"
                    offset="0.4824"/>
            <stop
                    id="stop45"
                    style="stop-color:#C7C7C7"
                    offset="0.679"/>
            <stop
                    id="stop47"
                    style="stop-color:#B0B0B0"
                    offset="0.8635"/>
            <stop
                    id="stop49"
                    style="stop-color:#999999"
                    offset="1"/>
            <a:midPointStop
                    style="stop-color:#E5E5E5"
                    offset="0"/>
            <a:midPointStop
                    style="stop-color:#E5E5E5"
                    offset="0.75"/>
            <a:midPointStop
                    style="stop-color:#999999"
                    offset="1"/>
        </linearGradient>
        <linearGradient
                y2="0.071800001"
                y1="30.8521"
                x2="227.73579"
                x1="227.73579"
                id="XMLID_3_"
                gradientUnits="userSpaceOnUse">
            <stop
                    id="stop54"
                    style="stop-color:#E5E5E5"
                    offset="0"/>
            <stop
                    id="stop56"
                    style="stop-color:#E2E2E2"
                    offset="0.2675"/>
            <stop
                    id="stop58"
                    style="stop-color:#D8D8D8"
                    offset="0.4824"/>
            <stop
                    id="stop60"
                    style="stop-color:#C7C7C7"
                    offset="0.679"/>
            <stop
                    id="stop62"
                    style="stop-color:#B0B0B0"
                    offset="0.8635"/>
            <stop
                    id="stop64"
                    style="stop-color:#999999"
                    offset="1"/>
            <a:midPointStop
                    style="stop-color:#E5E5E5"
                    offset="0"/>
            <a:midPointStop
                    style="stop-color:#E5E5E5"
                    offset="0.75"/>
            <a:midPointStop
                    style="stop-color:#999999"
                    offset="1"/>
        </linearGradient>
        <linearGradient
                y2="454.67969"
                y1="423.89941"
                x2="227.37601"
                x1="227.37601"
                id="XMLID_4_"
                gradientUnits="userSpaceOnUse">
            <stop
                    id="stop69"
                    style="stop-color:#E5E5E5"
                    offset="0"/>
            <stop
                    id="stop71"
                    style="stop-color:#E2E2E2"
                    offset="0.1696"/>
            <stop
                    id="stop73"
                    style="stop-color:#D8D8D8"
                    offset="0.3059"/>
            <stop
                    id="stop75"
                    style="stop-color:#C7C7C7"
                    offset="0.4306"/>
            <stop
                    id="stop77"
                    style="stop-color:#B0B0B0"
                    offset="0.5484"/>
            <stop
                    id="stop79"
                    style="stop-color:#919191"
                    offset="0.6614"/>
            <stop
                    id="stop81"
                    style="stop-color:#6B6B6B"
                    offset="0.7707"/>
            <stop
                    id="stop83"
                    style="stop-color:#3E3E3E"
                    offset="0.8772"/>
            <stop
                    id="stop85"
                    style="stop-color:#0C0C0C"
                    offset="0.9788"/>
            <stop
                    id="stop87"
                    style="stop-color:#000000"
                    offset="1"/>
            <a:midPointStop
                    style="stop-color:#E5E5E5"
                    offset="0"/>
            <a:midPointStop
                    style="stop-color:#E5E5E5"
                    offset="0.75"/>
            <a:midPointStop
                    style="stop-color:#000000"
                    offset="1"/>
        </linearGradient>
    </defs>
    <sodipodi:namedview
            inkscape:window-height="579"
            inkscape:window-width="857"
            inkscape:pageshadow="2"
            inkscape:pageopacity="0.0"
            guidetolerance="10.0"
            gridtolerance="10.0"
            objecttolerance="10.0"
            borderopacity="1.0"
            bordercolor="#666666"
            pagecolor="#ffffff"
            id="base"
            inkscape:zoom="0.20778913"
            inkscape:cx="-375.60482"
            inkscape:cy="107.45506"
            inkscape:window-x="1600"
            inkscape:window-y="0"
            inkscape:current-layer="svg2"/>
    <metadata
            id="metadata4">
        <rdf:RDF>
            <cc:Work
                    rdf:about="">
                <dc:title>Hotel Icon Indoor Pool</dc:title>
                <dc:description>Part of Hotel Icons Collection</dc:description>
                <dc:subject>
                    <rdf:Bag>
                        <rdf:li>icon</rdf:li>
                        <rdf:li>symbol</rdf:li>
                        <rdf:li>hotel</rdf:li>
                    </rdf:Bag>
                </dc:subject>
                <dc:publisher>
                    <cc:Agent
                            rdf:about="http://www.openclipart.org/">
                        <dc:title>Open Clip Art Library</dc:title>
                    </cc:Agent>
                </dc:publisher>
                <dc:creator>
                    <cc:Agent>
                        <dc:title>Gerald G.</dc:title>
                    </cc:Agent>
                </dc:creator>
                <dc:rights>
                    <cc:Agent>
                        <dc:title>Gerald G.</dc:title>
                    </cc:Agent>
                </dc:rights>
                <dc:date/>
                <dc:format>image/svg+xml</dc:format>
                <dc:type
                        rdf:resource="http://purl.org/dc/dcmitype/StillImage"/>
                <cc:license
                        rdf:resource="http://web.resource.org/cc/PublicDomain"/>
                <dc:language>en</dc:language>
            </cc:Work>
            <cc:License
                    rdf:about="http://web.resource.org/cc/PublicDomain">
                <cc:permits
                        rdf:resource="http://web.resource.org/cc/Reproduction"/>
                <cc:permits
                        rdf:resource="http://web.resource.org/cc/Distribution"/>
                <cc:permits
                        rdf:resource="http://web.resource.org/cc/DerivativeWorks"/>
            </cc:License>
        </rdf:RDF>
    </metadata>
    <path
            clip-rule="evenodd"
            d="M 380.63499,280.175 C 377.50399,281.05 373.26899,280.912 367.93099,279.76 C 362.54799,278.563 357.47499,272.666 348.43099,273.082 C 339.12099,273.403 325.97399,281.742 313.26899,281.742 C 300.38599,281.513 285.91499,272.619 272.76899,272.666 C 259.66599,272.711 247.75399,281.927 235.18199,282.156 C 222.38699,282.202 209.63799,273.678 197.10699,273.496 C 184.40199,273.174 172.35699,281.05 160.48999,280.959 C 148.62199,280.775 138.51999,272.204 126.78399,272.666 C 114.87199,273.082 101.81299,282.479 90.165992,282.939 C 78.518992,283.124 67.798992,274.371 57.474992,274.279 C 47.106992,274.093 35.195992,280.681 28.180992,282.156 C 21.121992,283.584 16.665992,283.539 14.989992,282.524 L 14.989992,306.942 C 16.666992,307.957 21.121992,308.002 28.180992,306.575 C 35.195992,305.1 47.106992,298.512 57.474992,298.696 C 67.798992,298.789 78.517992,307.542 90.165992,307.358 C 101.81299,306.804 114.87199,297.591 126.78399,297.129 C 138.51899,296.761 148.62199,305.145 160.48999,305.377 C 172.35799,305.467 184.40199,297.591 197.10699,297.913 C 209.63799,298.096 222.38699,306.619 235.18199,306.574 C 247.75399,306.297 259.66599,297.22 272.76899,297.129 C 285.91499,297.129 300.38599,305.882 313.26899,306.159 C 325.97399,306.159 339.12199,297.821 348.43099,297.498 C 357.47499,297.084 362.54799,302.979 367.93099,304.177 C 373.26899,305.329 377.50399,305.467 380.63499,304.592 L 380.63499,280.175 L 380.63499,280.175 z "
            i:knockout="Off"
            id="path103"
            style="fill:#7f7f7f;fill-rule:evenodd"/>
    <path
            clip-rule="evenodd"
            d="M 380.63499,321.04 C 377.50399,321.917 373.26899,321.777 367.93099,320.628 C 362.54799,319.428 357.47499,313.531 348.43099,313.946 C 339.12099,314.268 325.97399,322.607 313.26899,322.607 C 300.38599,322.377 285.91499,313.486 272.76899,313.531 C 259.66599,313.624 247.75399,322.7 235.18199,322.977 C 222.38699,323.022 209.63799,314.498 197.10699,314.314 C 184.40199,314.084 172.35699,321.917 160.48999,321.825 C 148.62199,321.639 138.51999,313.071 126.78399,313.531 C 114.87199,313.946 101.81299,323.344 90.165992,323.804 C 78.518992,324.033 67.798992,315.143 57.474992,315.098 C 47.106992,314.912 35.195992,321.502 28.180992,322.977 C 21.121992,324.311 16.665992,324.449 14.989992,323.389 L 14.989992,347.807 C 16.666992,348.823 21.121992,348.868 28.180992,347.44 C 35.195992,345.965 47.106992,339.377 57.474992,339.561 C 67.798992,339.654 78.517992,348.408 90.165992,348.222 C 101.81299,347.762 114.87199,338.364 126.78399,337.949 C 138.51899,337.489 148.62199,346.057 160.48999,346.243 C 172.35799,346.196 184.40199,338.595 197.10699,338.731 C 209.63799,338.824 222.38699,347.532 235.18199,347.44 C 247.75399,347.21 259.66599,337.994 272.76899,337.949 C 285.91499,337.904 300.38599,346.795 313.26899,347.025 C 325.97399,347.025 339.12199,338.686 348.43099,338.364 C 357.47499,337.949 362.54799,343.845 367.93099,345.044 C 373.26899,346.196 377.50399,346.335 380.63499,345.458 L 380.63499,321.04 L 380.63499,321.04 z "
            i:knockout="Off"
            id="path111"
            style="fill:#7f7f7f;fill-rule:evenodd"/>
    <path
            clip-rule="evenodd"
            d="M 376.26899,275.613 C 373.09199,276.583 368.98899,276.397 363.60699,275.246 C 358.13699,274.001 353.15099,268.197 344.06299,268.518 C 334.75399,268.841 321.60599,277.18 308.90199,277.18 C 296.01799,276.906 281.54799,268.149 268.40099,268.149 C 255.29799,268.242 243.38599,277.317 230.81299,277.594 C 218.01899,277.639 205.26899,269.118 192.73999,268.934 C 180.03399,268.612 167.98999,276.491 156.12199,276.397 C 144.43099,276.168 134.06299,267.781 122.45999,268.149 C 110.54799,268.612 97.488992,277.825 85.841992,278.378 C 74.106992,278.563 63.473992,269.81 53.106992,269.716 C 42.651992,269.532 30.915992,276.12 23.856992,277.595 C 16.797992,278.933 12.341992,279.071 10.665992,278.01 L 10.665992,302.429 C 12.341992,303.488 16.797992,303.351 23.856992,302.014 C 30.915992,300.539 42.650992,293.951 53.106992,294.135 C 63.474992,294.228 74.106992,302.981 85.841992,302.795 C 97.488992,302.336 110.54799,292.89 122.45999,292.567 C 134.06299,292.107 144.42999,300.676 156.12199,300.86 C 167.98999,300.954 180.03399,293.122 192.73999,293.352 C 205.26899,293.535 218.01899,302.057 230.81299,302.013 C 243.38599,301.736 255.29799,292.659 268.40099,292.567 C 281.54799,292.523 296.01799,301.414 308.90199,301.646 C 321.60599,301.646 334.75499,293.304 344.06299,292.983 C 353.15099,292.567 358.13699,298.465 363.60699,299.663 C 368.98899,300.815 373.09199,300.999 376.26899,300.031 L 376.26899,275.613 z "
            i:knockout="Off"
            id="path113"
            style="fill:#3d258e;fill-rule:evenodd"/>
    <path
            clip-rule="evenodd"
            d="M 171.56299,267.183 L 272.45899,213.326 C 264.47499,195.911 259.00299,182.781 255.69499,173.429 C 252.34099,164.122 250.92799,162.049 252.82599,157.626 C 254.76599,153.065 252.07599,152.374 266.85599,146.338 C 281.67799,140.119 325.75199,122.013 340.22299,121.183 C 354.25199,120.492 353.85499,135.972 351.47299,141.317 C 348.91299,146.384 335.76699,147.859 325.79599,151.775 C 315.73599,155.645 304.48699,159.976 291.69299,164.767 L 337.92699,266.402 C 331.97099,271.423 324.07399,273.45 313.39899,272.668 C 302.58999,271.608 287.98699,261.287 274.53099,261.242 C 260.94199,261.426 245.76599,272.713 233.41399,273.084 C 220.97299,273.035 211.35399,263.085 200.98699,262.069 C 190.62199,261.056 180.87199,262.76 171.56299,267.183 z "
            i:knockout="Off"
            id="path105"
            style="fill:#8f3e3e;fill-opacity:1;fill-rule:evenodd"/>
    <path
            clip-rule="evenodd"
            d="M 352.81299,179.284 C 368.37399,179.284 381.00299,192.473 381.00299,208.724 C 381.00299,224.974 368.37299,238.162 352.81299,238.162 C 337.25099,238.162 324.62099,224.974 324.62099,208.724 C 324.62099,192.473 337.25199,179.284 352.81299,179.284"
            i:knockout="Off"
            id="path107"
            style="fill:#8f3e3e;fill-opacity:1;fill-rule:evenodd"/>
    <path
            clip-rule="evenodd"
            d="M 103.40199,269.164 C 91.445992,266.952 79.269992,263.591 66.033992,258.891 C 52.710992,253.96 29.990992,247.556 24.607992,241.107 C 19.225992,234.656 23.151992,221.295 34.004992,220.744 C 44.857992,220.053 66.607992,229.958 89.019992,237.836 C 111.34299,245.714 136.93099,255.713 166.97499,268.013 C 163.26999,270.04 158.37199,270.64 152.10799,269.811 C 145.75499,268.75 137.72499,262.9 129.56399,262.714 C 121.35699,262.576 112.75399,264.788 103.40199,269.164 z "
            i:knockout="Off"
            id="path109"
            style="fill:#8f3e3e;fill-opacity:1;fill-rule:evenodd"/>
    <path
            clip-rule="evenodd"
            d="M 167.19499,262.623 L 268.13499,208.765 C 260.19599,191.349 254.59199,178.22 251.32699,168.867 C 247.97299,159.56 246.56199,157.487 248.45899,153.064 C 250.39999,148.503 247.70899,147.812 262.48899,141.777 C 277.26699,135.511 321.47299,117.543 335.89899,116.668 C 350.01699,115.931 349.44399,131.503 347.10599,136.756 C 344.54599,141.869 331.39899,143.159 321.42899,147.214 C 311.32499,151.084 300.20799,155.414 287.36999,160.206 L 333.55999,261.84 C 327.60499,266.953 319.70699,268.936 309.03099,268.151 C 298.17799,267.094 283.70699,256.774 270.20799,256.725 C 256.75199,256.774 241.39899,268.291 229.09099,268.52 C 216.73799,268.473 206.94399,258.523 196.61999,257.511 C 186.25399,256.494 176.50399,258.198 167.19499,262.623 z "
            i:knockout="Off"
            id="path115"
            style="fill:#8f3e3e;fill-opacity:1;fill-rule:evenodd"/>
    <path
            clip-rule="evenodd"
            d="M 348.54799,174.677 C 364.10999,174.677 376.73799,187.865 376.73799,204.116 C 376.73799,220.367 364.10899,233.555 348.54799,233.555 C 332.98699,233.555 320.35699,220.367 320.35699,204.116 C 320.35699,187.865 332.98599,174.677 348.54799,174.677"
            i:knockout="Off"
            id="path117"
            style="fill:#8f3e3e;fill-opacity:1;fill-rule:evenodd"/>
    <path
            clip-rule="evenodd"
            d="M 99.077992,264.603 C 87.121992,262.391 74.945992,258.985 61.710992,254.374 C 48.386992,249.493 25.666992,242.949 20.283992,236.545 C 14.901992,229.957 18.827992,216.781 29.681992,216.182 C 40.577992,215.583 62.195992,225.258 84.651992,233.275 C 106.97499,241.201 132.51899,251.106 162.65199,263.499 C 158.94599,265.526 154.04899,266.171 147.78399,265.249 C 141.43099,264.188 133.40199,258.337 125.23999,258.154 C 117.03399,258.015 108.43099,260.227 99.077992,264.603 z "
            i:knockout="Off"
            id="path119"
            style="fill:#8f3e3e;fill-opacity:1;fill-rule:evenodd"/>
    <path
            clip-rule="evenodd"
            d="M 376.26899,316.481 C 373.09199,317.355 368.98899,317.218 363.60699,316.066 C 358.13699,314.869 353.15099,308.969 344.06299,309.384 C 334.75399,309.706 321.60599,318.045 308.90199,318.045 C 296.01799,317.77 281.54799,309.016 268.40099,309.016 C 255.29799,309.109 243.38599,318.185 230.81299,318.46 C 218.01899,318.507 205.26899,309.984 192.73999,309.799 C 180.03399,309.476 167.98999,317.355 156.12199,317.263 C 144.43099,317.033 134.06299,308.647 122.45999,309.016 C 110.54799,309.476 97.488992,318.69 85.841992,319.245 C 74.106992,319.428 63.473992,310.674 53.106992,310.582 C 42.651992,310.399 30.915992,316.986 23.856992,318.461 C 16.797992,319.891 12.341992,319.843 10.665992,318.83 L 10.665992,343.248 C 12.341992,344.261 16.797992,344.309 23.856992,342.879 C 30.915992,341.403 42.650992,334.817 53.106992,335 C 63.474992,335.092 74.106992,343.846 85.841992,343.663 C 97.488992,343.108 110.54799,333.894 122.45999,333.434 C 134.06299,333.065 144.42999,341.451 156.12199,341.681 C 167.98999,341.773 180.03399,333.894 192.73999,334.217 C 205.26899,334.402 218.01899,342.925 230.81299,342.878 C 243.38599,342.603 255.29799,333.524 268.40099,333.434 C 281.54799,333.434 296.01799,342.188 308.90199,342.463 C 321.60599,342.463 334.75499,334.124 344.06299,333.802 C 353.15099,333.479 358.13699,339.283 363.60699,340.529 C 368.98899,341.681 373.09199,341.866 376.26899,340.899 L 376.26899,316.481 z "
            i:knockout="Off"
            id="path121"
            style="fill:#17057a;fill-rule:evenodd"/>
</svg>
