<?xml version="1.0" encoding="UTF-8" standalone="no"?>
<!-- Created with Inkscape (http://www.inkscape.org/) -->

<svg
        xmlns:dc="http://purl.org/dc/elements/1.1/"
        xmlns:cc="http://creativecommons.org/ns#"
        xmlns:rdf="http://www.w3.org/1999/02/22-rdf-syntax-ns#"
        xmlns="http://www.w3.org/2000/svg"
        xmlns:sodipodi="http://sodipodi.sourceforge.net/DTD/sodipodi-0.dtd"
        xmlns:inkscape="http://www.inkscape.org/namespaces/inkscape"
        width="64"
        height="64"
        id="svg2"
        version="1.1"
        inkscape:version="0.48.0 r9654"
        sodipodi:docname="groyne.svg">
    <defs
            id="defs4"/>
    <sodipodi:namedview
            id="base"
            pagecolor="#ffffff"
            bordercolor="#666666"
            borderopacity="1.0"
            inkscape:pageopacity="0.0"
            inkscape:pageshadow="2"
            inkscape:zoom="4.2929687"
            inkscape:cx="14.925976"
            inkscape:cy="34.701299"
            inkscape:document-units="px"
            inkscape:current-layer="layer1"
            showgrid="false"
            inkscape:window-width="1400"
            inkscape:window-height="964"
            inkscape:window-x="-4"
            inkscape:window-y="-4"
            inkscape:window-maximized="1"/>
    <metadata
            id="metadata7">
        <rdf:RDF>
            <cc:Work
                    rdf:about="">
                <dc:format>image/svg+xml</dc:format>
                <dc:type
                        rdf:resource="http://purl.org/dc/dcmitype/StillImage"/>
                <dc:title></dc:title>
            </cc:Work>
        </rdf:RDF>
    </metadata>
    <g
            inkscape:label="Ebene 1"
            inkscape:groupmode="layer"
            id="layer1"
            transform="translate(0,-988.36218)">
        <rect
                style="opacity:0.98999999000000005;color:#000000;fill:#0066ff;fill-opacity:1;stroke:none;stroke-width:4;marker:none;visibility:visible;display:inline;overflow:visible;enable-background:accumulate"
                id="rect4879"
                width="58.467697"
                height="80.596909"
                x="13.743403"
                y="-7.0464058"
                transform="translate(0,988.36218)"/>
        <rect
                style="opacity:0.98999999000000005;color:#000000;fill:#1a1a1a;fill-opacity:1;stroke:none;stroke-width:4;marker:none;visibility:visible;display:inline;overflow:visible;enable-background:accumulate"
                id="rect4881"
                width="34.009098"
                height="2.7952685"
                x="18.169241"
                y="1005.3086"/>
        <rect
                y="1033.0283"
                x="15.373974"
                height="2.7952685"
                width="36.571426"
                id="rect4883"
                style="opacity:0.98999999000000005;color:#000000;fill:#1a1a1a;fill-opacity:1;stroke:none;stroke-width:4;marker:none;visibility:visible;display:inline;overflow:visible;enable-background:accumulate"/>
        <path
                style="fill:#2aff2a;fill-opacity:1;stroke:none"
                d="m 29.583257,985.27574 c 0,0 -8.660952,4.78192 -9.5505,9.08465 -0.922683,4.46301 5.362698,8.02131 5.357598,12.57871 -0.0066,5.9133 -7.254895,10.3984 -6.988171,16.3057 0.199013,4.4077 5.661663,7.2796 6.289353,11.6469 1.061582,7.3863 -4.65878,21.8963 -4.65878,21.8963 l -28.1856232,0 0,-71.51226 z"
                id="path4877"
                inkscape:connector-curvature="0"
                sodipodi:nodetypes="caaaacccc"/>
    </g>
</svg>
