<?xml version="1.0" encoding="UTF-8" standalone="no"?>
<!-- Created with Inkscape (http://www.inkscape.org/) -->
<svg
        xmlns:dc="http://purl.org/dc/elements/1.1/"
        xmlns:cc="http://web.resource.org/cc/"
        xmlns:rdf="http://www.w3.org/1999/02/22-rdf-syntax-ns#"
        xmlns="http://www.w3.org/2000/svg"
        xmlns:sodipodi="http://sodipodi.sourceforge.net/DTD/sodipodi-0.dtd"
        xmlns:inkscape="http://www.inkscape.org/namespaces/inkscape"
        width="32"
        height="32"
        id="svg2"
        sodipodi:version="0.32"
        inkscape:version="0.45.1"
        version="1.0"
        sodipodi:docbase="/home/tweety/svn.openstreetmap.org/applications/share/map-icons/svg/food"
        sodipodi:docname="bar.svg"
        inkscape:output_extension="org.inkscape.output.svg.inkscape">
    <defs
            id="defs4"/>
    <sodipodi:namedview
            id="base"
            pagecolor="#ffffff"
            bordercolor="#666666"
            borderopacity="1.0"
            gridtolerance="10000"
            guidetolerance="10"
            objecttolerance="10"
            inkscape:pageopacity="0.0"
            inkscape:pageshadow="2"
            inkscape:zoom="5.6"
            inkscape:cx="42.017637"
            inkscape:cy="9.1839918"
            inkscape:document-units="px"
            inkscape:current-layer="layer1"
            width="32px"
            height="32px"
            inkscape:window-width="906"
            inkscape:window-height="596"
            inkscape:window-x="485"
            inkscape:window-y="420"/>
    <metadata
            id="metadata7">
        <rdf:RDF>
            <cc:Work
                    rdf:about="">
                <dc:format>image/svg+xml</dc:format>
                <dc:type
                        rdf:resource="http://purl.org/dc/dcmitype/StillImage"/>
                <cc:license
                        rdf:resource="http://web.resource.org/cc/PublicDomain"/>
            </cc:Work>
            <cc:License
                    rdf:about="http://web.resource.org/cc/PublicDomain">
                <cc:permits
                        rdf:resource="http://web.resource.org/cc/Reproduction"/>
                <cc:permits
                        rdf:resource="http://web.resource.org/cc/Distribution"/>
                <cc:permits
                        rdf:resource="http://web.resource.org/cc/DerivativeWorks"/>
            </cc:License>
        </rdf:RDF>
    </metadata>
    <g
            inkscape:label="Layer 1"
            inkscape:groupmode="layer"
            id="layer1">
        <path
                style="fill:none;fill-rule:evenodd;stroke:#000000;stroke-width:1.45413351px;stroke-linecap:butt;stroke-linejoin:miter;stroke-opacity:1"
                d="M 15.637782,13.115965 L 15.637782,28.976463"
                id="path2159"/>
        <path
                style="fill:#00ffff;fill-rule:evenodd;stroke:#000000;stroke-width:0.30536804;stroke-linecap:butt;stroke-linejoin:miter;stroke-miterlimit:4;stroke-dasharray:none;stroke-opacity:1"
                d="M 15.637939,16.333445 L 4.166657,4.1887054 L 26.726201,4.1887054 L 15.637939,16.333445 z "
                id="path2157"
                sodipodi:nodetypes="cccc"/>
        <path
                style="fill:none;fill-rule:evenodd;stroke:#000000;stroke-width:1.45413351px;stroke-linecap:butt;stroke-linejoin:miter;stroke-opacity:1"
                d="M 6.4551021,29.769486 L 23.800165,29.769486"
                id="path2161"/>
    </g>
</svg>
