<?xml version="1.0" encoding="UTF-8" standalone="no"?>
<!-- Created with Inkscape (http://www.inkscape.org/) -->
<svg
        xmlns:dc="http://purl.org/dc/elements/1.1/"
        xmlns:cc="http://creativecommons.org/ns#"
        xmlns:rdf="http://www.w3.org/1999/02/22-rdf-syntax-ns#"
        xmlns="http://www.w3.org/2000/svg"
        xmlns:sodipodi="http://sodipodi.sourceforge.net/DTD/sodipodi-0.dtd"
        xmlns:inkscape="http://www.inkscape.org/namespaces/inkscape"
        version="1.0"
        width="32"
        height="32"
        id="svg2"
        sodipodi:version="0.32"
        inkscape:version="0.46"
        sodipodi:docname="hmhm_ruin.svg"
        inkscape:output_extension="org.inkscape.output.svg.inkscape">
    <metadata
            id="metadata2393">
        <rdf:RDF>
            <cc:Work
                    rdf:about="">
                <dc:format>image/svg+xml</dc:format>
                <dc:type
                        rdf:resource="http://purl.org/dc/dcmitype/StillImage"/>
                <cc:license
                        rdf:resource="http://creativecommons.org/licenses/publicdomain/"/>
                <dc:creator>
                    <cc:Agent>
                        <dc:title>malenki (Michael Buchberger)</dc:title>
                    </cc:Agent>
                </dc:creator>
            </cc:Work>
            <cc:License
                    rdf:about="http://creativecommons.org/licenses/publicdomain/">
                <cc:permits
                        rdf:resource="http://creativecommons.org/ns#Reproduction"/>
                <cc:permits
                        rdf:resource="http://creativecommons.org/ns#Distribution"/>
                <cc:permits
                        rdf:resource="http://creativecommons.org/ns#DerivativeWorks"/>
            </cc:License>
        </rdf:RDF>
    </metadata>
    <sodipodi:namedview
            inkscape:window-height="977"
            inkscape:window-width="1276"
            inkscape:pageshadow="2"
            inkscape:pageopacity="0.0"
            guidetolerance="10.0"
            gridtolerance="10.0"
            objecttolerance="10.0"
            borderopacity="1.0"
            bordercolor="#666666"
            pagecolor="#ffffff"
            id="base"
            showgrid="true"
            inkscape:zoom="22.627417"
            inkscape:cx="8.6361782"
            inkscape:cy="11.692686"
            inkscape:window-x="0"
            inkscape:window-y="0"
            inkscape:current-layer="svg2"
            showguides="true"
            inkscape:guide-bbox="true">
        <inkscape:grid
                type="xygrid"
                id="grid3753"
                visible="true"
                enabled="true"/>
        <sodipodi:guide
                orientation="0,1"
                position="5.125,69.625"
                id="guide3211"/>
    </sodipodi:namedview>
    <defs
            id="defs4">
        <inkscape:perspective
                sodipodi:type="inkscape:persp3d"
                inkscape:vp_x="0 : 526.18109 : 1"
                inkscape:vp_y="0 : 1000 : 0"
                inkscape:vp_z="744.09448 : 526.18109 : 1"
                inkscape:persp3d-origin="372.04724 : 350.78739 : 1"
                id="perspective2395"/>
    </defs>
    <path
            sodipodi:type="arc"
            style="fill:none;fill-opacity:1;fill-rule:evenodd;stroke:#000000;stroke-width:1px;stroke-linecap:butt;stroke-linejoin:miter;stroke-opacity:1"
            id="path2410"
            sodipodi:cx="9.7858524"
            sodipodi:cy="17.668461"
            sodipodi:rx="5.4295697"
            sodipodi:ry="5.4295697"
            d="M 15.215422,17.668461 A 5.4295697,5.4295697 0 1 1 4.3562827,17.668461 A 5.4295697,5.4295697 0 1 1 15.215422,17.668461 z"
            transform="matrix(0.8388617,0.8388617,-0.8388617,0.8388617,13.661101,1.9696282)"
            inkscape:transform-center-x="-0.048682571"/>
    <rect
            style="fill:#000000;fill-opacity:1;fill-rule:evenodd;stroke:none;stroke-width:0.75754625px;stroke-linecap:butt;stroke-linejoin:miter;stroke-opacity:1"
            id="rect2412"
            width="1.2984442"
            height="17.902433"
            x="22.012619"
            y="-12.18216"
            inkscape:transform-center-x="-11.308964"
            inkscape:transform-center-y="-11.26028"
            transform="matrix(0.7071068,0.7071068,-0.7071068,0.7071068,0,0)"/>
    <path
            d="M 25.094122,7.8670181 L 32.011618,19.151075 L 20.065836,12.892564 L 25.094122,7.8670181 z"
            id="path3193"
            style="fill:#000000;fill-opacity:1;fill-rule:evenodd;stroke:none;stroke-width:0.04903595px;stroke-linecap:butt;stroke-linejoin:miter;stroke-opacity:1"
            inkscape:transform-center-x="-19.038727"
            inkscape:transform-center-y="-11.490954"/>
    <path
            style="fill:#000000;fill-opacity:1;fill-rule:evenodd;stroke:none;stroke-width:1px;stroke-linecap:butt;stroke-linejoin:miter;stroke-opacity:1"
            d="M 0.39817403,25.0625 C 0.39817403,28.618075 3.280098,31.500001 6.835674,31.5 C 10.391249,31.5 13.273174,28.618075 13.273174,25.0625 C 13.273174,25.041384 13.273377,25.021069 13.273174,25 L 0.39817403,25 C 0.39797103,25.021069 0.39817403,25.041384 0.39817403,25.0625 z"
            id="path3225"
            inkscape:transform-center-x="0.16432612"
            inkscape:transform-center-y="3.2499999"/>
</svg>
