<svg enable-background="new 0 0 15 15" height="15" viewBox="15" width="15" xmlns="http://www.w3.org/2000/svg">
    <path d="M7.5,3.19l1.07,2.68L8.82,6.5h3l-2,1.75l-0.5,0.44l0.23,0.63l1,3.13l-2.48-1.77
	l-0.57-0.4l-0.57,0.4l-2.52,1.77l1-3.13l0.21-0.63l-0.5-0.44l-2-1.75h3l0.25-0.63L7.5,3.19 M7.5,0.5l-2,5h-5l4,3.5l-2,6l5-3.5l5,3.5
	l-2-6l4-3.5h-5L7.5,0.5L7.5,0.5z" fill="param(fill)" fill-opacity="param(fill-opacity)" stroke="param(outline)"
          stroke-opacity="param(outline-opacity)" stroke-width="param(outline-width)"/>
</svg>