<?xml version="1.0" encoding="UTF-8" standalone="no"?>
<!-- Created with Inkscape (http://www.inkscape.org/) -->
<svg
        xmlns:dc="http://purl.org/dc/elements/1.1/"
        xmlns:cc="http://web.resource.org/cc/"
        xmlns:rdf="http://www.w3.org/1999/02/22-rdf-syntax-ns#"
        xmlns="http://www.w3.org/2000/svg"
        xmlns:sodipodi="http://sodipodi.sourceforge.net/DTD/sodipodi-0.dtd"
        xmlns:inkscape="http://www.inkscape.org/namespaces/inkscape"
        width="32"
        height="32"
        id="svg2"
        sodipodi:version="0.32"
        inkscape:version="0.45.1"
        version="1.0"
        sodipodi:docbase="/home/tweety/svn.openstreetmap.org/applications/share/map-icons/svg/vehicle/restrictions"
        sodipodi:docname="traffic-light.svg"
        inkscape:output_extension="org.inkscape.output.svg.inkscape">
    <defs
            id="defs4"/>
    <sodipodi:namedview
            id="base"
            pagecolor="#ffffff"
            bordercolor="#666666"
            borderopacity="1.0"
            gridtolerance="10000"
            guidetolerance="10"
            objecttolerance="10"
            inkscape:pageopacity="0.0"
            inkscape:pageshadow="2"
            inkscape:zoom="22.4"
            inkscape:cx="20.471423"
            inkscape:cy="14.149163"
            inkscape:document-units="px"
            inkscape:current-layer="layer1"
            width="32px"
            height="32px"
            inkscape:window-width="1178"
            inkscape:window-height="1016"
            inkscape:window-x="213"
            inkscape:window-y="0"
            showgrid="true"
            inkscape:object-bbox="true"
            inkscape:object-points="true"
            inkscape:object-nodes="true"
            inkscape:grid-points="true"
            inkscape:guide-points="true"/>
    <metadata
            id="metadata7">
        <rdf:RDF>
            <cc:Work
                    rdf:about="">
                <dc:format>image/svg+xml</dc:format>
                <dc:type
                        rdf:resource="http://purl.org/dc/dcmitype/StillImage"/>
                <cc:license
                        rdf:resource="http://web.resource.org/cc/PublicDomain"/>
                <dc:title>Map Icon for OpenStreetmap and GpsDrive</dc:title>
            </cc:Work>
            <cc:License
                    rdf:about="http://web.resource.org/cc/PublicDomain">
                <cc:permits
                        rdf:resource="http://web.resource.org/cc/Reproduction"/>
                <cc:permits
                        rdf:resource="http://web.resource.org/cc/Distribution"/>
                <cc:permits
                        rdf:resource="http://web.resource.org/cc/DerivativeWorks"/>
            </cc:License>
        </rdf:RDF>
    </metadata>
    <g
            inkscape:label="Layer 1"
            inkscape:groupmode="layer"
            id="layer1">
        <rect
                style="opacity:1;fill:#000000;fill-opacity:1;stroke:none;stroke-width:3.0999999;stroke-linejoin:round;stroke-miterlimit:4;stroke-dasharray:none;stroke-dashoffset:0;stroke-opacity:1"
                id="rect2157"
                width="10"
                height="28"
                x="10"
                y="1"
                ry="1.7307692"/>
        <path
                sodipodi:type="arc"
                style="opacity:1;fill:#ff0000;fill-opacity:1;stroke:none;stroke-width:3.0999999;stroke-linejoin:round;stroke-miterlimit:4;stroke-dasharray:none;stroke-dashoffset:0;stroke-opacity:1"
                id="path2161"
                sodipodi:cx="15"
                sodipodi:cy="7"
                sodipodi:rx="4"
                sodipodi:ry="4"
                d="M 19 7 A 4 4 0 1 1  11,7 A 4 4 0 1 1  19 7 z"
                transform="translate(0,-1)"/>
        <path
                sodipodi:type="arc"
                style="opacity:1;fill:#ffff00;fill-opacity:1;stroke:none;stroke-width:3.0999999;stroke-linejoin:round;stroke-miterlimit:4;stroke-dasharray:none;stroke-dashoffset:0;stroke-opacity:1"
                id="path2163"
                sodipodi:cx="15"
                sodipodi:cy="7"
                sodipodi:rx="4"
                sodipodi:ry="4"
                d="M 19 7 A 4 4 0 1 1  11,7 A 4 4 0 1 1  19 7 z"
                transform="translate(0,8)"/>
        <path
                sodipodi:type="arc"
                style="opacity:1;fill:#00ff00;fill-opacity:1;stroke:none;stroke-width:3.0999999;stroke-linejoin:round;stroke-miterlimit:4;stroke-dasharray:none;stroke-dashoffset:0;stroke-opacity:1"
                id="path2165"
                sodipodi:cx="15"
                sodipodi:cy="7"
                sodipodi:rx="4"
                sodipodi:ry="4"
                d="M 19 7 A 4 4 0 1 1  11,7 A 4 4 0 1 1  19 7 z"
                transform="translate(0,17)"/>
        <rect
                style="opacity:1;fill:#000000;fill-opacity:1;stroke:none;stroke-width:3.0999999;stroke-linejoin:round;stroke-miterlimit:4;stroke-dasharray:none;stroke-dashoffset:0;stroke-opacity:1"
                id="rect2167"
                width="2.1160715"
                height="3"
                x="13.883928"
                y="29"
                ry="0"/>
    </g>
</svg>
