data,min_detection,max_detection,hole_id,from,to,date
6.743108190098317,4.0,16.0,MCRC0001,0.0,0.1268781302170283,2025-01-01
12.992036339750758,4.0,16.0,MCRC0001,0.2537562604340567,0.3806343906510851,2025-01-02
10.848935494155976,4.0,16.0,MCRC0001,0.5075125208681135,0.6343906510851419,2025-01-03
5.481115858245724,4.0,16.0,MCRC0001,0.7612687813021702,0.8881469115191987,2025-01-04
8.26419924409439,4.0,16.0,MCRC0001,1.015025041736227,1.1419031719532555,2025-01-05
14.954309611291452,4.0,16.0,MCRC0001,1.2687813021702838,1.3956594323873122,2025-01-06
2.719962269820778,4.0,16.0,MCRC0001,1.5225375626043405,1.649415692821369,2025-01-07
8.713262113431469,4.0,16.0,MCRC0001,1.7762938230383971,1.9031719532554257,2025-01-08
13.797808776116602,4.0,16.0,MCRC0001,2.030050083472454,2.1569282136894823,2025-01-09
7.399778793204694,4.0,16.0,MCRC0001,2.283806343906511,2.41068447412354,2025-01-10
7.9633415451338365,4.0,16.0,MCRC0001,2.537562604340568,2.664440734557596,2025-01-11
9.715873093189328,4.0,16.0,MCRC0001,2.7913188647746243,2.9181969949916526,2025-01-12
14.474168878372865,4.0,16.0,MCRC0001,3.045075125208681,3.1719532554257097,2025-01-13
8.083294009946048,4.0,16.0,MCRC0001,3.298831385642738,3.4257095158597664,2025-01-14
8.668054121061804,4.0,16.0,MCRC0001,3.5525876460767947,3.679465776293823,2025-01-15
8.696946173144449,4.0,16.0,MCRC0001,3.8063439065108513,3.93322203672788,2025-01-16
16.61779024817637,4.0,16.0,MCRC0001,4.060100166944908,4.186978297161937,2025-01-17
16.560358266921362,4.0,16.0,MCRC0001,4.313856427378965,4.440734557595993,2025-01-18
13.012161693636632,4.0,16.0,MCRC0001,4.567612687813022,4.69449081803005,2025-01-19
11.158559197524568,4.0,16.0,MCRC0001,4.821368948247079,4.948247078464107,2025-01-20
12.212105727688726,4.0,16.0,MCRC0001,5.075125208681135,5.202003338898163,2025-01-21
14.472196084452396,4.0,16.0,MCRC0001,5.328881469115192,5.455759599332221,2025-01-22
7.1924983947928265,4.0,16.0,MCRC0001,5.582637729549249,5.709515859766277,2025-01-23
13.527487134346307,4.0,16.0,MCRC0001,5.836393989983305,5.963272120200334,2025-01-24
6.2383579967529625,4.0,16.0,MCRC0001,6.090150250417362,6.217028380634391,2025-01-25
8.08674549263977,4.0,16.0,MCRC0001,6.343906510851419,6.470784641068447,2025-01-26
12.721315587400904,4.0,16.0,MCRC0001,6.597662771285476,6.724540901502504,2025-01-27
5.713957899322093,4.0,16.0,MCRC0001,6.851419031719533,6.978297161936561,2025-01-28
9.579793839434002,4.0,16.0,MCRC0001,7.105175292153589,7.232053422370618,2025-01-29
7.414735312420944,4.0,16.0,MCRC0001,7.358931552587646,7.485809682804675,2025-01-30
9.233141888408207,4.0,16.0,MCRC0001,7.612687813021703,7.739565943238731,2025-01-31
1.604232683617827,4.0,16.0,MCRC0001,7.866444073455759,7.993322203672788,2025-02-01
4.685400686470459,4.0,16.0,MCRC0001,8.120200333889816,8.247078464106846,2025-02-02
7.900368296206248,4.0,16.0,MCRC0001,8.373956594323873,8.500834724540901,2025-02-03
12.782387295275749,4.0,16.0,MCRC0001,8.62771285475793,8.754590984974959,2025-02-04
9.479092951629353,4.0,16.0,MCRC0001,8.881469115191987,9.008347245409016,2025-02-05
10.008537747690433,4.0,16.0,MCRC0001,9.135225375626044,9.262103505843072,2025-02-06
12.064668133306856,4.0,16.0,MCRC0001,9.3889816360601,9.515859766277128,2025-02-07
7.3613909709728444,4.0,16.0,MCRC0001,9.642737896494156,9.769616026711184,2025-02-08
10.850881971421874,4.0,16.0,MCRC0001,9.896494156928211,10.023372287145245,2025-02-09
7.583900445803152,4.0,16.0,MCRC0001,10.15025041736227,10.2771285475793,2025-02-10
4.816991517638178,4.0,16.0,MCRC0001,10.404006677796326,10.530884808013356,2025-02-11
8.827300618734697,4.0,16.0,MCRC0001,10.657762938230384,10.784641068447412,2025-02-12
11.721417587215171,4.0,16.0,MCRC0001,10.911519198664442,11.03839732888147,2025-02-13
11.015767152999404,4.0,16.0,MCRC0001,11.165275459098496,11.292153589315523,2025-02-14
9.96450851656354,4.0,16.0,MCRC0001,11.419031719532557,11.545909849749584,2025-02-15
17.177095797813177,4.0,16.0,MCRC0001,11.67278797996661,11.79966611018364,2025-02-16
11.238736480926336,4.0,16.0,MCRC0001,11.926544240400668,12.053422370617696,2025-02-17
12.93620801781204,4.0,16.0,MCRC0001,12.180300500834724,12.307178631051752,2025-02-18
16.71443001549386,4.0,16.0,MCRC0001,12.43405676126878,12.56093489148581,2025-02-19
6.117744030516254,4.0,16.0,MCRC0001,12.68781302170284,12.814691151919869,2025-02-20
6.883635369385139,4.0,16.0,MCRC0001,12.941569282136896,13.068447412353922,2025-02-21
15.231136675368791,4.0,16.0,MCRC0001,13.195325542570952,13.32220367278798,2025-02-22
7.605811794276812,4.0,16.0,MCRC0001,13.449081803005008,13.575959933222038,2025-02-23
10.08904969090999,4.0,16.0,MCRC0001,13.702838063439064,13.829716193656092,2025-02-24
13.207947908273043,4.0,16.0,MCRC0001,13.95659432387312,14.08347245409015,2025-02-25
12.672119173879512,4.0,16.0,MCRC0001,14.21035058430718,14.337228714524208,2025-02-26
15.264658545943329,4.0,16.0,MCRC0001,14.464106844741236,14.590984974958264,2025-02-27
14.486932411100408,4.0,16.0,MCRC0001,14.717863105175292,14.84474123539232,2025-02-28
13.20817800911721,4.0,16.0,MCRC0001,14.97161936560935,15.098497495826376,2025-03-01
7.6818738572584255,4.0,16.0,MCRC0001,15.225375626043403,15.352253756260437,2025-03-02
12.384588003379656,4.0,16.0,MCRC0001,15.479131886477465,15.60601001669449,2025-03-03
10.9428159835206,4.0,16.0,MCRC0001,15.732888146911518,15.859766277128548,2025-03-04
6.021203620178632,4.0,16.0,MCRC0001,15.986644407345576,16.113522537562606,2025-03-05
14.251897139430556,4.0,16.0,MCRC0001,16.24040066777963,16.36727879799666,2025-03-06
12.4217096037357,4.0,16.0,MCRC0001,16.49415692821369,16.621035058430717,2025-03-07
10.136470241893292,4.0,16.0,MCRC0001,16.747913188647747,16.874791318864773,2025-03-08
9.30072381704676,4.0,16.0,MCRC0001,17.001669449081803,17.128547579298832,2025-03-09
6.405096565897639,4.0,16.0,MCRC0001,17.25542570951586,17.382303839732888,2025-03-10
10.598572220675898,4.0,16.0,MCRC0001,17.509181969949918,17.636060100166944,2025-03-11
11.405317358336934,4.0,16.0,MCRC0001,17.762938230383973,17.889816360601003,2025-03-12
7.506535047270162,4.0,16.0,MCRC0001,18.01669449081803,18.14357262103506,2025-03-13
13.486612147298588,4.0,16.0,MCRC0001,18.27045075125209,18.397328881469114,2025-03-14
6.708390860550898,4.0,16.0,MCRC0001,18.524207011686144,18.65108514190317,2025-03-15
3.6306989498726754,4.0,16.0,MCRC0001,18.7779632721202,18.90484140233723,2025-03-16
13.119181272678102,4.0,16.0,MCRC0001,19.031719532554256,19.158597662771285,2025-03-17
8.789901885693677,4.0,16.0,MCRC0001,19.285475792988315,19.41235392320534,2025-03-18
9.621911244060955,4.0,16.0,MCRC0001,19.53923205342237,19.6661101836394,2025-03-19
7.48744983152484,4.0,16.0,MCRC0001,19.792988313856423,19.919866444073456,2025-03-20
5.182111717847792,4.0,16.0,MCRC0001,20.04674457429049,20.173622704507512,2025-03-21
13.765712124172657,4.0,16.0,MCRC0001,20.30050083472454,20.427378964941568,2025-03-22
7.933393048459235,4.0,16.0,MCRC0001,20.5542570951586,20.681135225375627,2025-03-23
14.982857464443818,4.0,16.0,MCRC0001,20.808013355592653,20.934891485809683,2025-03-24
12.421924558632186,4.0,16.0,MCRC0001,21.061769616026712,21.18864774624374,2025-03-25
9.05572555984762,4.0,16.0,MCRC0001,21.315525876460768,21.4424040066778,2025-03-26
6.742292796619401,4.0,16.0,MCRC0001,21.569282136894824,21.696160267111853,2025-03-27
7.802614039838629,4.0,16.0,MCRC0001,21.823038397328883,21.94991652754591,2025-03-28
6.362430606714491,4.0,16.0,MCRC0001,22.07679465776294,22.203672787979965,2025-03-29
16.261340078764555,4.0,16.0,MCRC0001,22.330550918196995,22.457429048414024,2025-03-30
10.493323690689476,4.0,16.0,MCRC0001,22.58430717863105,22.71118530884808,2025-03-31
13.450616627639896,4.0,16.0,MCRC0001,22.83806343906511,22.964941569282136,2025-04-01
6.197943852969318,4.0,16.0,MCRC0001,23.091819699499165,23.218697829716195,2025-04-02
10.543105388791012,4.0,16.0,MCRC0001,23.34557595993322,23.47245409015025,2025-04-03
13.533585816425736,4.0,16.0,MCRC0001,23.59933222036728,23.726210350584303,2025-04-04
8.994967714200952,4.0,16.0,MCRC0001,23.853088480801336,23.97996661101836,2025-04-05
13.093343376765226,4.0,16.0,MCRC0001,24.106844741235392,24.23372287145242,2025-04-06
6.746296263982701,4.0,16.0,MCRC0001,24.360601001669448,24.48747913188648,2025-04-07
5.909585366144247,4.0,16.0,MCRC0001,24.614357262103507,24.741235392320533,2025-04-08
11.138201836234408,4.0,16.0,MCRC0001,24.868113522537563,24.994991652754592,2025-04-09
8.862470696282344,4.0,16.0,MCRC0001,25.12186978297162,25.248747913188648,2025-04-10
53.21027344635916,40.0,60.0,MCRC0001,25.37562604340568,25.502504173622704,2025-04-11
40.11056034239776,40.0,60.0,MCRC0001,25.629382303839733,25.75626043405676,2025-04-12
53.56132317735259,40.0,60.0,MCRC0001,25.88313856427379,26.01001669449082,2025-04-13
62.991519636346574,40.0,60.0,MCRC0001,26.136894824707845,26.263772954924875,2025-04-14
49.876870092842594,40.0,60.0,MCRC0001,26.390651085141904,26.51752921535893,2025-04-15
50.17071064454921,40.0,60.0,MCRC0001,26.64440734557596,26.77128547579299,2025-04-16
50.897747423193394,40.0,60.0,MCRC0001,26.898163606010016,27.025041736227045,2025-04-17
40.69012144604106,40.0,60.0,MCRC0001,27.151919866444075,27.2787979966611,2025-04-18
52.13073319845155,40.0,60.0,MCRC0001,27.40567612687813,27.53255425709516,2025-04-19
41.972951279920174,40.0,60.0,MCRC0001,27.659432387312187,27.786310517529216,2025-04-20
47.86160200938098,40.0,60.0,MCRC0001,27.91318864774624,28.040066777963272,2025-04-21
56.21434774801868,40.0,60.0,MCRC0001,28.1669449081803,28.293823038397328,2025-04-22
46.32391521949962,40.0,60.0,MCRC0001,28.42070116861436,28.547579298831387,2025-04-23
52.506244947837,40.0,60.0,MCRC0001,28.674457429048413,28.801335559265443,2025-04-24
55.06369526978185,40.0,60.0,MCRC0001,28.928213689482472,29.0550918196995,2025-04-25
51.39370428048,40.0,60.0,MCRC0001,29.181969949916528,29.308848080133554,2025-04-26
43.14525764952696,40.0,60.0,MCRC0001,29.435726210350584,29.562604340567614,2025-04-27
48.33762362324293,40.0,60.0,MCRC0001,29.68948247078464,29.81636060100167,2025-04-28
59.79705671194143,40.0,60.0,MCRC0001,29.9432387312187,30.070116861435725,2025-04-29
39.87477118501265,40.0,60.0,MCRC0001,30.196994991652755,30.323873121869784,2025-04-30
48.62106993066912,40.0,60.0,MCRC0001,30.45075125208681,30.57762938230384,2025-05-01
47.23945964255946,40.0,60.0,MCRC0001,30.70450751252087,30.831385642737896,2025-05-02
50.603736815485696,40.0,60.0,MCRC0001,30.958263772954925,31.08514190317195,2025-05-03
53.74107808593615,40.0,60.0,MCRC0001,31.21202003338898,31.33889816360601,2025-05-04
58.043454840110265,40.0,60.0,MCRC0001,31.46577629382304,31.592654424040067,2025-05-05
48.64883803995421,40.0,60.0,MCRC0001,31.719532554257096,31.84641068447412,2025-05-06
54.0617066498841,40.0,60.0,MCRC0001,31.973288814691152,32.10016694490818,2025-05-07
52.498700724325865,40.0,60.0,MCRC0001,32.22704507512521,32.353923205342234,2025-05-08
52.371736489359,40.0,60.0,MCRC0001,32.48080133555926,32.60767946577629,2025-05-09
47.18038034236764,40.0,60.0,MCRC0001,32.73455759599332,32.86143572621035,2025-05-10
45.013392656120494,40.0,60.0,MCRC0001,32.98831385642738,33.115191986644405,2025-05-11
44.49978443689651,40.0,60.0,MCRC0001,33.242070116861434,33.368948247078464,2025-05-12
46.21781395300438,40.0,60.0,MCRC0001,33.495826377295494,33.62270450751252,2025-05-13
51.60843287933113,40.0,60.0,MCRC0001,33.749582637729546,33.876460767946575,2025-05-14
53.80474696564165,40.0,60.0,MCRC0001,34.003338898163605,34.130217028380635,2025-05-15
51.61734423928448,40.0,60.0,MCRC0001,34.257095158597664,34.383973288814694,2025-05-16
47.2552245190213,40.0,60.0,MCRC0001,34.51085141903172,34.637729549248746,2025-05-17
59.02985054966237,40.0,60.0,MCRC0001,34.764607679465776,34.891485809682806,2025-05-18
57.5943281181577,40.0,60.0,MCRC0001,35.018363939899835,35.145242070116865,2025-05-19
48.22999943624913,40.0,60.0,MCRC0001,35.27212020033389,35.39899833055092,2025-05-20
45.88284297007167,40.0,60.0,MCRC0001,35.52587646076795,35.652754590984976,2025-05-21
50.65107477078985,40.0,60.0,MCRC0001,35.779632721202006,35.90651085141903,2025-05-22
56.33649322527177,40.0,60.0,MCRC0001,36.03338898163606,36.16026711185309,2025-05-23
51.66382488627058,40.0,60.0,MCRC0001,36.28714524207012,36.41402337228715,2025-05-24
52.78274352455022,40.0,60.0,MCRC0001,36.54090150250418,36.6677796327212,2025-05-25
48.93959938862187,40.0,60.0,MCRC0001,36.79465776293823,36.92153589315526,2025-05-26
52.28135447601115,40.0,60.0,MCRC0001,37.04841402337229,37.17529215358932,2025-05-27
57.72272225728069,40.0,60.0,MCRC0001,37.30217028380634,37.42904841402337,2025-05-28
48.801656092611445,40.0,60.0,MCRC0001,37.5559265442404,37.68280467445743,2025-05-29
50.71653866253936,40.0,60.0,MCRC0001,37.80968280467446,37.93656093489149,2025-05-30
51.26908238274814,40.0,60.0,MCRC0001,38.06343906510851,38.19031719532554,2025-05-31
51.41862677885519,40.0,60.0,MCRC0001,38.31719532554257,38.4440734557596,2025-06-01
42.94055561964386,40.0,60.0,MCRC0001,38.57095158597663,38.69782971619366,2025-06-02
40.615656720630525,40.0,60.0,MCRC0001,38.82470784641068,38.95158597662771,2025-06-03
44.9017246453908,40.0,60.0,MCRC0001,39.07846410684474,39.20534223706177,2025-06-04
50.83971147700834,40.0,60.0,MCRC0001,39.3322203672788,39.45909849749582,2025-06-05
52.76928083001606,40.0,60.0,MCRC0001,39.58597662771285,39.71285475792988,2025-06-06
47.34662720113188,40.0,60.0,MCRC0001,39.83973288814691,39.96661101836394,2025-06-07
56.886287414336536,40.0,60.0,MCRC0001,40.09348914858097,40.220367278798,2025-06-08
49.28412012836907,40.0,60.0,MCRC0001,40.347245409015024,40.47412353923205,2025-06-09
50.101579991173125,40.0,60.0,MCRC0001,40.60100166944908,40.72787979966611,2025-06-10
49.03018064723669,40.0,60.0,MCRC0001,40.854757929883135,40.981636060100165,2025-06-11
50.67013396373333,40.0,60.0,MCRC0001,41.1085141903172,41.235392320534224,2025-06-12
53.52237037021802,40.0,60.0,MCRC0001,41.36227045075125,41.48914858096828,2025-06-13
53.32826718956166,40.0,60.0,MCRC0001,41.616026711185306,41.742904841402336,2025-06-14
45.50788529695205,40.0,60.0,MCRC0001,41.869782971619365,41.9966611018364,2025-06-15
57.61831888239264,40.0,60.0,MCRC0001,42.12353923205343,42.25041736227045,2025-06-16
44.524867712865415,40.0,60.0,MCRC0001,42.37729549248748,42.504173622704506,2025-06-17
50.39613507045306,40.0,60.0,MCRC0001,42.631051752921536,42.757929883138566,2025-06-18
48.62801713238824,40.0,60.0,MCRC0001,42.8848080133556,43.01168614357262,2025-06-19
44.75504161340756,40.0,60.0,MCRC0001,43.13856427378965,43.26544240400668,2025-06-20
49.62439706013084,40.0,60.0,MCRC0001,43.39232053422371,43.51919866444074,2025-06-21
46.295931133538005,40.0,60.0,MCRC0001,43.646076794657766,43.77295492487479,2025-06-22
50.36453621638026,40.0,60.0,MCRC0001,43.89983305509182,44.02671118530885,2025-06-23
52.01542980609683,40.0,60.0,MCRC0001,44.15358931552588,44.28046744574291,2025-06-24
57.35964684486636,40.0,60.0,MCRC0001,44.40734557595993,44.53422370617696,2025-06-25
51.536921093137074,40.0,60.0,MCRC0001,44.66110183639399,44.78797996661102,2025-06-26
46.94387329847588,40.0,60.0,MCRC0001,44.91485809682805,45.04173622704508,2025-06-27
48.041900946402,40.0,60.0,MCRC0001,45.1686143572621,45.29549248747913,2025-06-28
50.699890530572816,40.0,60.0,MCRC0001,45.42237061769616,45.54924874791319,2025-06-29
50.46730414731076,40.0,60.0,MCRC0001,45.67612687813022,45.80300500834725,2025-06-30
57.29794634114211,40.0,60.0,MCRC0001,45.92988313856427,46.0567612687813,2025-07-01
56.97676464878477,40.0,60.0,MCRC0001,46.18363939899833,46.31051752921536,2025-07-02
48.20532036878869,40.0,60.0,MCRC0001,46.43739565943239,46.56427378964941,2025-07-03
47.25678935906901,40.0,60.0,MCRC0001,46.69115191986644,46.81803005008347,2025-07-04
37.21472697966071,40.0,60.0,MCRC0001,46.9449081803005,47.07178631051753,2025-07-05
47.2553979333889,40.0,60.0,MCRC0001,47.19866444073456,47.32554257095158,2025-07-06
45.109711469578585,40.0,60.0,MCRC0001,47.45242070116861,47.57929883138564,2025-07-07
48.2258777095259,40.0,60.0,MCRC0001,47.70617696160267,47.8330550918197,2025-07-08
51.95792121175055,40.0,60.0,MCRC0001,47.95993322203672,48.08681135225376,2025-07-09
50.88596164599494,40.0,60.0,MCRC0001,48.213689482470784,48.34056761268781,2025-07-10
49.85015996476229,40.0,60.0,MCRC0001,48.46744574290484,48.59432387312187,2025-07-11
50.997910555442566,40.0,60.0,MCRC0001,48.721202003338895,48.848080133555925,2025-07-12
49.36941113384504,40.0,60.0,MCRC0001,48.97495826377296,49.101836393989984,2025-07-13
50.98509466271738,40.0,60.0,MCRC0001,49.22871452420701,49.35559265442404,2025-07-14
33.84472496040344,40.0,60.0,MCRC0001,49.482470784641066,49.609348914858096,2025-07-15
48.65353255124623,40.0,60.0,MCRC0001,49.736227045075125,49.86310517529216,2025-07-16
49.44574639473497,40.0,60.0,MCRC0001,49.98998330550919,50.11686143572621,2025-07-17
48.29369141896707,40.0,60.0,MCRC0001,50.24373956594324,50.37061769616027,2025-07-18
48.91026868948529,40.0,60.0,MCRC0001,50.497495826377296,50.624373956594326,2025-07-19
22.81324047122692,12.0,28.0,MCRC0001,50.75125208681136,50.87813021702838,2025-07-20
17.6075786746367,12.0,28.0,MCRC0001,51.00500834724541,51.13188647746244,2025-07-21
28.802808396868517,12.0,28.0,MCRC0001,51.25876460767947,51.3856427378965,2025-07-22
22.753187720888352,12.0,28.0,MCRC0001,51.51252086811352,51.63939899833055,2025-07-23
19.97477099634451,12.0,28.0,MCRC0001,51.76627712854758,51.89315525876461,2025-07-24
19.17335078720973,12.0,28.0,MCRC0001,52.02003338898164,52.14691151919867,2025-07-25
19.65391085447146,12.0,28.0,MCRC0001,52.27378964941569,52.40066777963272,2025-07-26
16.338771720224084,12.0,28.0,MCRC0001,52.52754590984975,52.65442404006678,2025-07-27
19.619189842967963,12.0,28.0,MCRC0001,52.78130217028381,52.90818030050084,2025-07-28
21.114734066908216,12.0,28.0,MCRC0001,53.03505843071786,53.16193656093489,2025-07-29
22.31816646229292,12.0,28.0,MCRC0001,53.28881469115192,53.41569282136895,2025-07-30
22.318759116577333,12.0,28.0,MCRC0001,53.54257095158598,53.669449081803,2025-07-31
18.90048981373626,12.0,28.0,MCRC0001,53.79632721202003,53.92320534223706,2025-08-01
14.33567098991228,12.0,28.0,MCRC0001,54.05008347245409,54.17696160267112,2025-08-02
17.32358949506622,12.0,28.0,MCRC0001,54.30383973288815,54.43071786310517,2025-08-03
26.44877217124955,12.0,28.0,MCRC0001,54.5575959933222,54.68447412353923,2025-08-04
23.58423325363979,12.0,28.0,MCRC0001,54.81135225375626,54.93823038397329,2025-08-05
21.478478345216697,12.0,28.0,MCRC0001,55.06510851419032,55.19198664440734,2025-08-06
16.954823020959505,12.0,28.0,MCRC0001,55.31886477462437,55.4457429048414,2025-08-07
20.014580619895117,12.0,28.0,MCRC0001,55.57262103505843,55.69949916527546,2025-08-08
14.977325257350072,12.0,28.0,MCRC0001,55.826377295492485,55.95325542570952,2025-08-09
17.792252497215706,12.0,28.0,MCRC0001,56.080133555926544,56.20701168614357,2025-08-10
19.01918663325922,12.0,28.0,MCRC0001,56.3338898163606,56.46076794657763,2025-08-11
18.55344027253915,12.0,28.0,MCRC0001,56.587646076794655,56.714524207011685,2025-08-12
23.826407724224048,12.0,28.0,MCRC0001,56.84140233722872,56.968280467445744,2025-08-13
14.32509634385819,12.0,28.0,MCRC0001,57.09515859766277,57.2220367278798,2025-08-14
16.538270913939385,12.0,28.0,MCRC0001,57.348914858096826,57.475792988313856,2025-08-15
14.501248115911125,12.0,28.0,MCRC0001,57.602671118530886,57.72954924874792,2025-08-16
15.050587149248583,12.0,28.0,MCRC0001,57.85642737896495,57.98330550918197,2025-08-17
20.496223585786595,12.0,28.0,MCRC0001,58.110183639399,58.23706176961603,2025-08-18
13.598237867774913,12.0,28.0,MCRC0001,58.363939899833056,58.490818030050086,2025-08-19
23.015475115350547,12.0,28.0,MCRC0001,58.61769616026711,58.74457429048414,2025-08-20
19.012736892235697,12.0,28.0,MCRC0001,58.87145242070117,58.9983305509182,2025-08-21
20.27515333010391,12.0,28.0,MCRC0001,59.12520868113523,59.25208681135226,2025-08-22
21.29030695198881,12.0,28.0,MCRC0001,59.37896494156928,59.50584307178631,2025-08-23
18.263333918993634,12.0,28.0,MCRC0001,59.63272120200334,59.75959933222037,2025-08-24
24.12991886301351,12.0,28.0,MCRC0001,59.8864774624374,60.01335559265443,2025-08-25
19.22262909308946,12.0,28.0,MCRC0001,60.14023372287145,60.26711185308848,2025-08-26
22.37628102095628,12.0,28.0,MCRC0001,60.39398998330551,60.52086811352254,2025-08-27
19.20355046897099,12.0,28.0,MCRC0001,60.64774624373957,60.77462437395659,2025-08-28
21.16349754969969,12.0,28.0,MCRC0001,60.90150250417362,61.02838063439065,2025-08-29
21.118650680631845,12.0,28.0,MCRC0001,61.15525876460768,61.28213689482471,2025-08-30
20.999879757822125,12.0,28.0,MCRC0001,61.40901502504174,61.53589315525876,2025-08-31
16.10276860151632,12.0,28.0,MCRC0001,61.66277128547579,61.78964941569282,2025-09-01
21.74350308218976,12.0,28.0,MCRC0001,61.91652754590985,62.04340567612688,2025-09-02
18.724172043601616,12.0,28.0,MCRC0001,62.1702838063439,62.29716193656093,2025-09-03
22.52195212195967,12.0,28.0,MCRC0001,62.42404006677796,62.55091819699499,2025-09-04
11.390026222350784,12.0,28.0,MCRC0001,62.67779632721202,62.80467445742905,2025-09-05
14.139535111780196,12.0,28.0,MCRC0001,62.93155258764608,63.058430717863104,2025-09-06
21.453782248540115,12.0,28.0,MCRC0001,63.18530884808013,63.31218697829716,2025-09-07
27.45171034042092,12.0,28.0,MCRC0001,63.43906510851419,63.56594323873122,2025-09-08
23.340234987244948,12.0,28.0,MCRC0001,63.692821368948245,63.81969949916528,2025-09-09
17.270196263200077,12.0,28.0,MCRC0001,63.946577629382304,64.07345575959933,2025-09-10
13.231790338488176,12.0,28.0,MCRC0001,64.20033388981636,64.32721202003339,2025-09-11
22.97074488464647,12.0,28.0,MCRC0001,64.45409015025042,64.58096828046745,2025-09-12
19.6776671118282,12.0,28.0,MCRC0001,64.70784641068447,64.8347245409015,2025-09-13
22.362816871577543,12.0,28.0,MCRC0001,64.96160267111853,65.08848080133556,2025-09-14
20.461194888843163,12.0,28.0,MCRC0001,65.21535893155259,65.34223706176962,2025-09-15
20.11857170048198,12.0,28.0,MCRC0001,65.46911519198665,65.59599332220367,2025-09-16
31.834501783572705,12.0,28.0,MCRC0001,65.7228714524207,65.84974958263773,2025-09-17
19.975480155817685,12.0,28.0,MCRC0001,65.97662771285476,66.10350584307179,2025-09-18
19.36301916298694,12.0,28.0,MCRC0001,66.23038397328881,66.35726210350585,2025-09-19
19.51420529838391,12.0,28.0,MCRC0001,66.48414023372287,66.6110183639399,2025-09-20
17.66585313316937,12.0,28.0,MCRC0001,66.73789649415693,66.86477462437395,2025-09-21
23.96053157886125,12.0,28.0,MCRC0001,66.99165275459099,67.11853088480801,2025-09-22
18.5849826648746,12.0,28.0,MCRC0001,67.24540901502505,67.37228714524207,2025-09-23
22.54377082257836,12.0,28.0,MCRC0001,67.49916527545909,67.62604340567613,2025-09-24
21.138412119254227,12.0,28.0,MCRC0001,67.75292153589315,67.87979966611019,2025-09-25
24.875943448529704,12.0,28.0,MCRC0001,68.00667779632721,68.13355592654425,2025-09-26
21.680718387953444,12.0,28.0,MCRC0001,68.26043405676127,68.38731218697829,2025-09-27
15.14646087620941,12.0,28.0,MCRC0001,68.51419031719533,68.64106844741235,2025-09-28
14.694048859784235,12.0,28.0,MCRC0001,68.76794657762939,68.89482470784641,2025-09-29
25.633476584307605,12.0,28.0,MCRC0001,69.02170283806343,69.14858096828047,2025-09-30
17.565156786942232,12.0,28.0,MCRC0001,69.27545909849749,69.40233722871453,2025-10-01
14.717589680841392,12.0,28.0,MCRC0001,69.52921535893155,69.65609348914857,2025-10-02
17.321525600520967,12.0,28.0,MCRC0001,69.78297161936561,69.90984974958263,2025-10-03
25.05850114787203,12.0,28.0,MCRC0001,70.03672787979967,70.1636060100167,2025-10-04
14.319148004205951,12.0,28.0,MCRC0001,70.29048414023373,70.41736227045075,2025-10-05
16.53401918496156,12.0,28.0,MCRC0001,70.54424040066777,70.67111853088481,2025-10-06
17.332769964813924,12.0,28.0,MCRC0001,70.79799666110183,70.92487479131887,2025-10-07
14.99524050610722,12.0,28.0,MCRC0001,71.0517529215359,71.17863105175292,2025-10-08
15.262690645953343,12.0,28.0,MCRC0001,71.30550918196995,71.43238731218698,2025-10-09
13.927568098945365,12.0,28.0,MCRC0001,71.55926544240401,71.68614357262103,2025-10-10
18.155250347453112,12.0,28.0,MCRC0001,71.81302170283806,71.9398998330551,2025-10-11
18.58036467303966,12.0,28.0,MCRC0001,72.06677796327212,72.19365609348915,2025-10-12
17.269847383186775,12.0,28.0,MCRC0001,72.32053422370618,72.44741235392321,2025-10-13
13.385208644129436,12.0,28.0,MCRC0001,72.57429048414023,72.70116861435726,2025-10-14
25.01334378742398,12.0,28.0,MCRC0001,72.8280467445743,72.95492487479132,2025-10-15
14.68368468331136,12.0,28.0,MCRC0001,73.08180300500835,73.20868113522538,2025-10-16
21.112134848091483,12.0,28.0,MCRC0001,73.3355592654424,73.46243739565944,2025-10-17
15.7009336275245,12.0,28.0,MCRC0001,73.58931552587646,73.7161936560935,2025-10-18
22.67326746696611,12.0,28.0,MCRC0001,73.84307178631052,73.96994991652754,2025-10-19
23.823329420668657,12.0,28.0,MCRC0001,74.09682804674458,74.2237061769616,2025-10-20
16.48954565348938,12.0,28.0,MCRC0001,74.35058430717864,74.47746243739566,2025-10-21
12.305137081211496,12.0,28.0,MCRC0001,74.60434056761268,74.73121869782972,2025-10-22
22.78314927655843,12.0,28.0,MCRC0001,74.85809682804674,74.98497495826378,2025-10-23
27.50320218685454,12.0,28.0,MCRC0001,75.1118530884808,75.23873121869784,2025-10-24
21.662778159569736,12.0,28.0,MCRC0001,75.36560934891486,75.49248747913188,2025-10-25
20.642177685918877,12.0,28.0,MCRC0001,75.61936560934892,75.74624373956594,2025-10-26
23.27904243844076,12.0,28.0,MCRC0001,75.87312186978298,76.0,2025-10-27
23.06021938398807,12.0,,MCRC0002,0.0,0.1168614357262103,2025-10-28
16.68404466495596,12.0,,MCRC0002,0.2337228714524207,0.350584307178631,2025-10-29
17.36339475721341,12.0,,MCRC0002,0.4674457429048414,0.5843071786310517,2025-10-30
22.444494200223644,12.0,,MCRC0002,0.7011686143572621,0.8180300500834724,2025-10-31
19.42394661007883,12.0,,MCRC0002,0.9348914858096828,1.0517529215358932,2025-11-01
25.26642238345421,12.0,,MCRC0002,1.1686143572621035,1.2854757929883138,2025-11-02
17.182631411484966,12.0,,MCRC0002,1.4023372287145242,1.5191986644407345,2025-11-03
23.00243966747393,12.0,,MCRC0002,1.6360601001669448,1.7529215358931554,2025-11-04
21.37055192547691,12.0,,MCRC0002,1.8697829716193657,1.986644407345576,2025-11-05
19.49424974516146,12.0,,MCRC0002,2.1035058430717863,2.2203672787979967,2025-11-06
24.703643087338428,12.0,,MCRC0002,2.337228714524207,2.4540901502504173,2025-11-07
22.72028613146972,12.0,,MCRC0002,2.570951585976628,2.687813021702838,2025-11-08
15.980131386471584,12.0,,MCRC0002,2.8046744574290483,2.921535893155258,2025-11-09
22.56087472167939,12.0,,MCRC0002,3.038397328881469,3.1552587646076797,2025-11-10
25.4999625259768,12.0,,MCRC0002,3.2721202003338896,3.3889816360601004,2025-11-11
19.478221244061505,12.0,,MCRC0002,3.5058430717863107,3.622704507512521,2025-11-12
19.005376598460103,12.0,,MCRC0002,3.7395659432387314,3.8564273789649417,2025-11-13
17.321411409425902,12.0,,MCRC0002,3.973288814691152,4.090150250417362,2025-11-14
19.9455844572986,12.0,,MCRC0002,4.207011686143573,4.323873121869783,2025-11-15
22.74480274421164,12.0,,MCRC0002,4.440734557595993,4.557595993322204,2025-11-16
16.72932680168501,12.0,,MCRC0002,4.674457429048414,4.791318864774625,2025-11-17
14.61456975705104,12.0,,MCRC0002,4.908180300500835,5.025041736227045,2025-11-18
18.49700035607229,12.0,,MCRC0002,5.141903171953255,5.258764607679466,2025-11-19
14.481100085365,12.0,,MCRC0002,5.375626043405676,5.492487479131887,2025-11-20
22.092873765130527,12.0,,MCRC0002,5.609348914858097,5.726210350584307,2025-11-21
18.2932409200248,12.0,,MCRC0002,5.843071786310517,5.959933222036728,2025-11-22
12.978392621796774,12.0,,MCRC0002,6.076794657762938,6.193656093489149,2025-11-23
18.60556994104596,12.0,,MCRC0002,6.310517529215359,6.427378964941569,2025-11-24
19.22954005682364,12.0,,MCRC0002,6.544240400667779,6.66110183639399,2025-11-25
21.796542453438867,12.0,,MCRC0002,6.777963272120201,6.894824707846411,2025-11-26
19.41854582738316,12.0,,MCRC0002,7.011686143572621,7.128547579298831,2025-11-27
27.474905827359237,12.0,,MCRC0002,7.245409015025042,7.362270450751252,2025-11-28
17.925184593844,12.0,,MCRC0002,7.479131886477463,7.595993322203673,2025-11-29
19.750405805670773,12.0,,MCRC0002,7.712854757929883,7.829716193656093,2025-11-30
19.58835754294932,12.0,,MCRC0002,7.946577629382304,8.063439065108515,2025-12-01
18.869486462371903,12.0,,MCRC0002,8.180300500834724,8.297161936560935,2025-12-02
20.56970234005176,12.0,,MCRC0002,8.414023372287145,8.530884808013356,2025-12-03
22.16492518879069,12.0,,MCRC0002,8.647746243739565,8.764607679465776,2025-12-04
25.36039481414574,12.0,,MCRC0002,8.881469115191987,8.998330550918197,2025-12-05
13.722975490422147,12.0,,MCRC0002,9.115191986644408,9.232053422370615,2025-12-06
17.95862850477552,12.0,,MCRC0002,9.348914858096828,9.46577629382304,2025-12-07
18.208914298591026,12.0,,MCRC0002,9.58263772954925,9.69949916527546,2025-12-08
23.751401189446824,12.0,,MCRC0002,9.81636060100167,9.93322203672788,2025-12-09
18.573347755706624,12.0,,MCRC0002,10.05008347245409,10.1669449081803,2025-12-10
12.419297627682724,12.0,,MCRC0002,10.28380634390651,10.40066777963272,2025-12-11
20.350921855466307,12.0,,MCRC0002,10.517529215358932,10.63439065108514,2025-12-12
19.865243073836243,12.0,,MCRC0002,10.751252086811352,10.868113522537564,2025-12-13
20.719006263085262,12.0,,MCRC0002,10.984974958263772,11.101836393989982,2025-12-14
15.839348476082073,12.0,,MCRC0002,11.218697829716191,11.335559265442404,2025-12-15
26.876138724338013,12.0,,MCRC0002,11.452420701168617,11.569282136894826,2025-12-16
18.70456086485861,12.0,,MCRC0002,11.686143572621036,11.803005008347244,2025-12-17
19.246812566025334,12.0,,MCRC0002,11.919866444073456,12.036727879799669,2025-12-18
16.39996572076336,12.0,,MCRC0002,12.153589315525876,12.270450751252088,2025-12-19
16.275991984501104,12.0,,MCRC0002,12.387312186978296,12.504173622704508,2025-12-20
15.109052161004858,12.0,,MCRC0002,12.621035058430715,12.737896494156928,2025-12-21
18.42675659287537,12.0,,MCRC0002,12.85475792988314,12.97161936560935,2025-12-22
16.169672644973463,12.0,,MCRC0002,13.088480801335558,13.20534223706177,2025-12-23
28.225869364900888,12.0,,MCRC0002,13.32220367278798,13.43906510851419,2025-12-24
12.44603047845274,12.0,,MCRC0002,13.555926544240402,13.67278797996661,2025-12-25
15.486677807272825,12.0,,MCRC0002,13.78964941569282,13.906510851419032,2025-12-26
18.39434228617194,12.0,,MCRC0002,14.023372287145245,14.140233722871452,2025-12-27
22.6939651123933,12.0,,MCRC0002,14.257095158597664,14.373956594323872,2025-12-28
18.34497247447975,12.0,,MCRC0002,14.490818030050084,14.607679465776291,2025-12-29
22.70385357201191,12.0,,MCRC0002,14.724540901502504,14.841402337228716,2025-12-30
16.052784442838714,12.0,,MCRC0002,14.958263772954924,15.075125208681134,2025-12-31
20.237164535578827,12.0,,MCRC0002,15.191986644407343,15.308848080133556,2026-01-01
26.976164348043334,12.0,,MCRC0002,15.425709515859769,15.542570951585976,2026-01-02
16.129022417202087,12.0,,MCRC0002,15.659432387312188,15.776293823038396,2026-01-03
21.67827070358158,12.0,,MCRC0002,15.893155258764608,16.01001669449082,2026-01-04
20.82771007713304,12.0,,MCRC0002,16.12687813021703,16.24373956594324,2026-01-05
10.99386005604852,12.0,,MCRC0002,16.360601001669448,16.47746243739566,2026-01-06
17.644117814117283,12.0,,MCRC0002,16.59432387312187,16.71118530884808,2026-01-07
24.52460762122396,12.0,,MCRC0002,16.82804674457429,16.9449081803005,2026-01-08
20.5403106899388,12.0,,MCRC0002,17.061769616026712,17.178631051752923,2026-01-09
15.150924148415744,12.0,,MCRC0002,17.29549248747913,17.41235392320534,2026-01-10
22.76310909166257,12.0,,MCRC0002,17.529215358931552,17.646076794657763,2026-01-11
18.08350821874259,12.0,,MCRC0002,17.762938230383973,17.879799666110184,2026-01-12
21.440202912323347,12.0,,MCRC0002,17.996661101836395,18.11352253756261,2026-01-13
21.507680457750524,12.0,,MCRC0002,18.230383973288816,18.347245409015024,2026-01-14
15.525217595417708,12.0,,MCRC0002,18.464106844741234,18.580968280467445,2026-01-15
23.1593121389372,12.0,,MCRC0002,18.697829716193656,18.814691151919867,2026-01-16
15.969964795059296,12.0,,MCRC0002,18.93155258764608,19.04841402337229,2026-01-17
14.77685653463344,12.0,,MCRC0002,19.1652754590985,19.282136894824703,2026-01-18
16.46868404911185,12.0,,MCRC0002,19.39899833055092,19.515859766277128,2026-01-19
18.615639864547223,12.0,,MCRC0002,19.63272120200334,19.74958263772955,2026-01-20
20.43761262576505,12.0,,MCRC0002,19.86644407345576,19.98330550918197,2026-01-21
16.90966507051024,12.0,,MCRC0002,20.10016694490818,20.21702838063439,2026-01-22
22.979277249580463,12.0,,MCRC0002,20.3338898163606,20.45075125208681,2026-01-23
21.005856736174376,12.0,,MCRC0002,20.56761268781302,20.684474123539232,2026-01-24
17.22080713957799,12.0,,MCRC0002,20.801335559265443,20.918196994991654,2026-01-25
23.55597167037942,12.0,,MCRC0002,21.035058430717864,21.151919866444075,2026-01-26
24.644273430585933,12.0,,MCRC0002,21.26878130217028,21.385642737896493,2026-01-27
19.605261212761945,12.0,,MCRC0002,21.502504173622704,21.619365609348915,2026-01-28
19.14006782014444,12.0,,MCRC0002,21.736227045075125,21.853088480801336,2026-01-29
12.904914586974591,12.0,,MCRC0002,21.969949916527547,22.08681135225376,2026-01-30
18.369949630434125,12.0,,MCRC0002,22.203672787979965,22.320534223706176,2026-01-31
18.83397314973854,12.0,,MCRC0002,22.437395659432383,22.5542570951586,2026-02-01
20.98151762903877,12.0,,MCRC0002,22.671118530884808,22.78797996661102,2026-02-02
19.32629427347811,12.0,,MCRC0002,22.90484140233723,23.02170283806344,2026-02-03
20.97610775256198,12.0,,MCRC0002,23.13856427378965,23.25542570951586,2026-02-04
67.67045144651932,50.0,,MCRC0002,23.37228714524207,23.48914858096828,2026-02-05
57.35042950683162,50.0,,MCRC0002,23.60601001669449,23.7228714524207,2026-02-06
57.54513858717077,50.0,,MCRC0002,23.839732888146912,23.956594323873123,2026-02-07
53.454173428487096,50.0,,MCRC0002,24.073455759599334,24.19031719532554,2026-02-08
59.95669766629207,50.0,,MCRC0002,24.30717863105175,24.42404006677796,2026-02-09
64.88406491234805,50.0,,MCRC0002,24.540901502504173,24.657762938230384,2026-02-10
51.24464825403816,50.0,,MCRC0002,24.774624373956595,24.89148580968281,2026-02-11
56.670715164903065,50.0,,MCRC0002,25.008347245409016,25.125208681135227,2026-02-12
60.17970251251959,50.0,,MCRC0002,25.242070116861434,25.358931552587645,2026-02-13
64.25051441762218,50.0,,MCRC0002,25.475792988313856,25.592654424040067,2026-02-14
61.91435119513432,50.0,,MCRC0002,25.70951585976628,25.826377295492488,2026-02-15
61.62731814091065,50.0,,MCRC0002,25.9432387312187,26.06010016694491,2026-02-16
58.8784360701455,50.0,,MCRC0002,26.17696160267112,26.293823038397328,2026-02-17
62.40937128509358,50.0,,MCRC0002,26.41068447412354,26.52754590984975,2026-02-18
65.0715194176673,50.0,,MCRC0002,26.64440734557596,26.76126878130217,2026-02-19
51.455041117253984,50.0,,MCRC0002,26.87813021702838,26.994991652754592,2026-02-20
63.64267700417567,50.0,,MCRC0002,27.111853088480803,27.22871452420701,2026-02-21
59.506200970666434,50.0,,MCRC0002,27.34557595993322,27.462437395659432,2026-02-22
57.35005567892743,50.0,,MCRC0002,27.579298831385643,27.696160267111853,2026-02-23
47.78462107060342,50.0,,MCRC0002,27.813021702838064,27.929883138564275,2026-02-24
53.0982433817285,50.0,,MCRC0002,28.04674457429049,28.163606010016693,2026-02-25
68.49029496123626,50.0,,MCRC0002,28.280467445742904,28.397328881469114,2026-02-26
56.55725733768223,50.0,,MCRC0002,28.514190317195325,28.631051752921536,2026-02-27
54.57615614373459,50.0,,MCRC0002,28.747913188647747,28.86477462437396,2026-02-28
57.71787021928204,50.0,,MCRC0002,28.98163606010017,29.098497495826376,2026-03-01
56.27426389070703,50.0,,MCRC0002,29.215358931552583,29.3322203672788,2026-03-02
60.62179316309458,50.0,,MCRC0002,29.449081803005008,29.56594323873122,2026-03-03
67.58486839123306,50.0,,MCRC0002,29.68280467445743,29.79966611018364,2026-03-04
57.06692024573893,50.0,,MCRC0002,29.91652754590985,30.03338898163606,2026-03-05
60.77145025275936,50.0,,MCRC0002,30.15025041736227,30.26711185308848,2026-03-06
54.26381429379882,50.0,,MCRC0002,30.38397328881469,30.5008347245409,2026-03-07
67.60083221103267,50.0,,MCRC0002,30.617696160267112,30.734557595993323,2026-03-08
60.94521721207055,50.0,,MCRC0002,30.851419031719534,30.968280467445744,2026-03-09
54.5909043835469,50.0,,MCRC0002,31.08514190317195,31.20200333889816,2026-03-10
64.52153110067322,50.0,,MCRC0002,31.318864774624373,31.435726210350584,2026-03-11
65.99993824291306,50.0,,MCRC0002,31.552587646076795,31.669449081803005,2026-03-12
60.80728181703818,50.0,,MCRC0002,31.786310517529216,31.903171953255427,2026-03-13
51.80301516229612,50.0,,MCRC0002,32.02003338898164,32.136894824707845,2026-03-14
68.92584406758237,50.0,,MCRC0002,32.25375626043406,32.37061769616027,2026-03-15
61.55061260313263,50.0,,MCRC0002,32.48747913188648,32.60434056761269,2026-03-16
65.85227148680727,50.0,,MCRC0002,32.721202003338895,32.83806343906511,2026-03-17
57.245533974414286,50.0,,MCRC0002,32.95492487479132,33.07178631051753,2026-03-18
58.0068803763305,50.0,,MCRC0002,33.18864774624374,33.30550918196995,2026-03-19
60.55226554645283,50.0,,MCRC0002,33.42237061769616,33.53923205342237,2026-03-20
65.5670083901794,50.0,,MCRC0002,33.65609348914858,33.77295492487479,2026-03-21
60.7149501408358,50.0,,MCRC0002,33.889816360601,34.00667779632721,2026-03-22
53.71583093733159,50.0,,MCRC0002,34.123539232053425,34.24040066777963,2026-03-23
61.30994598391671,50.0,,MCRC0002,34.357262103505846,34.47412353923205,2026-03-24
68.14767097255384,50.0,,MCRC0002,34.59098497495826,34.707846410684475,2026-03-25
60.32903141231416,50.0,,MCRC0002,34.82470784641068,34.941569282136896,2026-03-26
60.646927618882415,50.0,,MCRC0002,35.058430717863104,35.17529215358932,2026-03-27
53.6872812860809,50.0,,MCRC0002,35.292153589315525,35.40901502504174,2026-03-28
52.9850545613858,50.0,,MCRC0002,35.52587646076795,35.642737896494154,2026-03-29
56.81153930593379,50.0,,MCRC0002,35.75959933222037,35.876460767946575,2026-03-30
58.36741176690638,50.0,,MCRC0002,35.99332220367279,36.110183639399,2026-03-31
60.5203036750514,50.0,,MCRC0002,36.22704507512521,36.34390651085142,2026-04-01
60.82978487237089,50.0,,MCRC0002,36.46076794657763,36.57762938230384,2026-04-02
68.00953825508464,50.0,,MCRC0002,36.69449081803005,36.81135225375626,2026-04-03
60.29343719224955,50.0,,MCRC0002,36.92821368948247,37.04507512520868,2026-04-04
65.32211344205454,50.0,,MCRC0002,37.16193656093489,37.27879799666111,2026-04-05
59.80335332677542,50.0,,MCRC0002,37.39565943238731,37.51252086811352,2026-04-06
67.2445180581288,50.0,,MCRC0002,37.62938230383973,37.74624373956594,2026-04-07
50.648012606264,50.0,,MCRC0002,37.86310517529216,37.97996661101836,2026-04-08
57.006341166607854,50.0,,MCRC0002,38.09682804674458,38.213689482470784,2026-04-09
64.91516698129621,50.0,,MCRC0002,38.330550918197,38.447412353923205,2026-04-10
59.14201997371642,50.0,,MCRC0002,38.56427378964941,38.68113522537563,2026-04-11
64.65764806693983,50.0,,MCRC0002,38.79799666110184,38.91485809682805,2026-04-12
61.92533051388636,50.0,,MCRC0002,39.031719532554256,39.14858096828047,2026-04-13
64.72938491856517,50.0,,MCRC0002,39.26544240400668,39.38230383973289,2026-04-14
63.06533864014422,50.0,,MCRC0002,39.4991652754591,39.616026711185306,2026-04-15
63.36824466906875,50.0,,MCRC0002,39.73288814691152,39.84974958263773,2026-04-16
67.46227693575776,50.0,,MCRC0002,39.96661101836394,40.08347245409015,2026-04-17
64.9323700935047,50.0,,MCRC0002,40.20033388981636,40.31719532554257,2026-04-18
64.96903353568204,50.0,,MCRC0002,40.43405676126878,40.55091819699499,2026-04-19
60.102093793927885,50.0,,MCRC0002,40.6677796327212,40.78464106844741,2026-04-20
57.09074895091564,50.0,,MCRC0002,40.90150250417362,41.01836393989984,2026-04-21
56.70219955863852,50.0,,MCRC0002,41.13522537562604,41.25208681135226,2026-04-22
63.754722985948405,50.0,,MCRC0002,41.368948247078464,41.48580968280467,2026-04-23
47.80769717977488,50.0,,MCRC0002,41.602671118530886,41.71953255425709,2026-04-24
53.46410905847857,50.0,,MCRC0002,41.83639398998331,41.95325542570952,2026-04-25
55.18373157060605,50.0,,MCRC0002,42.07011686143573,42.186978297161936,2026-04-26
58.76189310653192,50.0,,MCRC0002,42.30383973288815,42.42070116861436,2026-04-27
46.84280981595833,50.0,,MCRC0002,42.537562604340565,42.65442404006678,2026-04-28
66.29360651294667,50.0,,MCRC0002,42.771285475792986,42.8881469115192,2026-04-29
63.00087618164797,50.0,,MCRC0002,43.00500834724541,43.12186978297162,2026-04-30
69.92291199229282,50.0,,MCRC0002,43.23873121869783,43.35559265442404,2026-05-01
65.3110723446139,50.0,,MCRC0002,43.47245409015025,43.58931552587646,2026-05-02
65.15189665576014,50.0,,MCRC0002,43.70617696160267,43.82303839732888,2026-05-03
71.25338015515433,50.0,,MCRC0002,43.93989983305509,44.0567612687813,2026-05-04
57.14520956571285,50.0,,MCRC0002,44.17362270450752,44.29048414023372,2026-05-05
52.48270800375303,50.0,,MCRC0002,44.40734557595993,44.524207011686144,2026-05-06
58.8382130175363,50.0,,MCRC0002,44.64106844741235,44.757929883138566,2026-05-07
55.8750397307642,50.0,,MCRC0002,44.87479131886477,44.99165275459099,2026-05-08
58.71577319487776,50.0,,MCRC0002,45.1085141903172,45.22537562604341,2026-05-09
54.748905048709545,50.0,,MCRC0002,45.342237061769616,45.45909849749582,2026-05-10
62.83940033726999,50.0,,MCRC0002,45.57595993322204,45.692821368948245,2026-05-11
62.56491424799362,50.0,,MCRC0002,45.80968280467446,45.926544240400666,2026-05-12
59.86538704715864,50.0,,MCRC0002,46.04340567612688,46.16026711185309,2026-05-13
61.5579075169144,50.0,,MCRC0002,46.2771285475793,46.39398998330551,2026-05-14
59.28974636435409,50.0,,MCRC0002,46.51085141903172,46.62771285475793,2026-05-15
12.256101004801844,4.0,,MCRC0002,46.74457429048414,46.86143572621035,2026-05-16
10.208922248456068,4.0,,MCRC0002,46.97829716193656,47.09515859766277,2026-05-17
9.20366312531268,4.0,,MCRC0002,47.21202003338898,47.32888146911519,2026-05-18
12.788753409828132,4.0,,MCRC0002,47.4457429048414,47.56260434056761,2026-05-19
13.782463807680283,4.0,,MCRC0002,47.679465776293824,47.79632721202003,2026-05-20
14.012361476923637,4.0,,MCRC0002,47.913188647746246,48.03005008347245,2026-05-21
7.029175932041554,4.0,,MCRC0002,48.14691151919867,48.26377295492488,2026-05-22
8.396658375874907,4.0,,MCRC0002,48.38063439065108,48.497495826377296,2026-05-23
4.895511715756924,4.0,,MCRC0002,48.6143572621035,48.73121869782972,2026-05-24
9.28430494538918,4.0,,MCRC0002,48.848080133555925,48.96494156928214,2026-05-25
11.248371443432877,4.0,,MCRC0002,49.08180300500835,49.19866444073456,2026-05-26
9.601596476464076,4.0,,MCRC0002,49.31552587646077,49.432387312186975,2026-05-27
15.792552601144903,4.0,,MCRC0002,49.54924874791319,49.6661101836394,2026-05-28
8.78246987466593,4.0,,MCRC0002,49.78297161936561,49.89983305509182,2026-05-29
6.734474333533212,4.0,,MCRC0002,50.01669449081803,50.13355592654424,2026-05-30
11.705512620003628,4.0,,MCRC0002,50.25041736227045,50.36727879799666,2026-05-31
10.44980148549448,4.0,,MCRC0002,50.48414023372287,50.60100166944908,2026-06-01
11.648927787401156,4.0,,MCRC0002,50.71786310517529,50.834724540901504,2026-06-02
10.91136379235857,4.0,,MCRC0002,50.95158597662771,51.068447412353926,2026-06-03
10.73129728159262,4.0,,MCRC0002,51.18530884808013,51.30217028380634,2026-06-04
3.633103350872225,4.0,,MCRC0002,51.41903171953256,51.53589315525876,2026-06-05
7.821657917447962,4.0,,MCRC0002,51.652754590984976,51.769616026711184,2026-06-06
8.229025246141408,4.0,,MCRC0002,51.8864774624374,52.003338898163605,2026-06-07
8.95610698619522,4.0,,MCRC0002,52.12020033388982,52.23706176961603,2026-06-08
8.654825084617176,4.0,,MCRC0002,52.35392320534224,52.47078464106845,2026-06-09
11.238456285063071,4.0,,MCRC0002,52.587646076794655,52.70450751252087,2026-06-10
11.802647526076058,4.0,,MCRC0002,52.82136894824708,52.93823038397329,2026-06-11
6.605077219746542,4.0,,MCRC0002,53.0550918196995,53.17195325542571,2026-06-12
12.060413220384032,4.0,,MCRC0002,53.28881469115192,53.40567612687813,2026-06-13
11.757304416001212,4.0,,MCRC0002,53.52253756260434,53.63939899833055,2026-06-14
11.39731019811465,4.0,,MCRC0002,53.75626043405676,53.87312186978297,2026-06-15
5.746316535910992,4.0,,MCRC0002,53.98998330550919,54.10684474123539,2026-06-16
11.321746900866998,4.0,,MCRC0002,54.223706176961606,54.34056761268781,2026-06-17
10.24778625860881,4.0,,MCRC0002,54.45742904841402,54.57429048414024,2026-06-18
12.882640225641532,4.0,,MCRC0002,54.69115191986644,54.80801335559266,2026-06-19
15.35307038590391,4.0,,MCRC0002,54.924874791318864,55.04173622704508,2026-06-20
14.764203656782788,4.0,,MCRC0002,55.158597662771285,55.27545909849749,2026-06-21
10.337932516719784,4.0,,MCRC0002,55.39232053422371,55.50918196994992,2026-06-22
9.994375924822688,4.0,,MCRC0002,55.62604340567613,55.742904841402336,2026-06-23
11.895844852028,4.0,,MCRC0002,55.85976627712855,55.97662771285476,2026-06-24
6.654880139741679,4.0,,MCRC0002,56.09348914858097,56.21035058430718,2026-06-25
5.647950575185599,4.0,,MCRC0002,56.327212020033386,56.4440734557596,2026-06-26
8.582408223925004,4.0,,MCRC0002,56.56093489148581,56.67779632721202,2026-06-27
13.661706741143584,4.0,,MCRC0002,56.79465776293823,56.91151919866444,2026-06-28
9.006615105152585,4.0,,MCRC0002,57.02838063439065,57.14524207011687,2026-06-29
14.507742717428306,4.0,,MCRC0002,57.26210350584307,57.37896494156928,2026-06-30
1.6356613507449929,4.0,,MCRC0002,57.49582637729549,57.6126878130217,2026-07-01
5.238380719637108,4.0,,MCRC0002,57.72954924874792,57.84641068447412,2026-07-02
9.628933801432902,4.0,,MCRC0002,57.96327212020034,58.080133555926544,2026-07-03
12.664583624022626,4.0,,MCRC0002,58.19699499165275,58.313856427378965,2026-07-04
9.791130703839722,4.0,,MCRC0002,58.43071786310517,58.54757929883139,2026-07-05
9.7130417665201,4.0,,MCRC0002,58.6644407345576,58.78130217028381,2026-07-06
9.634775514228725,4.0,,MCRC0002,58.898163606010016,59.01502504173623,2026-07-07
4.7113067967967766,4.0,,MCRC0002,59.13188647746244,59.248747913188645,2026-07-08
13.474206623319558,4.0,,MCRC0002,59.36560934891486,59.482470784641066,2026-07-09
7.951705840487886,4.0,,MCRC0002,59.59933222036728,59.71619365609349,2026-07-10
13.26859797164336,4.0,,MCRC0002,59.8330550918197,59.94991652754591,2026-07-11
9.78842974611295,4.0,,MCRC0002,60.06677796327212,60.18363939899833,2026-07-12
13.204481161987244,4.0,,MCRC0002,60.30050083472454,60.41736227045075,2026-07-13
11.029773942932698,4.0,,MCRC0002,60.53422370617696,60.65108514190317,2026-07-14
9.679976528325271,4.0,,MCRC0002,60.76794657762938,60.8848080133556,2026-07-15
10.678784941206109,4.0,,MCRC0002,61.0016694490818,61.11853088480802,2026-07-16
5.581067172665271,4.0,,MCRC0002,61.235392320534224,61.35225375626043,2026-07-17
10.018087981513103,4.0,,MCRC0002,61.469115191986646,61.58597662771285,2026-07-18
15.148120966336393,4.0,,MCRC0002,61.70283806343907,61.81969949916528,2026-07-19
13.924580691966144,4.0,,MCRC0002,61.93656093489149,62.053422370617696,2026-07-20
7.044929251905783,4.0,,MCRC0002,62.1702838063439,62.28714524207012,2026-07-21
11.51705755401377,4.0,,MCRC0002,62.404006677796325,62.52086811352254,2026-07-22
10.743939654242617,4.0,,MCRC0002,62.637729549248746,62.75459098497496,2026-07-23
12.451564840352225,4.0,,MCRC0002,62.87145242070117,62.98831385642738,2026-07-24
10.282458656566636,4.0,,MCRC0002,63.10517529215359,63.2220367278798,2026-07-25
9.2994880206097,4.0,,MCRC0002,63.33889816360601,63.45575959933222,2026-07-26
13.991892329081946,4.0,,MCRC0002,63.57262103505843,63.68948247078464,2026-07-27
10.64918970481603,4.0,,MCRC0002,63.80634390651085,63.92320534223706,2026-07-28
13.766392965838945,4.0,,MCRC0002,64.04006677796328,64.15692821368948,2026-07-29
12.923158610033482,4.0,,MCRC0002,64.27378964941569,64.3906510851419,2026-07-30
9.026538275443276,4.0,,MCRC0002,64.50751252086812,64.62437395659433,2026-07-31
9.49899917692852,4.0,,MCRC0002,64.74123539232053,64.85809682804674,2026-08-01
15.789497301997066,4.0,,MCRC0002,64.97495826377296,65.09181969949917,2026-08-02
10.574446976319736,4.0,,MCRC0002,65.20868113522538,65.32554257095158,2026-08-03
7.724114729919927,4.0,,MCRC0002,65.44240400667779,65.55926544240401,2026-08-04
6.39987016604493,4.0,,MCRC0002,65.67612687813022,65.79298831385643,2026-08-05
12.92239730577327,4.0,,MCRC0002,65.90984974958263,66.02671118530886,2026-08-06
10.48088116328882,4.0,,MCRC0002,66.14357262103506,66.26043405676127,2026-08-07
7.623724148413049,4.0,,MCRC0002,66.37729549248748,66.49415692821368,2026-08-08
12.023754493709877,4.0,,MCRC0002,66.6110183639399,66.72787979966611,2026-08-09
10.479246085167764,4.0,,MCRC0002,66.84474123539232,66.96160267111853,2026-08-10
5.018574787711129,4.0,,MCRC0002,67.07846410684473,67.19532554257096,2026-08-11
11.766056664132435,4.0,,MCRC0002,67.31218697829716,67.42904841402337,2026-08-12
13.9995721085297,4.0,,MCRC0002,67.54590984974958,67.6627712854758,2026-08-13
17.67955069189741,4.0,,MCRC0002,67.779632721202,67.89649415692821,2026-08-14
10.104707692186013,4.0,,MCRC0002,68.01335559265442,68.13021702838063,2026-08-15
10.69794897463164,4.0,,MCRC0002,68.24707846410685,68.36393989983306,2026-08-16
14.819790415704412,4.0,,MCRC0002,68.48080133555926,68.59766277128547,2026-08-17
10.506166800809437,4.0,,MCRC0002,68.71452420701169,68.8313856427379,2026-08-18
10.826025589239768,4.0,,MCRC0002,68.9482470784641,69.06510851419031,2026-08-19
8.108144825708273,4.0,,MCRC0002,69.18196994991652,69.29883138564274,2026-08-20
5.816874661860432,4.0,,MCRC0002,69.41569282136895,69.53255425709516,2026-08-21
12.738063807459566,4.0,,MCRC0002,69.64941569282136,69.76627712854759,2026-08-22
6.179289289563268,4.0,,MCRC0002,69.88313856427379,70.0,2026-08-23
24.56262497178985,,28.0,MCRC0003,0.0,0.2170283806343906,2026-08-24
16.84733776444936,,28.0,MCRC0003,0.4340567612687813,0.6510851419031719,2026-08-25
21.060935833593195,,28.0,MCRC0003,0.8681135225375626,1.0851419031719534,2026-08-26
18.510913074566854,,28.0,MCRC0003,1.3021702838063438,1.5191986644407345,2026-08-27
24.698400951829363,,28.0,MCRC0003,1.7362270450751252,1.953255425709516,2026-08-28
21.203385608826324,,28.0,MCRC0003,2.1702838063439067,2.387312186978297,2026-08-29
27.836381410028565,,28.0,MCRC0003,2.604340567612688,2.8213689482470783,2026-08-30
15.665289282561671,,28.0,MCRC0003,3.038397328881469,3.25542570951586,2026-08-31
21.655452326143028,,28.0,MCRC0003,3.4724540901502503,3.689482470784641,2026-09-01
20.189367523628533,,28.0,MCRC0003,3.906510851419032,4.123539232053423,2026-09-02
21.11977428502769,,28.0,MCRC0003,4.340567612687813,4.557595993322204,2026-09-03
26.3836846864418,,28.0,MCRC0003,4.774624373956594,4.991652754590985,2026-09-04
22.341272120369144,,28.0,MCRC0003,5.208681135225375,5.425709515859766,2026-09-05
15.409898365291172,,28.0,MCRC0003,5.642737896494157,5.859766277128547,2026-09-06
22.13404327335932,,28.0,MCRC0003,6.076794657762938,6.293823038397329,2026-09-07
18.337522495377,,28.0,MCRC0003,6.510851419031719,6.72787979966611,2026-09-08
18.10658011971684,,28.0,MCRC0003,6.944908180300501,7.161936560934891,2026-09-09
24.18342931213348,,28.0,MCRC0003,7.378964941569282,7.595993322203673,2026-09-10
17.590640067895087,,28.0,MCRC0003,7.813021702838063,8.030050083472455,2026-09-11
18.481078689679457,,28.0,MCRC0003,8.247078464106846,8.464106844741236,2026-09-12
20.12962901761548,,28.0,MCRC0003,8.681135225375627,8.898163606010018,2026-09-13
23.784743586981552,,28.0,MCRC0003,9.115191986644408,9.332220367278795,2026-09-14
22.32635921144476,,28.0,MCRC0003,9.549248747913188,9.766277128547578,2026-09-15
19.06234035232852,,28.0,MCRC0003,9.98330550918197,10.20033388981636,2026-09-16
18.911294137250422,,28.0,MCRC0003,10.41736227045075,10.63439065108514,2026-09-17
15.359481353865885,,28.0,MCRC0003,10.851419031719532,11.068447412353922,2026-09-18
16.96065964562935,,28.0,MCRC0003,11.285475792988311,11.502504173622704,2026-09-19
17.38247565671803,,28.0,MCRC0003,11.719532554257096,11.936560934891483,2026-09-20
19.402836233010216,,28.0,MCRC0003,12.153589315525876,12.370617696160268,2026-09-21
27.947052148676647,,28.0,MCRC0003,12.587646076794655,12.804674457429048,2026-09-22
17.29812226485427,,28.0,MCRC0003,13.02170283806344,13.23873121869783,2026-09-23
18.816683728377445,,28.0,MCRC0003,13.45575959933222,13.67278797996661,2026-09-24
11.790406380093575,,28.0,MCRC0003,13.889816360601,14.106844741235392,2026-09-25
22.40228437724203,,28.0,MCRC0003,14.323873121869784,14.540901502504171,2026-09-26
13.690204824691978,,28.0,MCRC0003,14.757929883138564,14.974958263772956,2026-09-27
16.37364191134257,,28.0,MCRC0003,15.191986644407343,15.409015025041736,2026-09-28
24.16934147376397,,28.0,MCRC0003,15.626043405676128,15.843071786310515,2026-09-29
11.58028628168415,,28.0,MCRC0003,16.06010016694491,16.2771285475793,2026-09-30
20.38368164958096,,28.0,MCRC0003,16.49415692821369,16.71118530884808,2026-10-01
23.203718586660507,,28.0,MCRC0003,16.928213689482472,17.14524207011686,2026-10-02
26.10177694576111,,28.0,MCRC0003,17.362270450751254,17.579298831385643,2026-10-03
16.319627566041547,,28.0,MCRC0003,17.796327212020035,18.013355592654424,2026-10-04
17.50390059904054,,28.0,MCRC0003,18.230383973288816,18.447412353923205,2026-10-05
27.21774529361041,,28.0,MCRC0003,18.664440734557594,18.881469115191987,2026-10-06
19.899759421673608,,28.0,MCRC0003,19.098497495826376,19.315525876460768,2026-10-07
17.054944262921314,,28.0,MCRC0003,19.53255425709516,19.74958263772955,2026-10-08
17.130056650771092,,28.0,MCRC0003,19.96661101836394,20.18363939899833,2026-10-09
16.10977470573014,,28.0,MCRC0003,20.40066777963272,20.617696160267112,2026-10-10
18.24131117829603,,28.0,MCRC0003,20.8347245409015,21.051752921535893,2026-10-11
24.35288190579738,,28.0,MCRC0003,21.26878130217028,21.485809682804675,2026-10-12
23.551064274293854,,28.0,MCRC0003,21.702838063439064,21.919866444073456,2026-10-13
15.302918788698625,,28.0,MCRC0003,22.136894824707845,22.35392320534224,2026-10-14
20.85834429881694,,28.0,MCRC0003,22.570951585976623,22.78797996661102,2026-10-15
18.39136105970993,,28.0,MCRC0003,23.005008347245408,23.2220367278798,2026-10-16
23.129761616417767,,28.0,MCRC0003,23.43906510851419,23.65609348914858,2026-10-17
19.374561091082803,,28.0,MCRC0003,23.87312186978297,24.090150250417363,2026-10-18
21.486098727199067,,28.0,MCRC0003,24.30717863105175,24.524207011686144,2026-10-19
19.365579172166,,28.0,MCRC0003,24.741235392320533,24.958263772954925,2026-10-20
11.25165627744711,,28.0,MCRC0003,25.175292153589314,25.392320534223707,2026-10-21
20.188009781474577,,28.0,MCRC0003,25.609348914858096,25.826377295492488,2026-10-22
14.913012201879653,,28.0,MCRC0003,26.04340567612688,26.26043405676127,2026-10-23
22.988513646707364,,28.0,MCRC0003,26.47746243739566,26.69449081803005,2026-10-24
17.280688430400847,,28.0,MCRC0003,26.91151919866444,27.128547579298832,2026-10-25
17.579949375708043,,28.0,MCRC0003,27.34557595993322,27.562604340567614,2026-10-26
19.96438869995079,,28.0,MCRC0003,27.779632721202,27.996661101836395,2026-10-27
22.311175816897524,,28.0,MCRC0003,28.213689482470784,28.430717863105176,2026-10-28
19.321024728803486,,28.0,MCRC0003,28.647746243739565,28.86477462437396,2026-10-29
26.56873108818008,,28.0,MCRC0003,29.081803005008343,29.29883138564274,2026-10-30
26.595271445943236,,28.0,MCRC0003,29.515859766277128,29.73288814691152,2026-10-31
26.861874368679963,,28.0,MCRC0003,29.94991652754591,30.1669449081803,2026-11-01
19.06272510176493,,28.0,MCRC0003,30.38397328881469,30.601001669449083,2026-11-02
14.07216617558858,,28.0,MCRC0003,30.818030050083472,31.035058430717864,2026-11-03
24.88031405695312,,28.0,MCRC0003,31.252086811352253,31.46911519198665,2026-11-04
18.33461885880089,,28.0,MCRC0003,31.686143572621035,31.903171953255427,2026-11-05
20.15266524800803,,28.0,MCRC0003,32.12020033388982,32.33722871452421,2026-11-06
22.51328041142068,,28.0,MCRC0003,32.5542570951586,32.771285475792986,2026-11-07
13.582254397949391,,28.0,MCRC0003,32.98831385642738,33.20534223706177,2026-11-08
26.51648482132999,,28.0,MCRC0003,33.42237061769616,33.63939899833055,2026-11-09
23.49984931641323,,28.0,MCRC0003,33.856427378964945,34.073455759599334,2026-11-10
21.40908632828589,,28.0,MCRC0003,34.29048414023372,34.50751252086811,2026-11-11
23.56366700191477,,28.0,MCRC0003,34.72454090150251,34.941569282136896,2026-11-12
22.22781015730939,,28.0,MCRC0003,35.158597662771285,35.375626043405674,2026-11-13
20.46731246227631,,28.0,MCRC0003,35.59265442404007,35.80968280467446,2026-11-14
18.76890271142176,,28.0,MCRC0003,36.02671118530885,36.24373956594324,2026-11-15
17.04343090257687,,28.0,MCRC0003,36.46076794657763,36.67779632721202,2026-11-16
21.14885712361347,,28.0,MCRC0003,36.89482470784641,37.1118530884808,2026-11-17
21.444812239086698,,28.0,MCRC0003,37.32888146911519,37.545909849749584,2026-11-18
24.3327952107528,,28.0,MCRC0003,37.76293823038397,37.97996661101836,2026-11-19
20.802640034876788,,28.0,MCRC0003,38.19699499165275,38.41402337228715,2026-11-20
16.587193936877757,,28.0,MCRC0003,38.631051752921536,38.848080133555925,2026-11-21
13.695068610413376,,28.0,MCRC0003,39.06510851419032,39.28213689482471,2026-11-22
19.48975135196028,,28.0,MCRC0003,39.4991652754591,39.71619365609349,2026-11-23
19.890166493241715,,28.0,MCRC0003,39.93322203672788,40.15025041736227,2026-11-24
19.607633668825603,,28.0,MCRC0003,40.36727879799666,40.58430717863105,2026-11-25
13.877948410577504,,28.0,MCRC0003,40.80133555926544,41.01836393989984,2026-11-26
24.29786056214203,,28.0,MCRC0003,41.235392320534224,41.45242070116861,2026-11-27
24.29051898493513,,28.0,MCRC0003,41.669449081803,41.8864774624374,2026-11-28
16.706859341542035,,28.0,MCRC0003,42.10350584307179,42.320534223706176,2026-11-29
23.223928446488618,,28.0,MCRC0003,42.537562604340565,42.75459098497496,2026-11-30
23.811323447246625,,28.0,MCRC0003,42.97161936560935,43.18864774624374,2026-12-01
60.19223538323846,,70.0,MCRC0003,43.40567612687813,43.62270450751252,2026-12-02
55.25750686902961,,70.0,MCRC0003,43.83973288814691,44.0567612687813,2026-12-03
68.06690767630512,,70.0,MCRC0003,44.27378964941569,44.490818030050086,2026-12-04
61.90460716886113,,70.0,MCRC0003,44.70784641068448,44.924874791318864,2026-12-05
58.74481272393979,,70.0,MCRC0003,45.14190317195325,45.35893155258765,2026-12-06
63.86422697836454,,70.0,MCRC0003,45.57595993322204,45.792988313856426,2026-12-07
68.11104243925075,,70.0,MCRC0003,46.010016694490815,46.22704507512521,2026-12-08
57.51419926655567,,70.0,MCRC0003,46.4440734557596,46.66110183639399,2026-12-09
63.457112726283945,,70.0,MCRC0003,46.87813021702838,47.09515859766277,2026-12-10
69.71580085362353,,70.0,MCRC0003,47.31218697829716,47.52921535893155,2026-12-11
54.4171758288226,,70.0,MCRC0003,47.74624373956594,47.96327212020034,2026-12-12
57.25373205635969,,70.0,MCRC0003,48.180300500834726,48.39732888146912,2026-12-13
57.01072459703897,,70.0,MCRC0003,48.6143572621035,48.8313856427379,2026-12-14
59.2083643147539,,70.0,MCRC0003,49.04841402337229,49.26544240400668,2026-12-15
58.95013132057903,,70.0,MCRC0003,49.482470784641066,49.69949916527546,2026-12-16
61.50397719683525,,70.0,MCRC0003,49.91652754590985,50.13355592654424,2026-12-17
55.89812239932631,,70.0,MCRC0003,50.35058430717863,50.56761268781303,2026-12-18
56.886682555595534,,70.0,MCRC0003,50.78464106844741,51.0016694490818,2026-12-19
61.50645241991288,,70.0,MCRC0003,51.21869782971619,51.43572621035059,2026-12-20
60.77455929866855,,70.0,MCRC0003,51.652754590984976,51.869782971619365,2026-12-21
64.370399045801,,70.0,MCRC0003,52.08681135225376,52.30383973288815,2026-12-22
62.046775124628205,,70.0,MCRC0003,52.52086811352254,52.73789649415693,2026-12-23
63.859233177803816,,70.0,MCRC0003,52.95492487479132,53.17195325542571,2026-12-24
54.2852398022925,,70.0,MCRC0003,53.3889816360601,53.60601001669449,2026-12-25
58.08291844442108,,70.0,MCRC0003,53.82303839732888,54.04006677796328,2026-12-26
69.24189975441723,,70.0,MCRC0003,54.257095158597664,54.47412353923205,2026-12-27
61.96039023275835,,70.0,MCRC0003,54.69115191986644,54.90818030050084,2026-12-28
63.73696480773158,,70.0,MCRC0003,55.12520868113523,55.342237061769616,2026-12-29
61.36367368581397,,70.0,MCRC0003,55.559265442404005,55.7762938230384,2026-12-30
62.12667928464393,,70.0,MCRC0003,55.99332220367279,56.21035058430718,2026-12-31
58.84547974235913,,70.0,MCRC0003,56.42737896494157,56.64440734557596,2027-01-01
77.85789609013156,,70.0,MCRC0003,56.86143572621035,57.07846410684474,2027-01-02
58.01922038795151,,70.0,MCRC0003,57.29549248747913,57.51252086811352,2027-01-03
59.80839391128424,,70.0,MCRC0003,57.72954924874792,57.946577629382304,2027-01-04
47.87581837272376,,70.0,MCRC0003,58.16360601001669,58.38063439065108,2027-01-05
65.53133328797361,,70.0,MCRC0003,58.59766277128548,58.81469115191987,2027-01-06
57.23873525157536,,70.0,MCRC0003,59.031719532554256,59.248747913188645,2027-01-07
59.69602946994179,,70.0,MCRC0003,59.46577629382304,59.68280467445743,2027-01-08
57.35979724559084,,70.0,MCRC0003,59.89983305509182,60.11686143572621,2027-01-09
59.30658527362577,,70.0,MCRC0003,60.3338898163606,60.55091819699499,2027-01-10
58.57876450789685,,70.0,MCRC0003,60.76794657762938,60.98497495826377,2027-01-11
59.78479112109676,,70.0,MCRC0003,61.202003338898166,61.41903171953256,2027-01-12
59.73599258673077,,70.0,MCRC0003,61.636060100166944,61.85308848080133,2027-01-13
59.22897344257058,,70.0,MCRC0003,62.07011686143573,62.28714524207012,2027-01-14
59.1606138672686,,70.0,MCRC0003,62.504173622704506,62.721202003338895,2027-01-15
66.54259226163009,,70.0,MCRC0003,62.93823038397329,63.15525876460768,2027-01-16
64.40708459879629,,70.0,MCRC0003,63.37228714524207,63.58931552587646,2027-01-17
64.43721159223296,,70.0,MCRC0003,63.80634390651085,64.02337228714524,2027-01-18
56.33775559444112,,70.0,MCRC0003,64.24040066777964,64.45742904841403,2027-01-19
66.28410415924182,,70.0,MCRC0003,64.67445742904842,64.8914858096828,2027-01-20
65.65822254597944,,70.0,MCRC0003,65.1085141903172,65.32554257095158,2027-01-21
57.232978355992174,,70.0,MCRC0003,65.54257095158597,65.75959933222036,2027-01-22
67.61926008599902,,70.0,MCRC0003,65.97662771285476,66.19365609348915,2027-01-23
56.583870285001055,,70.0,MCRC0003,66.41068447412354,66.62771285475793,2027-01-24
50.78984080797461,,70.0,MCRC0003,66.84474123539232,67.06176961602671,2027-01-25
65.50762993076586,,70.0,MCRC0003,67.2787979966611,67.49582637729549,2027-01-26
59.40240609784962,,70.0,MCRC0003,67.71285475792989,67.92988313856428,2027-01-27
64.88460782287491,,70.0,MCRC0003,68.14691151919867,68.36393989983306,2027-01-28
56.228989186379046,,70.0,MCRC0003,68.58096828046745,68.79799666110183,2027-01-29
53.69114994126479,,70.0,MCRC0003,69.01502504173622,69.23205342237061,2027-01-30
66.15935894311986,,70.0,MCRC0003,69.44908180300501,69.6661101836394,2027-01-31
52.96365718302116,,70.0,MCRC0003,69.88313856427379,70.10016694490818,2027-02-01
52.19484744281319,,70.0,MCRC0003,70.31719532554257,70.53422370617696,2027-02-02
50.37206554617824,,70.0,MCRC0003,70.75125208681135,70.96828046744574,2027-02-03
46.0276385084621,,70.0,MCRC0003,71.18530884808014,71.40233722871453,2027-02-04
54.80447808367805,,70.0,MCRC0003,71.61936560934892,71.8363939899833,2027-02-05
49.15296020793981,,70.0,MCRC0003,72.0534223706177,72.27045075125208,2027-02-06
59.821972576950856,,70.0,MCRC0003,72.48747913188647,72.70450751252086,2027-02-07
48.81791324837676,,70.0,MCRC0003,72.92153589315527,73.13856427378965,2027-02-08
54.52863290412005,,70.0,MCRC0003,73.35559265442404,73.57262103505843,2027-02-09
71.66030998104829,,70.0,MCRC0003,73.78964941569282,74.00667779632721,2027-02-10
61.72562120306036,,70.0,MCRC0003,74.2237061769616,74.44073455759599,2027-02-11
60.26402837703864,,70.0,MCRC0003,74.65776293823038,74.87479131886478,2027-02-12
51.89624009840071,,70.0,MCRC0003,75.09181969949917,75.30884808013356,2027-02-13
58.77201167025614,,70.0,MCRC0003,75.52587646076795,75.74290484140234,2027-02-14
60.240542815683085,,70.0,MCRC0003,75.95993322203672,76.17696160267111,2027-02-15
51.9740960210647,,70.0,MCRC0003,76.3939899833055,76.6110183639399,2027-02-16
60.63090340440309,,70.0,MCRC0003,76.8280467445743,77.04507512520868,2027-02-17
65.95616228532549,,70.0,MCRC0003,77.26210350584307,77.47913188647746,2027-02-18
58.258709405803096,,70.0,MCRC0003,77.69616026711185,77.91318864774624,2027-02-19
59.01381815797858,,70.0,MCRC0003,78.13021702838063,78.34724540901503,2027-02-20
49.78951792252288,,70.0,MCRC0003,78.56427378964942,78.78130217028381,2027-02-21
53.00383065695207,,70.0,MCRC0003,78.9983305509182,79.21535893155259,2027-02-22
65.28847550714107,,70.0,MCRC0003,79.43238731218698,79.64941569282136,2027-02-23
56.69224676709747,,70.0,MCRC0003,79.86644407345575,80.08347245409016,2027-02-24
55.35144182778792,,70.0,MCRC0003,80.30050083472455,80.51752921535893,2027-02-25
56.537084420143216,,70.0,MCRC0003,80.73455759599332,80.95158597662771,2027-02-26
59.71266936499585,,70.0,MCRC0003,81.1686143572621,81.38564273789649,2027-02-27
54.20792044567104,,70.0,MCRC0003,81.60267111853088,81.81969949916528,2027-02-28
60.63258252985118,,70.0,MCRC0003,82.03672787979967,82.25375626043406,2027-03-01
53.19996161438471,,70.0,MCRC0003,82.47078464106845,82.68781302170284,2027-03-02
63.87000001037893,,70.0,MCRC0003,82.90484140233723,83.12186978297161,2027-03-03
54.71472111330199,,70.0,MCRC0003,83.338898163606,83.5559265442404,2027-03-04
66.60134159466051,,70.0,MCRC0003,83.7729549248748,83.98998330550918,2027-03-05
59.949836736213086,,70.0,MCRC0003,84.20701168614357,84.42404006677796,2027-03-06
55.77177785802385,,70.0,MCRC0003,84.64106844741235,84.85809682804674,2027-03-07
64.55730304791157,,70.0,MCRC0003,85.07512520868113,85.29215358931553,2027-03-08
53.12751560448444,,70.0,MCRC0003,85.50918196994992,85.72621035058431,2027-03-09
57.26467177491296,,70.0,MCRC0003,85.9432387312187,86.16026711185309,2027-03-10
59.99962236694692,,70.0,MCRC0003,86.37729549248748,86.59432387312187,2027-03-11
9.636499590135374,,16.0,MCRC0003,86.81135225375625,87.02838063439066,2027-03-12
3.9742435948881214,,16.0,MCRC0003,87.24540901502505,87.46243739565944,2027-03-13
7.238060372159901,,16.0,MCRC0003,87.67946577629382,87.89649415692821,2027-03-14
10.504703027270295,,16.0,MCRC0003,88.1135225375626,88.33055091819699,2027-03-15
6.040325321920269,,16.0,MCRC0003,88.54757929883138,88.76460767946578,2027-03-16
13.79928789599754,,16.0,MCRC0003,88.98163606010017,89.19866444073456,2027-03-17
11.485542666357958,,16.0,MCRC0003,89.41569282136895,89.63272120200334,2027-03-18
8.457278827866787,,16.0,MCRC0003,89.84974958263773,90.06677796327212,2027-03-19
9.339122604099808,,16.0,MCRC0003,90.2838063439065,90.50083472454092,2027-03-20
15.584692371495454,,16.0,MCRC0003,90.7178631051753,90.93489148580969,2027-03-21
12.807965352628951,,16.0,MCRC0003,91.15191986644408,91.36894824707846,2027-03-22
11.140657434598516,,16.0,MCRC0003,91.58597662771284,91.80300500834724,2027-03-23
5.753443688697171,,16.0,MCRC0003,92.02003338898164,92.23706176961603,2027-03-24
14.888833955937876,,16.0,MCRC0003,92.45409015025042,92.6711185308848,2027-03-25
13.157203206621933,,16.0,MCRC0003,92.8881469115192,93.1051752921536,2027-03-26
9.554783837320388,,16.0,MCRC0003,93.32220367278798,93.53923205342235,2027-03-27
8.350905792373645,,16.0,MCRC0003,93.75626043405676,93.97328881469114,2027-03-28
9.43628818366968,,16.0,MCRC0003,94.19031719532556,94.40734557595994,2027-03-29
6.394189957399078,,16.0,MCRC0003,94.62437395659433,94.84140233722871,2027-03-30
8.587643326877977,,16.0,MCRC0003,95.0584307178631,95.27545909849748,2027-03-31
12.289481542463548,,16.0,MCRC0003,95.49248747913188,95.70951585976628,2027-04-01
4.577136168272284,,16.0,MCRC0003,95.92654424040067,96.14357262103506,2027-04-02
9.057776877273175,,16.0,MCRC0003,96.36060100166944,96.57762938230384,2027-04-03
10.341267918639511,,16.0,MCRC0003,96.79465776293824,97.01168614357262,2027-04-04
10.310704111969986,,16.0,MCRC0003,97.228714524207,97.4457429048414,2027-04-05
6.463189137899724,,16.0,MCRC0003,97.6627712854758,97.8797996661102,2027-04-06
6.453541326018819,,16.0,MCRC0003,98.09682804674458,98.31385642737897,2027-04-07
13.267496147375152,,16.0,MCRC0003,98.53088480801335,98.74791318864774,2027-04-08
6.326412721551127,,16.0,MCRC0003,98.96494156928212,99.18196994991652,2027-04-09
13.02595286892531,,16.0,MCRC0003,99.39899833055092,99.61602671118531,2027-04-10
8.552904054674524,,16.0,MCRC0003,99.8330550918197,100.05008347245408,2027-04-11
13.239389050902806,,16.0,MCRC0003,100.26711185308848,100.48414023372288,2027-04-12
8.736764483784958,,16.0,MCRC0003,100.70116861435726,100.91819699499165,2027-04-13
6.500586038151084,,16.0,MCRC0003,101.13522537562604,101.35225375626044,2027-04-14
12.569664569180386,,16.0,MCRC0003,101.56928213689484,101.78631051752922,2027-04-15
9.947826333309408,,16.0,MCRC0003,102.0033388981636,102.220367278798,2027-04-16
14.345729755973355,,16.0,MCRC0003,102.43739565943238,102.65442404006676,2027-04-17
12.676600255413517,,16.0,MCRC0003,102.87145242070116,103.08848080133556,2027-04-18
9.311720113168612,,16.0,MCRC0003,103.30550918196997,103.52253756260434,2027-04-19
8.65099719501108,,16.0,MCRC0003,103.73956594323872,103.95659432387312,2027-04-20
10.070117029861745,,16.0,MCRC0003,104.17362270450752,104.3906510851419,2027-04-21
10.570630053577569,,16.0,MCRC0003,104.6076794657763,104.82470784641067,2027-04-22
7.354754419804574,,16.0,MCRC0003,105.04173622704508,105.25876460767948,2027-04-23
12.52581871907373,,16.0,MCRC0003,105.47579298831386,105.69282136894824,2027-04-24
8.807909524568808,,16.0,MCRC0003,105.90984974958263,106.12687813021702,2027-04-25
8.730916764540062,,16.0,MCRC0003,106.34390651085144,106.5609348914858,2027-04-26
8.377934987882492,,16.0,MCRC0003,106.7779632721202,106.9949916527546,2027-04-27
10.693051802030114,,16.0,MCRC0003,107.21202003338898,107.42904841402336,2027-04-28
7.923842194837434,,16.0,MCRC0003,107.64607679465776,107.86310517529216,2027-04-29
10.404910329970882,,16.0,MCRC0003,108.08013355592657,108.29716193656094,2027-04-30
18.29980921330561,,16.0,MCRC0003,108.51419031719531,108.73121869782972,2027-05-01
9.839171619785974,,16.0,MCRC0003,108.9482470784641,109.1652754590985,2027-05-02
8.697985785104056,,16.0,MCRC0003,109.38230383973288,109.59933222036727,2027-05-03
4.996932315556297,,16.0,MCRC0003,109.81636060100168,110.03338898163608,2027-05-04
10.150665774292207,,16.0,MCRC0003,110.25041736227044,110.46744574290484,2027-05-05
6.672307170251182,,16.0,MCRC0003,110.68447412353925,110.90150250417362,2027-05-06
8.873325643085282,,16.0,MCRC0003,111.118530884808,111.3355592654424,2027-05-07
10.454822780941427,,16.0,MCRC0003,111.5525876460768,111.7696160267112,2027-05-08
4.807031650533545,,16.0,MCRC0003,111.98664440734558,112.20367278797995,2027-05-09
10.472388257195377,,16.0,MCRC0003,112.42070116861436,112.63772954924876,2027-05-10
10.913545526278131,,16.0,MCRC0003,112.85475792988314,113.07178631051752,2027-05-11
6.1086999410000455,,16.0,MCRC0003,113.28881469115191,113.50584307178632,2027-05-12
8.823072423612738,,16.0,MCRC0003,113.7228714524207,113.9398998330551,2027-05-13
4.508000913466587,,16.0,MCRC0003,114.15692821368948,114.37395659432389,2027-05-14
14.726502807527217,,16.0,MCRC0003,114.59098497495826,114.80801335559264,2027-05-15
10.991689829646534,,16.0,MCRC0003,115.02504173622704,115.24207011686144,2027-05-16
9.461234497062692,,16.0,MCRC0003,115.45909849749584,115.67612687813022,2027-05-17
9.509692508031511,,16.0,MCRC0003,115.8931552587646,116.110183639399,2027-05-18
13.394330824197304,,16.0,MCRC0003,116.3272120200334,116.54424040066776,2027-05-19
9.717503344238168,,16.0,MCRC0003,116.76126878130216,116.97829716193657,2027-05-20
10.99245031382726,,16.0,MCRC0003,117.19532554257096,117.41235392320534,2027-05-21
14.555888681096484,,16.0,MCRC0003,117.62938230383972,117.84641068447412,2027-05-22
8.961498555993405,,16.0,MCRC0003,118.06343906510853,118.2804674457429,2027-05-23
6.722094026479804,,16.0,MCRC0003,118.49749582637727,118.71452420701168,2027-05-24
7.526498275739136,,16.0,MCRC0003,118.93155258764608,119.14858096828048,2027-05-25
14.285991503317897,,16.0,MCRC0003,119.36560934891486,119.58263772954923,2027-05-26
10.27428492554217,,16.0,MCRC0003,119.79966611018364,120.01669449081804,2027-05-27
8.493006135190978,,16.0,MCRC0003,120.2337228714524,120.45075125208682,2027-05-28
12.920933139397476,,16.0,MCRC0003,120.6677796327212,120.8848080133556,2027-05-29
12.99387215703148,,16.0,MCRC0003,121.10183639398998,121.31886477462436,2027-05-30
8.573056696280684,,16.0,MCRC0003,121.53589315525876,121.75292153589317,2027-05-31
7.0841894887436485,,16.0,MCRC0003,121.96994991652754,122.18697829716194,2027-06-01
5.28841419681637,,16.0,MCRC0003,122.40400667779632,122.62103505843072,2027-06-02
4.6183332372212895,,16.0,MCRC0003,122.83806343906512,123.0550918196995,2027-06-03
9.20504064446201,,16.0,MCRC0003,123.27212020033387,123.48914858096828,2027-06-04
7.320412158889621,,16.0,MCRC0003,123.70617696160268,123.92320534223708,2027-06-05
15.575423229418556,,16.0,MCRC0003,124.14023372287146,124.35726210350585,2027-06-06
10.175613264085072,,16.0,MCRC0003,124.57429048414023,124.79131886477462,2027-06-07
4.17355137024652,,16.0,MCRC0003,125.008347245409,125.2253756260434,2027-06-08
14.256187826530187,,16.0,MCRC0003,125.4424040066778,125.6594323873122,2027-06-09
10.485130928252786,,16.0,MCRC0003,125.87646076794658,126.09348914858096,2027-06-10
12.114938441119316,,16.0,MCRC0003,126.31051752921536,126.52754590984976,2027-06-11
12.046104330500231,,16.0,MCRC0003,126.74457429048414,126.96160267111853,2027-06-12
10.889669701859615,,16.0,MCRC0003,127.17863105175292,127.39565943238732,2027-06-13
11.570027891303631,,16.0,MCRC0003,127.61268781302172,127.8297161936561,2027-06-14
10.716282015189115,,16.0,MCRC0003,128.04674457429047,128.2637729549249,2027-06-15
6.680842282103689,,16.0,MCRC0003,128.48080133555928,128.69782971619367,2027-06-16
11.10019659442742,,16.0,MCRC0003,128.91485809682806,129.13188647746244,2027-06-17
13.07171651497762,,16.0,MCRC0003,129.34891485809683,129.56594323873122,2027-06-18
9.369830762062549,,16.0,MCRC0003,129.7829716193656,130.0,2027-06-19
22.205208872279023,12.0,,MCRC0004,0.0,0.2671118530884808,2027-06-20
21.678356580792247,,28.0,MCRC0004,0.5342237061769616,0.8013355592654424,2027-06-21
27.26260825567643,12.0,28.0,MCRC0004,1.0684474123539232,1.335559265442404,2027-06-22
18.98899879720096,12.0,,MCRC0004,1.6026711185308848,1.8697829716193657,2027-06-23
18.831983348919035,12.0,28.0,MCRC0004,2.1368948247078463,2.404006677796328,2027-06-24
19.532273039413003,12.0,,MCRC0004,2.671118530884808,2.9382303839732886,2027-06-25
19.59043569958524,,28.0,MCRC0004,3.2053422370617697,3.4724540901502503,2027-06-26
10.909529156182792,12.0,,MCRC0004,3.7395659432387314,4.006677796327212,2027-06-27
17.429560634133715,12.0,,MCRC0004,4.273789649415693,4.540901502504173,2027-06-28
21.19954026618309,12.0,28.0,MCRC0004,4.808013355592655,5.075125208681135,2027-06-29
19.966973941328582,12.0,28.0,MCRC0004,5.342237061769616,5.609348914858097,2027-06-30
16.802643383211468,12.0,28.0,MCRC0004,5.876460767946577,6.143572621035059,2027-07-01
17.34088299129848,12.0,28.0,MCRC0004,6.410684474123539,6.67779632721202,2027-07-02
18.577547486812165,12.0,28.0,MCRC0004,6.944908180300501,7.212020033388981,2027-07-03
16.793712876790316,12.0,28.0,MCRC0004,7.479131886477463,7.746243739565943,2027-07-04
17.947797558226398,12.0,28.0,MCRC0004,8.013355592654424,8.280467445742905,2027-07-05
17.84243952208586,12.0,28.0,MCRC0004,8.547579298831385,8.814691151919867,2027-07-06
23.581483386428708,12.0,28.0,MCRC0004,9.081803005008346,9.348914858096828,2027-07-07
24.065565074164308,12.0,28.0,MCRC0004,9.61602671118531,9.88313856427379,2027-07-08
23.73434037757869,12.0,28.0,MCRC0004,10.15025041736227,10.41736227045075,2027-07-09
21.706807196700872,12.0,28.0,MCRC0004,10.684474123539232,10.951585976627712,2027-07-10
17.166710062345807,12.0,28.0,MCRC0004,11.218697829716191,11.485809682804677,2027-07-11
23.83932179997492,,28.0,MCRC0004,11.752921535893154,12.020033388981636,2027-07-12
18.74299765392228,,28.0,MCRC0004,12.287145242070116,12.554257095158595,2027-07-13
20.09220883303788,12.0,,MCRC0004,12.82136894824708,13.088480801335558,2027-07-14
25.352882127722356,12.0,28.0,MCRC0004,13.35559265442404,13.62270450751252,2027-07-15
20.33597142452656,12.0,28.0,MCRC0004,13.889816360601,14.156928213689485,2027-07-16
20.98913612095048,,28.0,MCRC0004,14.424040066777962,14.691151919866444,2027-07-17
14.348882056013643,12.0,28.0,MCRC0004,14.958263772954924,15.225375626043403,2027-07-18
21.94803717506741,12.0,28.0,MCRC0004,15.492487479131889,15.759599332220366,2027-07-19
16.079973410790075,,28.0,MCRC0004,16.026711185308848,16.293823038397328,2027-07-20
24.04775862547161,12.0,28.0,MCRC0004,16.56093489148581,16.82804674457429,2027-07-21
19.2616032913086,12.0,28.0,MCRC0004,17.09515859766277,17.362270450751254,2027-07-22
11.055324631931558,,,MCRC0004,17.629382303839733,17.896494156928213,2027-07-23
18.56791958974663,12.0,28.0,MCRC0004,18.163606010016693,18.430717863105176,2027-07-24
19.08786184685633,,28.0,MCRC0004,18.697829716193656,18.964941569282136,2027-07-25
21.94190090431237,12.0,28.0,MCRC0004,19.23205342237062,19.4991652754591,2027-07-26
22.68204956258867,,28.0,MCRC0004,19.76627712854758,20.03338898163606,2027-07-27
18.688943021115247,12.0,28.0,MCRC0004,20.30050083472454,20.56761268781302,2027-07-28
24.051472779415494,12.0,28.0,MCRC0004,20.8347245409015,21.101836393989984,2027-07-29
7.331778685388375,12.0,28.0,MCRC0004,21.368948247078464,21.636060100166944,2027-07-30
17.144044007899083,,28.0,MCRC0004,21.903171953255427,22.170283806343907,2027-07-31
15.550542916651253,,,MCRC0004,22.437395659432383,22.70450751252087,2027-08-01
14.983265957660317,12.0,28.0,MCRC0004,22.97161936560935,23.23873121869783,2027-08-02
23.838825485390043,12.0,,MCRC0004,23.50584307178631,23.772954924874792,2027-08-03
23.3166815960994,12.0,28.0,MCRC0004,24.040066777963272,24.30717863105175,2027-08-04
16.896919918359114,12.0,28.0,MCRC0004,24.574290484140235,24.841402337228715,2027-08-05
24.71222801583984,12.0,28.0,MCRC0004,25.108514190317194,25.37562604340568,2027-08-06
20.405867569809672,,28.0,MCRC0004,25.64273789649416,25.90984974958264,2027-08-07
18.31326359689939,,28.0,MCRC0004,26.17696160267112,26.4440734557596,2027-08-08
17.228308814510253,12.0,28.0,MCRC0004,26.71118530884808,26.97829716193656,2027-08-09
16.88691309414763,12.0,28.0,MCRC0004,27.245409015025043,27.512520868113523,2027-08-10
21.89109942979814,12.0,28.0,MCRC0004,27.779632721202,28.04674457429049,2027-08-11
22.600619603868008,12.0,28.0,MCRC0004,28.313856427378965,28.580968280467445,2027-08-12
20.95400484875164,,,MCRC0004,28.848080133555925,29.115191986644408,2027-08-13
11.799129290467611,12.0,,MCRC0004,29.382303839732888,29.649415692821368,2027-08-14
21.185434624211616,12.0,28.0,MCRC0004,29.91652754590985,30.18363939899833,2027-08-15
22.261586256155223,12.0,28.0,MCRC0004,30.45075125208681,30.717863105175294,2027-08-16
17.323177578142204,12.0,28.0,MCRC0004,30.984974958263773,31.252086811352253,2027-08-17
20.173002171593414,,,MCRC0004,31.519198664440733,31.786310517529216,2027-08-18
12.54446280279701,,28.0,MCRC0004,32.053422370617696,32.320534223706176,2027-08-19
15.080123753280908,12.0,28.0,MCRC0004,32.587646076794655,32.854757929883135,2027-08-20
18.70305860703789,12.0,28.0,MCRC0004,33.12186978297162,33.3889816360601,2027-08-21
18.760995423935576,12.0,28.0,MCRC0004,33.65609348914858,33.92320534223706,2027-08-22
21.406717486998406,12.0,28.0,MCRC0004,34.19031719532554,34.45742904841402,2027-08-23
15.25229845388236,,28.0,MCRC0004,34.72454090150251,34.99165275459099,2027-08-24
18.63517574151731,12.0,,MCRC0004,35.25876460767947,35.52587646076795,2027-08-25
18.040880878346364,12.0,28.0,MCRC0004,35.792988313856426,36.060100166944906,2027-08-26
22.112041895916832,12.0,28.0,MCRC0004,36.327212020033386,36.59432387312187,2027-08-27
25.68417107347333,,28.0,MCRC0004,36.86143572621035,37.12854757929883,2027-08-28
26.8836812792403,12.0,28.0,MCRC0004,37.39565943238731,37.66277128547579,2027-08-29
13.72623981267457,12.0,28.0,MCRC0004,37.92988313856427,38.19699499165275,2027-08-30
19.80794323299817,12.0,28.0,MCRC0004,38.46410684474124,38.73121869782972,2027-08-31
15.54988275902094,12.0,,MCRC0004,38.9983305509182,39.26544240400668,2027-09-01
19.74102019405504,12.0,28.0,MCRC0004,39.53255425709516,39.79966611018364,2027-09-02
21.6916771184638,12.0,28.0,MCRC0004,40.06677796327212,40.3338898163606,2027-09-03
20.325963594813647,12.0,,MCRC0004,40.60100166944908,40.86811352253756,2027-09-04
19.80395320482216,,28.0,MCRC0004,41.13522537562604,41.40233722871452,2027-09-05
25.932156699061206,12.0,28.0,MCRC0004,41.669449081803,41.93656093489149,2027-09-06
22.883957566815635,,,MCRC0004,42.20367278797997,42.47078464106845,2027-09-07
18.909382153848867,,28.0,MCRC0004,42.73789649415693,43.00500834724541,2027-09-08
20.096845443581174,12.0,28.0,MCRC0004,43.27212020033389,43.53923205342237,2027-09-09
23.4835912271576,12.0,,MCRC0004,43.80634390651085,44.07345575959933,2027-09-10
22.43916202415712,12.0,28.0,MCRC0004,44.34056761268781,44.60767946577629,2027-09-11
18.299695585196712,12.0,28.0,MCRC0004,44.87479131886477,45.14190317195325,2027-09-12
12.899028635585722,,,MCRC0004,45.40901502504174,45.67612687813022,2027-09-13
15.26137002890924,12.0,28.0,MCRC0004,45.9432387312187,46.21035058430718,2027-09-14
20.58391690005406,,28.0,MCRC0004,46.47746243739566,46.74457429048414,2027-09-15
12.853892589283978,12.0,28.0,MCRC0004,47.01168614357262,47.27879799666111,2027-09-16
19.390422007934287,,,MCRC0004,47.545909849749584,47.813021702838064,2027-09-17
18.18572329524989,12.0,,MCRC0004,48.080133555926544,48.347245409015024,2027-09-18
23.997011212188813,12.0,28.0,MCRC0004,48.6143572621035,48.88146911519198,2027-09-19
14.727824706098176,,28.0,MCRC0004,49.14858096828047,49.41569282136895,2027-09-20
12.272924084396044,12.0,28.0,MCRC0004,49.68280467445743,49.94991652754591,2027-09-21
18.32143703355957,12.0,,MCRC0004,50.21702838063439,50.48414023372287,2027-09-22
22.53905252637409,,28.0,MCRC0004,50.75125208681136,51.01836393989984,2027-09-23
24.279674395709407,12.0,,MCRC0004,51.28547579298832,51.5525876460768,2027-09-24
16.362691933760228,12.0,28.0,MCRC0004,51.81969949916528,52.08681135225376,2027-09-25
21.881054990384744,12.0,28.0,MCRC0004,52.35392320534224,52.62103505843072,2027-09-26
15.55427820895058,12.0,,MCRC0004,52.8881469115192,53.15525876460768,2027-09-27
56.25586267215274,,70.0,MCRC0004,53.42237061769616,53.68948247078464,2027-09-28
62.837973630138826,50.0,70.0,MCRC0004,53.95659432387312,54.223706176961606,2027-09-29
63.59075271275922,50.0,70.0,MCRC0004,54.490818030050086,54.757929883138566,2027-09-30
55.00309625363241,50.0,70.0,MCRC0004,55.025041736227045,55.292153589315525,2027-10-01
62.37449161468492,50.0,70.0,MCRC0004,55.559265442404005,55.826377295492485,2027-10-02
50.65750093374725,50.0,70.0,MCRC0004,56.09348914858097,56.36060100166945,2027-10-03
58.98670546417223,50.0,,MCRC0004,56.62771285475793,56.89482470784641,2027-10-04
54.32875986860829,50.0,70.0,MCRC0004,57.16193656093489,57.42904841402337,2027-10-05
55.96150329901424,,70.0,MCRC0004,57.69616026711185,57.96327212020034,2027-10-06
53.61961323927825,50.0,70.0,MCRC0004,58.230383973288816,58.497495826377296,2027-10-07
62.76813197669493,50.0,70.0,MCRC0004,58.764607679465776,59.031719532554256,2027-10-08
62.76937235215934,50.0,,MCRC0004,59.298831385642735,59.56594323873122,2027-10-09
56.54399777333611,50.0,70.0,MCRC0004,59.8330550918197,60.10016694490818,2027-10-10
61.87791153221799,50.0,70.0,MCRC0004,60.36727879799666,60.63439065108514,2027-10-11
61.30636276567687,50.0,70.0,MCRC0004,60.90150250417362,61.1686143572621,2027-10-12
59.35774122833279,50.0,,MCRC0004,61.43572621035059,61.70283806343907,2027-10-13
70.79085099791789,,70.0,MCRC0004,61.96994991652755,62.23706176961603,2027-10-14
55.7956069143007,,70.0,MCRC0004,62.504173622704506,62.771285475792986,2027-10-15
60.07152545356568,,70.0,MCRC0004,63.038397328881466,63.30550918196995,2027-10-16
58.088064853522205,50.0,70.0,MCRC0004,63.57262103505843,63.83973288814691,2027-10-17
58.14109992684789,50.0,,MCRC0004,64.10684474123539,64.37395659432387,2027-10-18
60.797060020457394,50.0,70.0,MCRC0004,64.64106844741235,64.90818030050083,2027-10-19
58.528021499051775,50.0,70.0,MCRC0004,65.17529215358931,65.44240400667779,2027-10-20
55.69786619953881,50.0,70.0,MCRC0004,65.70951585976627,65.97662771285476,2027-10-21
60.621137489798656,50.0,70.0,MCRC0004,66.24373956594324,66.51085141903172,2027-10-22
65.91165823376993,,70.0,MCRC0004,66.7779632721202,67.04507512520868,2027-10-23
64.7138318998925,50.0,70.0,MCRC0004,67.31218697829716,67.57929883138564,2027-10-24
61.01522244204355,50.0,,MCRC0004,67.84641068447412,68.1135225375626,2027-10-25
56.32301593100536,50.0,70.0,MCRC0004,68.38063439065108,68.64774624373956,2027-10-26
60.93214800199735,50.0,70.0,MCRC0004,68.91485809682804,69.18196994991652,2027-10-27
65.4232151167297,50.0,70.0,MCRC0004,69.44908180300501,69.7161936560935,2027-10-28
65.95594631163493,50.0,70.0,MCRC0004,69.98330550918197,70.25041736227045,2027-10-29
61.79843529783198,,70.0,MCRC0004,70.51752921535893,70.78464106844741,2027-10-30
58.17821399916891,50.0,70.0,MCRC0004,71.0517529215359,71.31886477462437,2027-10-31
58.986236252835646,50.0,,MCRC0004,71.58597662771285,71.85308848080133,2027-11-01
63.86022963669252,,70.0,MCRC0004,72.12020033388981,72.38731218697829,2027-11-02
63.43173107435625,50.0,70.0,MCRC0004,72.65442404006677,72.92153589315527,2027-11-03
51.21150193931008,,,MCRC0004,73.18864774624375,73.45575959933223,2027-11-04
63.293087823961386,50.0,70.0,MCRC0004,73.7228714524207,73.98998330550918,2027-11-05
63.55644170014764,,70.0,MCRC0004,74.25709515859766,74.52420701168614,2027-11-06
55.56404287497364,50.0,70.0,MCRC0004,74.79131886477462,75.0584307178631,2027-11-07
56.17509441888159,50.0,70.0,MCRC0004,75.32554257095158,75.59265442404006,2027-11-08
56.21417950941182,50.0,,MCRC0004,75.85976627712854,76.12687813021702,2027-11-09
56.59868598738576,50.0,70.0,MCRC0004,76.3939899833055,76.661101836394,2027-11-10
52.91625206402883,50.0,70.0,MCRC0004,76.92821368948248,77.19532554257096,2027-11-11
61.56545964775974,50.0,70.0,MCRC0004,77.46243739565944,77.72954924874792,2027-11-12
56.07140300616245,50.0,70.0,MCRC0004,77.9966611018364,78.26377295492487,2027-11-13
59.64808081954355,50.0,70.0,MCRC0004,78.53088480801335,78.79799666110183,2027-11-14
57.51215608475502,50.0,70.0,MCRC0004,79.06510851419031,79.3322203672788,2027-11-15
61.27588760698345,,70.0,MCRC0004,79.59933222036727,79.86644407345575,2027-11-16
54.94691481964025,50.0,,MCRC0004,80.13355592654425,80.40066777963273,2027-11-17
61.22632687448233,,70.0,MCRC0004,80.6677796327212,80.93489148580969,2027-11-18
61.94890507971847,50.0,70.0,MCRC0004,81.20200333889817,81.46911519198665,2027-11-19
64.13797292599314,,70.0,MCRC0004,81.73622704507513,82.0033388981636,2027-11-20
69.83884544695329,50.0,70.0,MCRC0004,82.27045075125208,82.53756260434056,2027-11-21
49.539491148728914,,70.0,MCRC0004,82.80467445742904,83.07178631051752,2027-11-22
61.601571671865685,50.0,70.0,MCRC0004,83.338898163606,83.6060100166945,2027-11-23
56.4541857919663,50.0,,MCRC0004,83.87312186978298,84.14023372287146,2027-11-24
50.3747066354442,,70.0,MCRC0004,84.40734557595994,84.67445742904842,2027-11-25
64.20815311653328,50.0,,MCRC0004,84.9415692821369,85.20868113522538,2027-11-26
66.66099941947452,50.0,70.0,MCRC0004,85.47579298831386,85.74290484140234,2027-11-27
58.04186144750371,50.0,,MCRC0004,86.01001669449082,86.2771285475793,2027-11-28
61.054581481110056,50.0,70.0,MCRC0004,86.54424040066777,86.81135225375625,2027-11-29
59.67961629918422,50.0,70.0,MCRC0004,87.07846410684473,87.34557595993323,2027-11-30
62.17098834046598,50.0,,MCRC0004,87.61268781302171,87.87979966611019,2027-12-01
64.40267874461799,,70.0,MCRC0004,88.14691151919867,88.41402337228715,2027-12-02
61.72468667846699,50.0,70.0,MCRC0004,88.68113522537563,88.9482470784641,2027-12-03
61.72884964730079,50.0,70.0,MCRC0004,89.21535893155259,89.48247078464107,2027-12-04
66.29868271435816,50.0,70.0,MCRC0004,89.74958263772955,90.01669449081803,2027-12-05
59.17668888911691,50.0,,MCRC0004,90.2838063439065,90.550918196995,2027-12-06
64.61532285649474,50.0,70.0,MCRC0004,90.81803005008348,91.08514190317196,2027-12-07
55.889997889042405,50.0,,MCRC0004,91.35225375626044,91.61936560934892,2027-12-08
68.03542473358351,50.0,,MCRC0004,91.8864774624374,92.15358931552588,2027-12-09
63.68912696186453,50.0,70.0,MCRC0004,92.42070116861436,92.68781302170284,2027-12-10
57.9812023305427,50.0,70.0,MCRC0004,92.95492487479132,93.2220367278798,2027-12-11
49.42725926455167,50.0,70.0,MCRC0004,93.48914858096828,93.75626043405676,2027-12-12
59.99844641434425,,70.0,MCRC0004,94.02337228714524,94.29048414023372,2027-12-13
54.09095295614625,50.0,,MCRC0004,94.5575959933222,94.82470784641067,2027-12-14
61.498173015898736,50.0,70.0,MCRC0004,95.09181969949915,95.35893155258763,2027-12-15
67.25584411400237,50.0,,MCRC0004,95.62604340567611,95.8931552587646,2027-12-16
60.80029896398244,,70.0,MCRC0004,96.16026711185307,96.42737896494155,2027-12-17
59.10993692837738,50.0,,MCRC0004,96.69449081803003,96.96160267111853,2027-12-18
61.7110270199793,50.0,70.0,MCRC0004,97.228714524207,97.49582637729549,2027-12-19
61.42825098054937,,70.0,MCRC0004,97.76293823038397,98.03005008347246,2027-12-20
48.18567945773876,50.0,70.0,MCRC0004,98.29716193656094,98.56427378964942,2027-12-21
61.20468432035256,50.0,70.0,MCRC0004,98.8313856427379,99.09849749582638,2027-12-22
63.10138678058848,50.0,70.0,MCRC0004,99.36560934891486,99.63272120200334,2027-12-23
58.703291828536464,50.0,70.0,MCRC0004,99.89983305509182,100.1669449081803,2027-12-24
64.89279539070255,50.0,,MCRC0004,100.43405676126878,100.70116861435726,2027-12-25
59.361627127085015,50.0,70.0,MCRC0004,100.96828046744574,101.23539232053422,2027-12-26
63.83499381240205,50.0,,MCRC0004,101.50250417362273,101.7696160267112,2027-12-27
71.36552553531077,,,MCRC0004,102.03672787979968,102.30383973288816,2027-12-28
59.51804435486764,50.0,70.0,MCRC0004,102.57095158597664,102.83806343906512,2027-12-29
50.289339170408766,50.0,70.0,MCRC0004,103.1051752921536,103.37228714524208,2027-12-30
58.31704137962196,50.0,,MCRC0004,103.63939899833056,103.90651085141904,2027-12-31
51.370549976049645,50.0,70.0,MCRC0004,104.17362270450752,104.440734557596,2028-01-01
63.05618913220199,50.0,70.0,MCRC0004,104.70784641068448,104.97495826377296,2028-01-02
66.54675487016546,50.0,,MCRC0004,105.24207011686144,105.50918196994992,2028-01-03
63.4793983085877,50.0,,MCRC0004,105.7762938230384,106.04340567612688,2028-01-04
61.60154106373135,50.0,70.0,MCRC0004,106.31051752921536,106.57762938230384,2028-01-05
8.065223627425727,4.0,16.0,MCRC0004,106.84474123539232,107.1118530884808,2028-01-06
14.726949237899433,4.0,16.0,MCRC0004,107.37896494156928,107.64607679465776,2028-01-07
12.259828635997955,,16.0,MCRC0004,107.91318864774624,108.18030050083472,2028-01-08
10.85340867018865,4.0,16.0,MCRC0004,108.4474123539232,108.71452420701168,2028-01-09
10.614580957139712,4.0,16.0,MCRC0004,108.98163606010016,109.24874791318864,2028-01-10
10.334882075950016,4.0,16.0,MCRC0004,109.51585976627712,109.7829716193656,2028-01-11
11.356649271878233,4.0,16.0,MCRC0004,110.05008347245408,110.31719532554256,2028-01-12
8.160018462815188,4.0,16.0,MCRC0004,110.58430717863104,110.85141903171952,2028-01-13
14.57574980201026,,16.0,MCRC0004,111.118530884808,111.38564273789648,2028-01-14
10.45701925862183,4.0,,MCRC0004,111.65275459098496,111.91986644407343,2028-01-15
11.800163351417504,4.0,16.0,MCRC0004,112.18697829716194,112.45409015025042,2028-01-16
8.69929816699172,4.0,16.0,MCRC0004,112.7212020033389,112.98831385642738,2028-01-17
11.12475560072028,4.0,16.0,MCRC0004,113.25542570951586,113.52253756260434,2028-01-18
3.1547427210805603,,,MCRC0004,113.78964941569282,114.0567612687813,2028-01-19
6.645103364625526,,16.0,MCRC0004,114.32387312186978,114.59098497495826,2028-01-20
9.905760540440612,,16.0,MCRC0004,114.85809682804674,115.12520868113522,2028-01-21
6.032580669829999,4.0,,MCRC0004,115.3923205342237,115.6594323873122,2028-01-22
17.318242191595502,,16.0,MCRC0004,115.92654424040067,116.19365609348915,2028-01-23
4.9957560582718346,,,MCRC0004,116.46076794657765,116.72787979966613,2028-01-24
11.037702247107813,4.0,16.0,MCRC0004,116.9949916527546,117.26210350584309,2028-01-25
14.967319460422503,,16.0,MCRC0004,117.52921535893157,117.79632721202005,2028-01-26
11.443861178236254,4.0,16.0,MCRC0004,118.06343906510853,118.330550918197,2028-01-27
9.069317339855877,4.0,,MCRC0004,118.59766277128548,118.86477462437396,2028-01-28
8.343567748501645,4.0,,MCRC0004,119.13188647746244,119.39899833055092,2028-01-29
12.019766466317932,4.0,16.0,MCRC0004,119.6661101836394,119.93322203672788,2028-01-30
7.599187956872361,4.0,16.0,MCRC0004,120.20033388981636,120.46744574290484,2028-01-31
9.641541670573735,4.0,16.0,MCRC0004,120.73455759599332,121.0016694490818,2028-02-01
12.073595817154242,4.0,16.0,MCRC0004,121.26878130217028,121.53589315525876,2028-02-02
9.076362920271098,4.0,16.0,MCRC0004,121.80300500834724,122.07011686143572,2028-02-03
10.26253003056614,4.0,16.0,MCRC0004,122.3372287145242,122.60434056761268,2028-02-04
9.08774112235297,4.0,16.0,MCRC0004,122.87145242070116,123.13856427378964,2028-02-05
7.0906071894794,4.0,16.0,MCRC0004,123.40567612687812,123.6727879799666,2028-02-06
13.567451454166433,4.0,,MCRC0004,123.9398998330551,124.20701168614356,2028-02-07
14.179198721748978,4.0,,MCRC0004,124.47412353923204,124.74123539232052,2028-02-08
9.049900138289932,,16.0,MCRC0004,125.008347245409,125.27545909849748,2028-02-09
9.203271523964254,4.0,16.0,MCRC0004,125.54257095158596,125.80968280467444,2028-02-10
9.466301983060385,,16.0,MCRC0004,126.07679465776292,126.34390651085144,2028-02-11
11.616409820877344,4.0,16.0,MCRC0004,126.6110183639399,126.8781302170284,2028-02-12
7.284099204275412,4.0,,MCRC0004,127.14524207011686,127.41235392320534,2028-02-13
9.734424083342228,4.0,,MCRC0004,127.67946577629382,127.9465776293823,2028-02-14
10.788877165507436,,,MCRC0004,128.21368948247078,128.48080133555928,2028-02-15
11.92612644816174,4.0,,MCRC0004,128.74791318864774,129.01502504173624,2028-02-16
1.6574881753557411,4.0,16.0,MCRC0004,129.2821368948247,129.5492487479132,2028-02-17
11.210209628705536,,16.0,MCRC0004,129.81636060100166,130.08347245409016,2028-02-18
11.03754028575725,,16.0,MCRC0004,130.35058430717862,130.61769616026712,2028-02-19
13.0231847100989,4.0,16.0,MCRC0004,130.88480801335558,131.15191986644408,2028-02-20
8.421207954337913,4.0,16.0,MCRC0004,131.41903171953254,131.68614357262103,2028-02-21
8.4449403841928,4.0,,MCRC0004,131.95325542570953,132.220367278798,2028-02-22
13.60754976000911,4.0,16.0,MCRC0004,132.4874791318865,132.75459098497495,2028-02-23
5.310529881552373,4.0,,MCRC0004,133.02170283806345,133.2888146911519,2028-02-24
14.887270874144198,,16.0,MCRC0004,133.5559265442404,133.82303839732887,2028-02-25
17.66768337768348,,16.0,MCRC0004,134.09015025041737,134.35726210350583,2028-02-26
11.432355054114655,4.0,16.0,MCRC0004,134.62437395659433,134.8914858096828,2028-02-27
12.44229542072984,,16.0,MCRC0004,135.15859766277129,135.42570951585978,2028-02-28
5.531254878701968,,16.0,MCRC0004,135.69282136894824,135.95993322203674,2028-02-29
7.916320639907282,4.0,,MCRC0004,136.2270450751252,136.4941569282137,2028-03-01
13.173587641516306,4.0,16.0,MCRC0004,136.76126878130216,137.02838063439066,2028-03-02
11.0854460409467,4.0,16.0,MCRC0004,137.29549248747912,137.56260434056762,2028-03-03
9.455717610919688,4.0,16.0,MCRC0004,137.82971619365608,138.09682804674458,2028-03-04
10.698607397018634,,16.0,MCRC0004,138.36393989983304,138.63105175292154,2028-03-05
11.5209294529608,4.0,16.0,MCRC0004,138.89816360601003,139.1652754590985,2028-03-06
9.1207128967389,4.0,,MCRC0004,139.432387312187,139.69949916527543,2028-03-07
9.913162165069783,,,MCRC0004,139.96661101836395,140.2337228714524,2028-03-08
9.891077875603196,,16.0,MCRC0004,140.5008347245409,140.76794657762937,2028-03-09
6.843163055767183,4.0,16.0,MCRC0004,141.03505843071787,141.30217028380633,2028-03-10
10.970783883877305,4.0,,MCRC0004,141.56928213689483,141.8363939899833,2028-03-11
15.410757743839271,4.0,16.0,MCRC0004,142.1035058430718,142.37061769616028,2028-03-12
15.195886390558575,4.0,,MCRC0004,142.63772954924875,142.90484140233724,2028-03-13
5.570802112444724,4.0,16.0,MCRC0004,143.1719532554257,143.4390651085142,2028-03-14
11.711893659630212,4.0,16.0,MCRC0004,143.7061769616027,143.97328881469116,2028-03-15
12.02651134271732,4.0,16.0,MCRC0004,144.24040066777962,144.50751252086812,2028-03-16
8.768468611529075,,,MCRC0004,144.77462437395658,145.04173622704508,2028-03-17
7.107399895862816,4.0,16.0,MCRC0004,145.30884808013354,145.57595993322204,2028-03-18
6.037557057485056,4.0,16.0,MCRC0004,145.84307178631053,146.110183639399,2028-03-19
8.665888663449905,,,MCRC0004,146.3772954924875,146.64440734557596,2028-03-20
11.050027409821638,4.0,16.0,MCRC0004,146.91151919866445,147.17863105175292,2028-03-21
9.52582547269823,,16.0,MCRC0004,147.4457429048414,147.71285475792988,2028-03-22
8.167200735210526,,,MCRC0004,147.97996661101837,148.24707846410683,2028-03-23
6.252530105947301,4.0,16.0,MCRC0004,148.51419031719533,148.7813021702838,2028-03-24
11.052148775164891,4.0,16.0,MCRC0004,149.0484140233723,149.31552587646075,2028-03-25
13.199627340908368,4.0,16.0,MCRC0004,149.58263772954925,149.84974958263774,2028-03-26
7.2192340838965245,4.0,16.0,MCRC0004,150.1168614357262,150.3839732888147,2028-03-27
11.345286892446172,,16.0,MCRC0004,150.65108514190317,150.91819699499166,2028-03-28
4.3615742682687975,,16.0,MCRC0004,151.18530884808013,151.45242070116862,2028-03-29
8.027601673176274,4.0,16.0,MCRC0004,151.71953255425709,151.98664440734558,2028-03-30
12.188812358547285,4.0,,MCRC0004,152.25375626043405,152.52086811352254,2028-03-31
6.646698371831136,4.0,16.0,MCRC0004,152.787979966611,153.0550918196995,2028-04-01
8.186689825562707,4.0,,MCRC0004,153.322203672788,153.58931552587646,2028-04-02
14.253900485310098,,16.0,MCRC0004,153.85642737896495,154.12353923205342,2028-04-03
7.801468059242373,4.0,,MCRC0004,154.3906510851419,154.65776293823038,2028-04-04
7.438165542312207,4.0,16.0,MCRC0004,154.92487479131887,155.19198664440734,2028-04-05
11.727545085792016,4.0,16.0,MCRC0004,155.45909849749583,155.7262103505843,2028-04-06
15.864200689465882,4.0,16.0,MCRC0004,155.9933222036728,156.26043405676126,2028-04-07
9.280990158117644,,16.0,MCRC0004,156.52754590984975,156.79465776293824,2028-04-08
12.3062075809558,4.0,16.0,MCRC0004,157.0617696160267,157.3288814691152,2028-04-09
14.03730754034502,,16.0,MCRC0004,157.59599332220367,157.86310517529216,2028-04-10
10.976656488641716,4.0,,MCRC0004,158.13021702838063,158.39732888146912,2028-04-11
9.19024629644482,4.0,,MCRC0004,158.6644407345576,158.93155258764608,2028-04-12
7.371019784123541,4.0,16.0,MCRC0004,159.19866444073455,159.46577629382304,2028-04-13
5.724367117236806,4.0,16.0,MCRC0004,159.7328881469115,160.0,2028-04-14
