ncols 69
nrows 69
xllcorner 415875.000000
yllcorner 5879875.000000
cellsize 250.000000
NODATA_VALUE -9999
350.65 336.14 316.39 306.92 315.60 335.05 344.11 344.69 335.85 329.22 319.95 317.20 316.31 316.00 314.30 310.41 306.22 302.10 298.19 294.64 292.46 290.97 290.34 292.10 296.25 301.72 306.23 310.03 311.67 310.24 309.46 311.21 314.75 318.59 324.63 330.43 332.92 334.21 335.98 335.17 334.64 335.08 336.52 340.60 345.67 350.08 354.67 359.51 367.97 368.63 367.59 368.77 374.61 384.30 396.37 409.31 423.87 448.93 482.48 512.01 547.25 582.67 612.12 619.90 616.91 605.94 598.61 595.32 592.83 
339.71 334.56 319.35 305.88 308.33 323.22 337.33 345.24 353.33 352.26 347.55 335.87 327.05 323.01 319.07 315.32 310.20 304.74 299.45 295.61 294.72 293.47 292.21 293.15 297.05 301.86 305.87 310.41 313.36 313.57 312.55 313.48 316.91 321.19 327.72 333.50 336.72 340.37 343.28 340.98 339.37 338.82 339.61 342.71 347.74 353.66 358.35 369.36 378.78 377.67 372.48 371.60 376.32 388.08 404.90 417.62 431.37 456.05 488.47 525.63 557.71 579.77 585.72 584.28 580.43 575.07 567.04 563.08 556.40 
328.97 332.79 323.32 308.96 304.79 311.68 324.52 338.46 358.77 380.09 381.44 362.00 342.32 330.64 324.49 318.51 311.67 305.47 299.47 296.68 297.30 295.79 293.78 294.29 297.36 301.61 305.36 309.96 315.56 317.00 316.70 315.79 318.24 322.64 328.43 334.42 340.61 349.34 352.16 347.11 343.42 342.43 342.30 344.82 349.34 356.69 365.83 380.16 391.38 390.20 380.07 376.45 379.09 390.78 406.86 422.44 435.87 460.83 496.98 537.30 558.90 563.24 555.53 547.51 543.48 538.17 535.85 534.66 526.02 
324.55 330.72 325.68 314.93 307.07 309.07 315.56 328.15 355.35 387.04 393.17 374.75 350.56 340.17 331.32 320.57 311.64 304.52 299.15 298.78 299.12 296.45 294.29 295.02 297.77 301.56 304.95 310.87 316.45 320.98 319.89 317.60 318.75 322.01 327.17 333.01 343.12 354.34 357.24 352.46 347.46 345.22 344.25 345.04 349.04 356.30 365.72 383.59 398.19 399.28 390.93 385.04 381.69 389.57 406.33 420.37 437.69 463.90 504.75 542.33 557.10 547.52 531.51 516.11 509.04 502.11 507.74 515.83 511.79 
324.88 330.01 328.96 319.92 311.81 311.85 315.15 323.33 342.50 376.32 389.12 372.46 356.84 350.93 343.22 326.50 313.68 305.62 302.04 301.97 300.09 296.56 295.52 296.14 298.25 301.61 306.54 312.69 319.29 324.31 323.31 319.84 319.68 321.96 325.48 331.38 340.93 352.73 359.34 356.49 352.12 348.27 346.29 346.22 349.43 354.03 361.28 376.50 395.78 403.04 402.69 394.89 386.00 389.57 402.56 417.64 436.16 466.52 504.27 537.64 548.60 535.56 514.51 497.25 481.59 475.16 485.20 498.56 495.87 
332.25 333.37 331.24 322.20 315.53 315.31 320.95 325.58 355.80 394.71 401.15 376.38 363.58 364.34 355.37 338.21 322.70 312.75 308.11 305.50 301.24 297.99 297.28 297.93 298.45 302.48 309.00 316.35 324.25 329.47 328.87 325.17 323.19 324.08 326.12 330.32 337.04 348.91 357.39 359.52 357.75 352.20 349.29 349.60 353.18 355.38 359.71 371.53 386.91 402.24 409.60 402.32 391.41 391.38 401.00 417.80 440.43 466.57 492.80 521.44 529.12 521.39 505.61 486.22 468.70 457.20 462.19 469.32 465.59 
348.59 341.78 333.10 323.86 317.22 318.49 324.83 344.27 393.68 431.54 415.81 382.91 373.99 380.21 376.67 362.96 340.29 324.55 316.76 310.61 304.18 299.95 299.62 299.17 299.21 302.55 309.79 319.77 330.08 336.40 335.81 331.61 329.63 330.14 333.20 331.93 336.65 344.04 355.14 362.75 362.57 356.27 352.95 353.13 357.05 362.19 368.45 374.40 383.32 397.75 407.72 404.78 398.70 397.14 409.45 427.47 452.03 466.07 477.25 493.85 502.14 500.30 490.40 475.72 457.55 441.23 437.61 439.79 439.44 
366.69 354.46 339.92 327.93 320.77 321.40 327.41 359.07 413.70 444.61 415.62 390.06 391.25 413.79 427.90 407.50 369.75 341.22 327.98 318.25 308.77 303.18 301.98 301.18 300.36 301.59 308.31 320.84 331.69 336.71 335.93 334.52 335.87 341.40 341.81 341.82 341.80 345.45 355.14 365.46 365.80 360.87 357.49 355.78 360.62 370.87 381.61 383.70 388.38 395.34 405.55 412.73 412.23 412.82 422.88 444.02 464.19 463.00 460.95 466.14 470.26 469.95 464.70 455.11 439.16 425.65 422.43 423.64 425.57 
380.67 370.48 352.58 337.57 329.34 326.52 329.59 360.47 417.98 444.94 420.73 395.21 414.46 465.00 492.75 466.97 403.61 361.82 340.72 326.35 314.14 306.70 304.77 303.55 301.27 300.97 305.99 315.80 323.78 327.93 329.65 332.15 338.80 347.07 351.84 354.60 352.30 351.80 358.78 368.26 370.46 366.96 362.45 359.72 364.80 376.65 388.06 394.08 395.58 401.83 415.79 431.91 429.03 423.31 429.63 449.02 462.79 456.80 446.15 441.98 439.93 438.41 436.04 429.78 421.29 415.84 415.27 416.07 417.55 
385.60 382.53 370.75 350.79 341.44 332.53 332.35 359.78 421.46 451.46 436.43 417.84 436.67 492.26 536.39 506.85 439.26 386.33 353.77 332.72 318.26 310.08 307.22 304.63 303.70 301.67 303.46 308.77 314.74 319.67 322.62 327.20 336.63 347.30 355.65 363.13 364.15 365.10 366.55 378.53 377.90 374.34 368.47 366.42 369.54 379.73 391.46 398.92 405.92 415.20 437.60 446.97 435.06 422.06 424.36 439.24 452.83 448.53 436.82 427.50 420.73 417.84 415.87 413.13 410.96 410.44 411.33 410.21 411.33 
379.80 391.76 381.26 369.78 354.53 340.39 337.48 359.40 414.46 461.26 473.24 458.24 454.92 493.83 537.36 531.09 475.69 416.52 369.68 339.25 323.23 315.28 309.73 308.06 308.04 304.94 303.34 305.87 311.07 316.08 319.89 325.21 333.82 345.27 355.96 369.45 379.90 379.66 388.70 396.20 391.65 382.20 374.88 373.60 376.41 384.19 395.67 405.81 415.85 433.03 454.50 451.33 431.60 417.28 414.62 427.16 441.28 442.40 436.58 425.18 415.54 410.32 407.82 406.85 406.68 408.01 407.34 406.48 407.70 
370.67 388.11 392.93 390.84 370.19 355.52 348.24 357.53 400.45 457.59 499.37 495.09 477.67 489.04 530.30 545.72 508.20 444.73 386.39 350.96 332.89 322.07 314.63 313.58 313.54 309.35 306.12 306.95 311.80 318.34 323.63 327.36 336.57 346.80 361.67 375.45 391.81 404.38 418.33 417.13 402.96 386.07 379.80 380.46 379.32 387.02 397.61 410.08 425.38 448.55 460.64 445.48 424.40 409.17 404.81 414.25 428.17 437.98 437.56 428.31 417.46 409.90 405.71 403.55 403.11 404.03 402.91 403.58 405.64 
361.06 380.40 402.81 403.43 392.71 378.65 362.99 357.33 380.21 433.06 482.18 504.02 503.99 501.33 532.93 552.44 520.60 457.71 400.72 363.39 343.44 329.92 320.48 319.42 319.05 313.72 309.59 309.77 314.78 325.27 330.44 334.03 342.40 355.17 367.77 383.38 404.18 425.93 432.16 420.26 399.68 383.10 381.80 379.84 376.08 381.22 393.55 410.86 429.73 451.14 453.61 433.83 413.03 398.58 393.08 399.68 415.26 430.41 435.66 430.80 420.95 410.65 402.98 398.72 396.74 396.10 398.03 399.79 402.58 
351.17 370.10 392.78 412.90 411.38 396.40 372.42 357.58 366.12 397.24 443.11 496.39 523.65 521.64 541.62 550.64 520.14 462.07 406.65 372.16 352.08 336.00 327.05 325.12 323.72 316.90 312.26 312.06 320.03 331.43 337.53 341.49 348.04 361.59 373.39 388.17 409.21 423.57 420.11 402.53 383.28 374.17 376.05 373.17 367.13 371.26 385.84 403.33 420.62 439.91 439.25 420.89 402.01 388.42 382.03 389.33 406.30 423.93 434.26 434.82 423.59 410.85 401.55 393.70 388.59 389.29 392.19 395.61 400.63 
339.85 352.20 377.80 404.60 409.22 392.84 366.80 353.80 357.19 373.05 409.37 474.21 510.76 522.56 549.61 557.17 529.46 469.70 415.47 379.10 358.77 343.62 334.06 331.91 326.48 319.03 314.45 314.48 324.36 335.51 344.52 350.23 354.61 363.52 377.08 390.54 402.21 406.71 396.97 379.26 364.96 361.72 366.75 363.31 357.71 362.06 376.09 390.25 405.92 424.16 426.78 411.25 393.95 380.57 375.67 384.10 402.00 421.76 435.93 437.05 427.30 415.37 402.70 391.11 382.82 383.56 387.89 392.08 393.14 
330.19 337.80 360.30 380.25 383.53 367.82 350.19 347.00 350.02 358.57 383.86 433.03 469.27 513.69 557.46 577.14 554.45 499.11 434.33 394.16 368.69 353.08 342.90 336.44 328.40 322.23 316.56 317.33 326.28 339.08 353.51 361.40 363.67 371.66 386.15 390.83 389.59 387.58 376.00 360.98 350.89 352.08 356.16 353.40 350.89 355.99 367.93 378.83 394.13 414.07 419.01 404.09 387.68 375.12 371.32 380.16 398.81 417.09 433.57 438.82 434.84 422.89 408.22 390.15 379.33 381.09 385.46 387.07 383.01 
322.94 331.63 345.02 352.02 350.33 343.92 344.86 347.47 349.50 352.36 366.10 396.40 438.22 499.14 555.43 599.32 597.94 540.01 470.40 414.10 382.82 364.14 352.02 340.58 333.01 327.94 320.49 321.11 327.90 340.48 357.27 369.44 374.60 386.37 395.85 388.23 377.83 370.82 360.07 348.46 342.27 343.53 345.90 345.60 346.17 351.41 359.98 370.19 386.77 408.18 412.26 397.89 382.99 371.51 367.39 375.69 390.18 409.31 427.64 439.79 442.60 433.34 415.20 391.07 379.58 378.99 380.79 379.65 377.82 
317.85 325.26 329.07 329.45 329.77 338.43 353.53 358.67 355.64 353.88 361.22 379.47 415.37 470.31 543.95 613.75 635.55 582.89 500.58 436.93 397.45 375.89 360.18 346.40 340.33 333.19 325.66 324.33 328.45 337.77 354.58 370.17 380.03 394.42 399.93 386.95 371.45 361.06 350.20 340.21 336.11 336.21 337.96 340.25 343.10 346.82 354.33 363.40 380.70 402.38 407.55 396.55 380.83 368.71 363.08 368.77 382.26 400.45 419.34 438.59 446.05 438.88 416.47 391.15 376.70 372.74 372.88 375.06 377.82 
312.37 315.31 318.73 317.83 323.08 338.58 356.11 363.70 364.30 366.60 368.48 373.72 395.94 442.74 518.99 610.97 644.78 602.83 528.80 461.65 412.68 384.23 364.92 352.85 344.48 334.60 328.29 326.69 329.01 337.42 355.43 367.88 376.62 393.43 402.02 388.69 371.48 358.62 345.77 335.75 331.04 330.85 333.17 336.63 340.41 345.60 351.91 360.89 376.29 398.18 406.89 395.71 379.80 366.01 358.71 362.27 375.19 391.15 411.68 432.46 438.50 427.06 406.40 384.98 369.92 365.44 369.01 374.67 381.63 
312.70 318.28 318.03 318.20 322.70 332.69 348.88 361.78 376.41 383.11 381.19 377.71 387.60 419.72 486.63 571.02 619.97 603.73 556.94 492.29 432.87 391.21 371.33 356.80 345.10 334.49 327.52 326.25 330.34 343.74 358.97 364.71 370.82 390.54 398.55 386.99 371.71 359.01 344.49 332.36 327.16 327.03 330.12 334.67 339.44 346.20 355.34 362.08 374.45 390.12 397.78 389.70 377.03 362.41 354.82 356.09 367.64 383.43 405.66 423.10 420.98 406.65 392.98 375.12 364.98 364.62 369.46 377.55 384.67 
323.65 328.63 329.00 325.40 325.41 332.88 344.70 359.81 377.81 391.71 391.13 391.38 391.34 403.76 443.02 512.15 560.87 581.44 574.31 528.18 460.01 406.26 376.43 358.35 345.77 333.59 325.56 323.30 328.49 342.47 355.97 360.67 365.48 378.64 384.29 377.22 367.82 355.78 341.07 328.82 323.84 325.07 329.31 334.65 340.15 349.54 358.57 364.94 370.88 375.54 380.50 378.75 369.10 358.17 350.85 350.54 360.66 378.88 401.69 416.01 406.12 394.08 381.37 370.41 367.75 368.89 373.38 380.81 387.56 
336.67 346.49 348.25 335.87 334.58 339.36 348.44 356.72 373.41 389.09 404.39 405.64 407.94 401.78 414.89 453.46 493.37 541.48 575.71 547.98 491.99 429.33 381.93 359.41 344.74 333.12 324.19 318.98 321.55 331.96 346.97 352.19 354.95 359.15 364.76 362.96 355.65 345.49 333.37 324.44 321.53 324.13 329.79 336.40 344.52 353.16 362.01 371.51 367.45 363.18 363.86 365.03 359.77 353.99 346.67 345.45 355.85 374.46 398.54 407.83 397.05 387.33 377.44 372.00 373.28 375.80 380.06 387.56 396.23 
348.39 370.39 368.96 352.31 343.39 350.48 360.30 361.68 371.88 389.87 404.21 425.94 430.22 417.43 417.23 427.81 455.45 503.79 546.48 552.36 515.81 457.08 397.28 363.27 344.32 332.91 323.13 317.09 315.23 321.36 332.04 340.31 338.99 340.57 346.93 345.06 338.34 331.08 324.14 319.98 320.18 322.77 329.41 338.17 348.19 358.17 370.02 374.87 365.28 354.93 351.68 353.14 352.36 348.05 341.43 339.98 348.52 368.67 390.53 393.84 387.88 382.63 377.01 372.98 377.76 381.22 391.82 401.41 414.43 
360.27 388.30 392.32 371.22 356.43 367.66 372.16 368.48 372.57 381.91 403.74 427.17 439.01 437.35 434.66 442.92 440.83 470.98 504.39 526.56 520.91 482.24 423.90 375.62 347.98 332.50 322.87 316.87 312.25 311.83 318.46 324.38 322.59 326.72 332.88 328.76 322.70 319.21 317.36 317.31 317.97 321.20 326.81 336.54 349.43 363.35 371.02 369.86 360.06 349.47 341.78 343.00 344.12 341.69 334.16 333.59 342.25 360.31 375.89 377.40 377.01 379.20 376.49 371.92 373.55 388.26 401.62 421.56 435.42 
369.33 400.78 414.65 396.35 376.95 375.82 372.01 369.15 369.56 377.91 392.24 414.84 430.64 442.34 454.24 455.07 436.67 439.23 458.15 480.88 502.58 493.17 451.65 393.75 354.77 333.87 322.43 315.38 309.53 306.25 308.14 310.68 310.91 318.98 322.54 316.65 313.26 313.64 313.46 314.49 316.45 320.21 327.73 336.59 352.03 362.14 362.40 357.87 352.17 342.23 332.53 333.04 335.60 331.89 330.90 329.86 336.51 350.54 359.78 362.67 366.56 373.68 372.31 363.88 373.57 392.09 411.20 436.51 454.08 
369.37 407.95 427.76 407.02 381.61 369.11 365.95 366.57 371.61 378.15 391.08 407.43 427.46 438.37 458.54 451.47 425.75 411.94 417.98 431.84 463.12 487.64 462.06 413.82 365.10 336.08 321.13 312.21 306.50 302.25 301.70 301.89 304.18 311.62 312.30 309.06 310.63 310.52 310.33 311.62 315.43 325.95 335.63 343.64 352.74 354.67 350.00 343.67 341.65 334.80 324.82 323.18 325.00 326.23 327.91 328.55 331.82 340.63 345.86 351.21 355.96 365.27 365.45 365.85 383.72 403.68 421.70 447.01 467.21 
367.06 393.06 406.05 390.13 368.17 360.87 361.92 369.28 379.62 387.93 406.03 424.30 428.47 429.01 441.44 430.03 402.55 391.76 385.16 389.78 423.25 457.90 468.69 429.27 379.21 341.84 320.76 308.90 301.62 297.56 296.81 296.40 298.52 303.18 304.53 307.17 309.59 307.57 306.87 308.69 317.89 333.99 342.83 344.16 345.78 342.41 334.21 328.07 331.11 326.22 317.37 318.08 319.90 323.96 328.98 328.97 330.19 333.91 340.27 344.97 351.59 361.53 367.17 381.28 404.26 421.53 438.59 457.73 474.64 
352.98 362.93 373.38 366.11 362.83 359.67 367.30 381.19 391.77 406.36 430.01 433.05 415.77 404.68 407.05 396.70 378.98 373.09 362.81 362.76 385.96 433.90 461.80 438.45 394.69 351.43 322.82 305.91 296.21 293.18 293.66 293.77 295.43 299.33 303.50 308.37 308.04 304.63 304.70 307.71 318.88 333.02 337.25 333.50 330.01 325.05 317.74 315.88 320.33 317.43 316.12 318.65 321.43 327.30 332.28 333.14 334.66 337.36 341.64 348.13 355.19 365.32 375.62 396.95 421.82 444.35 459.10 471.32 486.15 
337.71 344.55 352.66 362.09 367.19 368.40 377.04 390.78 403.33 422.51 434.26 416.91 388.75 372.94 371.38 363.53 357.59 353.43 346.91 345.51 363.23 410.60 437.23 432.76 399.15 363.80 328.66 304.35 291.89 290.67 292.48 293.80 297.36 301.59 306.78 308.79 305.73 303.00 302.96 305.40 313.76 323.14 323.10 317.67 314.77 312.06 309.04 311.28 315.00 316.09 319.13 322.81 325.85 330.31 335.17 338.70 342.51 345.46 348.85 353.48 362.12 368.97 383.72 403.76 433.45 462.63 475.52 491.05 507.99 
329.45 333.72 345.00 364.22 368.91 372.02 378.38 391.03 406.83 432.38 430.63 398.10 366.54 347.56 342.09 337.08 334.93 335.87 335.70 336.52 352.39 379.66 399.69 402.88 398.12 372.31 334.80 303.00 289.17 289.34 292.47 296.75 299.61 304.70 306.32 305.51 301.66 299.08 299.06 300.66 305.61 310.98 310.09 307.84 308.24 308.56 310.01 313.78 316.96 319.66 323.95 327.44 329.30 332.15 335.88 340.69 347.52 352.10 354.38 358.39 364.42 374.54 387.01 406.84 437.04 466.42 490.07 516.31 538.27 
322.95 330.85 343.55 357.24 362.40 372.50 379.86 392.93 416.44 442.40 426.44 392.30 354.64 332.54 323.23 316.43 319.93 325.05 332.70 339.12 344.39 350.63 358.35 371.77 382.86 368.45 333.84 299.65 287.05 288.28 293.02 295.53 298.64 300.27 300.11 298.56 295.35 294.84 294.45 295.58 299.26 302.42 302.66 304.49 307.11 309.92 313.44 316.97 319.62 323.12 327.89 330.74 332.66 334.20 336.34 340.96 347.21 355.58 359.26 361.37 367.28 378.82 390.96 410.17 436.44 465.19 500.68 539.22 564.83 
327.09 344.36 348.93 350.90 367.50 383.64 392.76 396.82 414.79 428.02 413.89 384.93 350.32 326.57 312.38 307.04 310.26 326.30 343.44 346.61 339.57 330.97 329.31 341.37 355.05 351.19 322.19 293.90 284.30 286.21 289.16 290.73 291.81 292.43 292.48 292.02 292.73 292.70 292.89 295.08 297.28 298.90 300.42 303.26 306.20 309.80 313.80 317.32 320.27 324.59 329.35 332.86 334.85 337.78 339.91 341.56 347.80 357.45 363.34 366.75 371.47 382.43 397.14 416.21 437.89 467.66 503.88 541.87 572.67 
346.36 365.12 360.98 362.52 380.12 391.11 386.73 378.68 384.04 387.64 385.13 369.73 346.91 324.80 307.25 299.24 311.65 335.52 354.37 350.84 336.85 320.47 314.12 318.59 327.46 326.59 305.61 287.23 281.49 282.12 283.98 285.29 286.15 287.09 288.14 290.66 293.34 294.85 296.28 298.03 299.44 300.96 302.73 304.16 305.42 308.47 312.17 315.97 319.40 324.37 329.05 332.83 336.99 340.86 344.94 345.58 350.17 359.25 368.93 373.45 378.40 385.83 401.17 420.97 446.04 469.91 495.83 527.64 560.90 
358.64 373.90 371.17 372.55 381.15 375.79 357.93 344.78 342.10 343.45 348.75 350.50 340.81 320.57 300.68 297.24 312.46 341.84 358.09 349.20 334.11 317.24 309.80 305.99 307.80 303.95 291.63 282.74 280.09 280.34 282.26 283.79 285.16 285.97 288.61 292.07 295.80 298.04 299.74 301.48 303.32 305.46 307.21 307.31 307.54 310.30 312.37 315.18 319.09 323.14 328.77 334.05 338.57 343.03 348.63 350.68 353.38 361.23 371.62 379.50 383.48 388.66 401.67 423.14 444.87 463.23 482.37 509.47 546.37 
353.06 364.75 365.09 370.93 376.74 358.52 337.41 322.85 313.17 311.15 318.89 330.61 327.40 310.31 294.78 294.20 312.26 344.75 349.17 341.76 328.55 316.08 307.36 299.74 294.05 288.44 282.83 281.51 280.64 281.27 283.42 285.88 286.87 288.33 290.35 293.43 296.53 298.83 300.93 303.16 305.38 308.38 310.39 311.48 314.93 316.15 315.53 316.51 319.52 323.39 329.42 336.43 340.68 344.97 349.70 354.04 355.89 360.37 370.15 379.34 385.46 391.51 401.69 417.00 432.28 448.96 469.29 497.82 531.65 
343.68 341.36 350.67 371.82 388.72 369.03 350.84 331.59 308.18 294.10 299.39 309.71 309.69 297.63 289.04 291.93 313.51 337.13 333.32 326.81 319.45 309.87 300.94 290.39 282.64 278.02 278.74 279.74 280.62 284.03 284.69 286.28 288.09 290.04 291.55 293.63 296.08 298.34 300.72 302.41 305.26 308.45 311.51 316.51 321.95 323.18 319.56 319.42 320.42 324.63 330.51 337.50 342.67 345.90 350.62 355.70 356.76 358.41 365.94 374.52 382.81 391.18 400.77 410.33 423.11 436.61 457.04 483.05 514.28 
326.33 324.28 341.08 386.13 412.40 410.59 388.44 365.14 322.03 289.70 286.37 292.43 292.00 285.92 284.36 289.16 312.62 328.52 322.09 312.35 305.72 298.96 288.67 278.92 273.38 273.81 276.98 280.34 286.52 292.79 292.21 287.27 288.40 290.71 292.50 294.50 296.49 298.55 300.17 301.47 304.37 307.51 312.15 319.36 327.23 330.89 325.63 321.59 322.76 326.86 330.58 337.12 343.13 347.17 351.81 357.37 358.66 358.86 363.19 369.83 376.95 387.07 397.22 408.50 419.38 431.16 446.58 467.39 493.63 
310.70 314.12 335.91 398.13 432.33 428.62 417.60 395.22 338.24 290.67 277.62 278.59 278.69 276.94 278.08 284.95 310.72 324.59 313.71 298.59 292.99 287.46 277.86 271.35 270.74 274.21 279.99 287.42 304.97 316.06 313.65 302.66 294.62 293.54 294.51 296.17 298.29 300.66 301.53 302.45 304.33 308.05 312.94 321.11 335.81 342.12 332.78 325.77 326.82 330.45 333.46 337.97 343.79 347.76 354.41 361.72 363.65 364.37 366.46 370.31 375.97 383.49 395.25 408.15 420.88 433.64 446.37 461.33 486.02 
303.37 305.07 338.99 389.79 420.08 406.83 405.95 388.88 332.18 286.89 270.54 268.76 268.67 269.95 270.59 278.69 298.57 308.03 297.38 285.02 281.64 277.26 271.48 271.56 273.19 277.28 284.26 299.43 321.90 345.46 348.45 332.57 311.41 300.42 298.85 299.53 301.76 304.71 304.79 304.21 306.24 309.20 313.40 324.81 346.14 350.58 340.31 333.60 332.14 335.67 338.62 341.45 344.97 349.35 355.74 367.01 371.94 372.79 373.26 378.61 383.06 386.44 395.67 410.17 427.32 442.75 453.76 470.97 498.58 
298.05 303.68 335.23 374.88 383.70 359.31 353.20 340.58 305.57 276.46 264.80 265.22 263.97 264.56 263.92 267.91 278.14 284.29 279.23 273.52 272.25 270.72 273.19 279.71 280.11 282.38 288.19 302.85 329.24 361.11 375.08 364.37 336.02 316.54 307.30 304.32 306.55 309.29 308.26 306.81 308.25 310.43 314.24 328.40 347.50 350.79 347.79 340.60 337.18 339.64 342.90 346.24 348.28 349.35 358.36 371.20 378.70 379.14 383.44 391.50 395.84 393.96 400.56 416.09 434.84 450.56 464.84 494.40 524.80 
289.99 301.54 322.41 352.81 342.02 310.08 297.78 290.96 277.95 267.45 266.89 268.04 265.20 262.86 261.69 260.88 265.21 270.24 270.73 270.44 270.89 272.66 283.17 290.99 293.06 290.56 292.31 301.27 324.79 354.22 385.08 386.44 369.83 342.44 321.03 311.76 312.35 314.56 312.32 309.72 311.22 312.71 315.39 326.47 337.98 347.47 351.82 345.12 340.99 341.64 346.11 350.46 352.48 353.44 360.91 371.42 380.12 385.41 392.63 405.41 408.90 405.22 409.13 422.64 440.55 454.67 480.56 532.03 567.83 
276.54 284.54 305.88 320.33 304.60 279.04 266.82 264.18 266.50 265.27 271.68 274.45 275.80 273.42 268.06 267.39 267.09 269.59 272.92 275.70 277.15 281.30 292.13 305.51 308.34 301.21 296.33 301.73 314.00 342.22 376.45 402.79 404.38 373.68 338.77 321.81 318.74 320.24 316.11 313.80 315.19 316.47 317.14 320.97 330.71 346.87 352.70 348.02 343.14 343.27 347.51 354.01 357.88 358.47 362.09 369.21 378.09 386.24 396.48 411.61 419.16 417.95 420.06 428.76 441.71 460.44 508.75 574.87 621.47 
260.11 270.36 284.81 288.02 277.38 263.66 256.08 261.79 266.57 267.58 274.35 286.66 292.83 292.75 290.85 286.20 281.12 278.84 280.45 283.76 286.59 290.27 303.23 316.93 322.77 310.84 304.31 304.16 310.59 330.49 364.65 411.62 425.95 401.75 359.26 332.35 326.15 324.95 320.08 318.04 320.87 322.82 320.25 319.86 331.09 346.50 351.42 348.68 345.79 345.99 350.18 357.55 361.62 364.36 365.27 369.30 375.43 382.86 394.15 411.69 424.24 430.10 435.24 436.71 447.09 475.98 537.31 620.00 675.13 
251.99 260.18 267.26 267.43 262.88 257.59 259.65 270.32 274.38 273.26 278.97 292.24 303.61 306.39 307.08 303.61 297.51 290.34 290.45 294.35 297.29 302.53 312.81 329.32 337.19 324.77 313.66 309.78 313.87 325.77 359.38 403.92 434.73 421.22 376.04 345.55 334.36 330.44 324.19 322.83 326.51 327.37 323.32 323.01 332.05 343.33 348.27 349.67 349.79 351.64 355.91 360.76 366.75 370.67 371.71 373.27 376.97 382.78 392.29 407.05 423.54 442.67 447.10 447.78 460.14 492.11 560.98 647.53 714.34 
250.46 254.08 257.54 258.83 258.05 260.11 267.96 282.89 288.71 281.32 282.16 292.19 301.79 303.64 308.04 309.81 305.65 303.00 302.11 308.09 314.19 321.48 331.14 353.32 362.25 341.24 322.89 319.84 320.64 328.41 351.82 390.55 429.91 425.74 390.43 359.13 344.24 336.44 329.53 326.75 327.88 329.40 326.84 325.83 332.51 340.40 347.01 352.30 355.36 359.45 362.84 367.13 373.00 376.81 379.48 380.69 383.38 386.70 391.87 402.76 421.50 440.79 447.40 454.57 467.00 496.90 564.61 650.95 733.58 
255.58 254.41 256.16 257.55 259.79 263.68 280.14 298.78 300.34 290.39 286.64 295.26 299.67 301.48 307.96 311.55 312.85 310.73 315.23 324.14 339.30 348.48 360.53 385.29 385.82 360.65 341.42 333.66 328.33 331.49 346.23 378.77 417.50 424.41 398.77 370.16 353.90 343.16 334.99 329.32 329.95 331.44 330.25 329.62 334.36 340.74 349.82 356.30 362.33 366.91 371.42 375.93 380.48 385.96 390.20 391.76 392.19 393.54 396.03 402.40 415.97 430.30 440.97 452.77 464.79 495.15 554.48 643.17 712.20 
269.36 262.45 260.41 261.34 261.47 276.59 291.97 305.64 305.39 296.02 293.61 302.18 306.02 311.97 321.56 331.77 329.58 323.73 324.07 340.87 356.29 363.84 378.40 400.11 399.46 381.98 371.28 354.24 344.94 342.18 347.12 375.90 409.98 415.77 400.56 377.41 360.00 348.57 340.15 334.99 333.99 335.74 334.70 334.31 337.39 344.34 354.00 362.72 369.48 375.84 382.87 386.51 392.17 400.74 404.38 403.33 402.64 402.25 403.55 407.15 415.51 425.55 437.99 451.32 468.51 487.72 546.31 618.53 676.41 
285.90 275.52 269.84 264.67 273.04 283.30 291.84 298.26 301.56 297.74 302.71 313.33 321.30 332.70 357.10 370.83 367.00 349.49 338.93 344.24 352.09 362.99 375.41 389.99 396.85 403.28 396.65 386.92 374.97 364.48 362.42 381.58 403.33 415.29 401.04 382.28 370.22 355.82 347.88 343.17 340.94 341.24 340.76 338.76 341.29 349.30 359.55 369.82 378.29 389.50 396.93 403.54 409.55 414.80 418.39 418.40 416.66 415.82 415.82 417.92 423.94 430.57 441.67 460.54 473.51 493.14 539.25 598.06 656.70 
309.73 295.41 280.05 271.61 274.69 275.80 274.82 283.00 288.56 297.70 311.82 327.51 334.77 353.98 383.35 408.38 409.88 385.09 358.61 347.59 351.11 359.07 369.32 380.90 392.67 404.12 411.90 413.81 411.84 395.16 385.58 394.52 413.46 428.06 418.39 403.99 395.30 378.15 363.67 354.82 349.31 348.57 346.09 343.30 346.45 355.08 366.25 378.30 392.63 408.36 419.39 430.68 430.45 437.59 449.66 457.78 458.11 455.34 449.08 445.08 444.58 448.69 458.30 475.34 491.67 514.96 550.75 597.78 642.83 
349.98 319.74 292.73 274.46 267.72 258.95 257.21 262.99 274.44 290.40 309.68 326.75 340.35 357.44 377.83 408.97 423.71 406.55 385.60 366.80 365.36 373.21 392.51 399.18 397.27 403.35 416.93 431.89 438.05 422.78 418.53 412.52 433.76 454.09 456.18 448.06 436.64 419.59 391.16 371.32 360.29 355.67 351.05 348.34 352.24 361.96 374.00 390.19 414.18 436.90 455.68 464.66 468.87 488.72 513.34 526.01 527.54 518.55 497.72 482.24 476.44 480.91 482.58 503.21 528.44 553.69 585.17 618.53 652.94 
382.99 347.01 305.30 282.39 261.21 248.13 243.63 247.73 259.06 270.73 292.98 313.96 337.12 338.76 342.28 373.30 397.08 406.48 401.82 401.00 399.67 422.20 435.64 428.81 410.52 411.84 422.61 447.91 449.89 451.71 444.39 428.02 438.24 475.36 487.53 487.91 484.06 461.39 425.55 392.59 372.89 363.51 356.27 353.47 358.25 367.93 382.84 405.87 447.03 477.03 496.78 506.97 519.14 538.20 558.87 567.45 566.23 548.61 518.75 494.97 496.44 496.10 510.81 545.13 578.99 614.23 644.74 665.95 687.48 
395.12 355.94 328.35 291.65 264.83 245.54 235.70 236.36 242.02 256.28 271.31 300.94 318.10 305.35 309.21 332.40 355.99 381.94 415.94 433.62 445.30 448.93 446.85 421.23 405.38 401.23 420.02 439.86 442.58 457.48 456.45 425.17 422.34 463.55 492.67 509.37 516.12 493.70 455.01 420.57 394.40 377.00 364.58 359.51 363.42 375.91 391.23 427.66 481.63 522.79 538.00 535.44 534.31 546.94 563.63 562.33 557.33 534.02 497.30 474.05 477.89 486.98 522.48 571.56 624.94 673.92 704.97 724.33 745.33 
369.77 358.08 337.56 309.90 281.45 252.20 231.68 227.70 234.50 244.13 258.61 281.95 284.04 280.52 291.32 303.52 327.91 364.50 402.57 429.67 433.04 422.44 401.41 379.10 363.44 365.98 390.02 401.89 414.66 449.05 451.39 403.37 392.53 425.78 473.19 515.50 533.39 517.57 481.11 449.28 421.32 399.37 381.72 371.91 372.70 382.17 400.51 446.22 516.15 564.18 554.79 527.67 518.79 547.77 566.77 558.53 539.49 506.53 467.79 448.72 456.30 478.08 508.03 555.89 616.81 672.83 711.62 746.42 775.79 
338.32 337.17 341.71 335.22 305.34 259.10 230.58 223.39 228.96 235.49 250.21 258.98 261.21 271.94 282.56 298.68 319.58 336.05 362.24 381.59 384.29 363.76 347.64 338.48 331.68 341.51 359.95 377.07 404.50 445.40 429.51 379.61 357.26 381.43 440.83 507.44 538.92 523.75 498.22 466.90 440.14 419.97 404.52 390.99 385.64 388.78 410.01 460.15 540.86 580.68 546.55 502.32 503.17 547.38 565.63 545.15 511.25 478.71 449.47 452.52 470.82 486.35 504.88 534.34 570.26 609.01 648.61 693.97 735.75 
302.54 308.89 339.96 343.87 304.10 255.98 228.61 221.54 224.01 230.31 241.37 247.58 259.22 269.89 279.57 300.93 311.26 313.23 321.80 339.01 333.56 318.94 321.68 328.61 340.07 343.72 359.91 388.66 426.42 439.60 408.54 356.65 326.78 346.68 405.55 472.41 511.37 521.85 501.20 474.18 442.47 428.06 415.59 405.70 399.23 404.37 417.98 465.13 548.36 582.02 533.69 474.42 481.22 513.78 527.21 494.98 462.17 445.55 447.73 465.14 497.54 526.63 543.40 553.49 565.34 572.14 595.95 629.96 674.56 
268.67 283.54 310.65 307.75 275.50 242.61 224.92 220.00 220.72 227.09 233.13 245.21 257.39 263.48 278.72 296.45 306.30 306.38 303.15 308.01 300.26 300.06 316.07 346.88 365.01 371.22 391.66 429.76 444.41 424.42 382.36 335.07 313.89 323.25 368.88 418.81 465.00 489.35 496.69 478.33 453.46 429.48 411.69 409.87 412.38 420.71 430.58 470.06 553.53 577.50 513.40 456.19 445.78 465.67 454.04 430.94 417.09 420.98 436.34 465.76 507.57 544.98 571.97 600.27 612.11 625.10 632.60 645.79 666.48 
245.06 250.51 262.65 259.71 243.94 229.28 221.35 218.97 219.71 222.05 227.56 238.54 249.90 258.26 270.57 291.32 306.46 298.65 286.60 283.52 285.68 294.75 329.16 370.15 404.08 429.09 463.08 475.06 447.33 404.46 361.99 324.74 302.65 313.65 336.27 362.87 398.78 438.18 476.50 485.42 467.49 437.04 406.13 399.59 416.05 435.37 445.81 486.46 556.15 553.22 486.06 433.81 420.30 411.11 401.06 394.27 390.73 405.34 427.07 454.96 484.97 519.36 557.64 602.26 655.09 690.21 693.78 693.93 719.68 
227.01 225.65 228.71 227.62 223.96 220.94 218.37 217.91 218.55 219.16 221.84 232.48 240.80 248.55 261.82 277.15 284.15 275.87 269.13 271.77 280.24 309.99 347.55 399.34 459.90 507.24 529.92 515.64 454.70 396.16 353.88 316.88 298.81 297.91 304.83 318.66 343.17 389.01 427.69 453.63 458.63 428.54 394.52 391.41 410.77 432.81 451.51 490.97 520.05 497.49 441.21 407.75 391.82 382.99 386.40 387.51 392.29 416.43 446.33 462.01 474.56 499.24 528.29 579.86 644.59 676.32 676.39 687.27 712.84 
217.36 217.80 218.51 215.34 218.69 219.19 216.95 216.59 217.43 217.14 219.28 225.81 231.64 238.65 245.51 250.93 255.65 254.30 260.25 272.10 290.00 322.64 366.07 434.25 490.67 531.87 556.93 532.70 454.95 388.81 345.51 311.88 290.13 281.06 282.03 292.55 316.27 339.37 362.51 390.92 406.82 396.45 385.97 402.83 416.38 430.84 438.57 449.71 451.76 427.31 395.41 378.89 369.88 375.84 394.25 402.11 420.84 454.70 491.08 510.46 527.03 541.76 558.83 577.51 605.30 611.72 602.65 613.94 633.54 
221.14 234.33 237.30 240.20 233.15 223.37 224.13 218.08 216.99 216.68 217.90 220.42 223.52 226.94 230.76 236.02 240.52 247.29 263.10 279.39 296.64 328.82 385.93 428.72 459.80 495.39 523.74 510.08 437.13 370.36 328.66 301.01 280.76 268.40 271.59 284.86 304.66 314.21 323.91 338.40 353.02 364.15 397.81 434.68 450.87 445.99 431.03 414.78 400.89 379.68 362.83 357.72 352.30 375.53 404.06 423.60 442.56 483.53 549.30 591.06 612.10 625.86 615.82 597.70 578.38 556.47 532.56 534.16 536.96 
237.17 269.88 299.48 288.92 258.62 248.90 241.37 226.19 217.77 216.64 216.93 217.48 217.81 220.76 224.87 234.65 240.57 248.29 264.74 279.70 297.66 337.45 380.01 386.75 397.36 417.47 460.02 467.58 413.62 346.78 306.50 281.43 265.80 267.60 274.57 289.78 310.02 321.64 334.06 336.83 338.12 354.57 402.81 447.28 465.25 458.98 437.33 416.17 395.81 366.55 349.65 333.53 342.16 372.35 405.38 424.95 441.45 501.99 584.10 629.55 639.88 649.48 640.58 605.40 557.71 509.64 481.70 473.65 478.29 
252.92 315.04 360.09 330.23 299.12 290.23 272.88 243.45 224.24 217.56 216.64 216.61 216.59 217.44 224.03 236.43 245.34 249.60 264.21 275.12 300.99 343.69 355.26 342.44 336.26 348.41 400.46 431.48 386.06 322.86 282.99 260.14 261.09 273.24 282.63 297.79 321.61 361.85 383.77 382.25 370.81 368.80 392.26 416.41 431.24 429.15 426.10 422.72 403.04 363.01 332.49 327.47 341.72 381.61 412.72 426.45 447.57 508.55 571.08 586.17 588.19 598.63 610.61 579.38 513.47 468.49 450.35 447.89 472.43 
266.13 344.02 382.36 363.34 348.16 350.08 320.33 271.26 237.47 220.52 217.15 216.95 216.32 216.16 222.37 237.51 247.73 255.46 264.85 280.66 311.31 345.98 345.08 329.02 302.26 304.72 356.45 387.44 354.25 298.78 263.77 253.88 265.71 276.20 281.24 296.94 341.41 392.14 430.64 446.92 437.30 414.63 393.97 379.90 375.42 378.17 387.81 395.71 377.84 343.93 325.78 332.58 366.31 405.87 432.87 447.93 465.55 495.30 526.95 520.00 510.28 521.49 533.66 502.66 459.06 443.37 446.73 473.10 533.23 
289.64 354.90 387.96 400.44 424.74 414.32 363.12 304.83 254.21 225.27 217.85 217.14 216.52 215.28 222.02 234.96 247.04 264.07 276.85 291.95 329.74 359.59 360.55 339.22 300.36 283.53 313.00 341.69 319.52 274.01 254.47 256.78 266.13 269.83 270.37 293.16 332.49 378.22 425.51 474.59 485.06 459.10 400.89 356.66 334.39 336.31 345.77 354.13 347.04 325.01 316.73 334.91 371.97 406.63 430.66 446.95 449.70 466.73 472.68 468.54 448.42 436.91 440.43 433.81 438.86 465.31 506.86 554.30 600.18 
345.07 381.45 425.62 482.70 493.10 458.16 400.52 338.67 272.46 232.45 218.55 216.28 216.01 216.34 220.91 232.46 252.25 274.37 288.06 301.50 331.83 355.35 369.55 358.12 311.80 274.99 280.53 301.34 281.29 253.29 244.63 251.05 258.67 256.64 258.75 274.59 292.48 317.36 368.88 427.67 463.39 444.75 387.85 333.63 307.08 304.54 313.36 324.65 324.48 307.23 299.70 313.46 343.24 366.75 388.82 406.25 420.34 426.57 426.80 423.92 396.97 379.95 396.56 431.94 487.22 551.46 606.93 626.31 616.15 
415.50 444.56 508.78 550.01 527.80 476.22 428.16 359.42 290.13 238.91 219.65 215.39 214.96 216.18 220.11 232.51 254.74 280.17 292.06 290.52 303.49 324.62 353.93 354.40 320.43 271.79 258.34 262.98 248.96 234.22 232.17 238.09 244.31 241.19 242.87 248.44 252.19 261.86 292.76 338.21 378.34 380.54 347.84 304.89 278.05 271.41 277.68 292.18 300.58 288.79 278.21 286.29 306.79 325.10 345.34 381.09 411.75 414.34 401.44 384.29 363.06 367.59 406.83 488.95 561.42 628.07 657.30 630.59 577.76 
449.01 489.53 558.58 562.59 510.44 461.84 419.88 363.13 294.02 244.76 225.43 220.00 215.68 214.63 218.68 229.12 252.26 286.04 289.13 273.86 268.04 285.68 312.35 329.03 303.05 259.05 239.44 235.87 231.66 226.10 222.91 226.37 229.19 228.28 230.47 232.89 232.74 232.07 241.02 263.94 292.26 305.46 296.04 272.48 252.89 250.24 250.11 262.84 273.05 267.70 260.83 267.99 285.84 301.38 331.03 385.09 440.93 442.60 402.11 358.39 351.87 372.24 453.13 535.57 583.23 625.93 633.36 577.40 536.99 
437.85 490.76 547.87 526.31 463.90 419.44 385.51 340.57 289.67 254.10 245.24 231.39 218.88 214.78 215.73 226.13 254.68 286.72 284.46 258.33 245.43 250.86 269.22 279.68 264.61 240.76 229.06 229.16 231.46 228.59 223.61 224.60 224.42 226.23 229.14 232.23 232.55 227.98 226.36 231.32 244.67 257.09 256.02 248.83 251.54 252.81 246.34 247.03 250.56 253.05 252.57 260.52 271.21 290.58 325.30 389.91 456.55 468.42 414.59 357.40 344.27 391.37 488.52 532.76 550.35 570.32 567.47 517.49 515.66 
433.62 483.75 530.09 498.45 428.77 373.59 343.23 316.19 284.56 273.34 266.04 241.84 223.66 215.26 214.93 225.84 250.84 274.29 265.31 242.49 230.25 227.90 233.23 236.99 235.35 233.31 230.83 235.75 242.16 239.58 239.99 236.57 231.11 237.83 237.45 241.19 240.99 236.18 231.99 232.17 240.10 242.40 241.53 246.21 263.02 275.15 261.81 246.15 247.72 251.24 255.18 259.02 263.22 282.56 307.19 358.27 421.35 460.77 424.19 359.69 342.45 409.00 483.82 500.07 493.95 503.74 489.03 465.70 509.09 
