original;harmonized;2006;2009;2012;2015;2018
surv_date;survey_date;True;False;False;False;False
gps_alt;gps_altitude;False;True;True;False;False
obs_dir;obs_direct;False;True;True;True;False
lc1_species;lc1_spec;False;True;True;True;False
lc1_pct;lc1_perc;False;True;True;True;False
lc2_species;lc2_spec;False;True;True;True;False
lc2_pct;lc2_perc;False;True;True;True;False
area_size;parcel_area_ha;False;True;True;True;False
tree_height_srv;tree_height_survey;False;True;True;False;False
land_mngt;grazing;False;True;True;True;False
soil_plough;lndmng_plough;False;True;True;True;False
soil_crop;crop_residues;False;True;True;True;False
soil_stones;soil_stones_perc;False;True;True;True;False
photo_p;photo_point;False;True;True;True;False
photo_n;photo_north;False;True;True;True;False
photo_e;photo_east;False;True;True;True;False
photo_s;photo_south;False;True;True;True;False
photo_w;photo_west;False;True;True;True;False
tree_height_mat;tree_height_maturity;False;False;True;False;False
protected_area;special_status;False;False;True;True;False
lu1_pct;lu1_perc;False;False;False;True;False
lu2_pct;lu2_perc;False;False;False;True;False
trees_height_maturity;tree_height_maturity;False;False;False;True;False
trees_height_survey;tree_height_survey;False;False;False;True;False
