original;harmonized;year
0;-1;2006
C11;C10;2006
C12;-1;2006
C13;-1;2006
C21;C10;2006
C22;-1;2006
C23;-1;2006
D01;D10;2006
D02;D20;2006
E01;E10;2006
E02;E20;2006
F00;-1;2006, 2009
G01;-1;2006
G02;-1;2006
G03;G30;2006
G05;G50;2006
000;-1;2006
BX1;Bx1;2009
BX2;Bx2;2009
C20;-1;2009
C30;-1;2009
G10;-1;2009, 2012
G20;-1;2009, 2012
