

size(6cm, 4.12022659167cm);
draw((0.0,184.73865541)--(7.1428571428,147.918657127)--(14.2857142858,108.030477884)--(17.8571428572,88.5111870598)--(21.4285714286,70.108045781)--(25.0,53.4063311626)--(26.7857142858,45.8620881917)--(27.6785714286,42.3186593708)--(28.5714285714,38.937209661)--(30.3571428572,32.6868636124)--(31.25,29.8304220495)--(32.1428571428,27.1608443303)--(33.0357142858,24.6834499979)--(33.4821428572,23.51837952)--(33.9285714286,22.4031756428)--(34.375,21.3383939895)--(34.8214285714,20.3245650614)--(35.0446428572,19.8369167162)--(35.2678571428,19.3621939739)--(35.4910714286,18.900455965)--(35.7142857142,18.4517602047)--(36.6071428572,16.7884929242)--(37.0535714286,16.0364880952)--(37.5,15.3380775362)--(37.9464285714,14.6936092128)--(38.1696428572,14.3917047846)--(38.3928571428,14.1034042158)--(38.8392857142,13.5677566003)--(39.0625,13.3204762739)--(39.2857142858,13.0869332394)--(39.7321428572,12.661173692)--(39.9553571428,12.4690102117)--(40.1785714286,12.2906900819)--(40.4017857142,12.1262355146)--(40.5133928572,12.0492142856)--(40.625,11.9756669938)--(40.8482142858,11.8390032747)--(40.9598214286,11.7758911032)--(41.0714285714,11.7162613802)--(41.5178571428,11.5126024834)--(41.7410714286,11.431710849)--(41.9642857142,11.3647917716)--(42.1875,11.3118535866)--(42.2991071428,11.2906294573)--(42.4107142858,11.2729028878)--(42.6339285714,11.2479445272)--(42.7455357142,11.2407135132)--(42.8571428572,11.2369816135)--(43.75,11.333085587)--(44.1964285714,11.4650629536)--(44.6428571428,11.6529121904)--(45.0892857142,11.8965397064)--(45.3125,12.0392334714)--(45.5357142858,12.1958241201)--(45.9821428572,12.5506163203)--(46.2053571428,12.7487736786)--(46.4285714286,12.9607395404)--(46.875,13.4259894468)--(47.0982142858,13.6792155398)--(47.3214285714,13.9461342398)--(47.5446428572,14.2267122998)--(47.65625,14.3721127344)--(47.7678571428,14.5209147703)--(47.9910714286,14.828705006)--(48.1026785714,14.9876836208)--(48.2142857142,15.150044668)--(48.6607142858,15.8332104844)--(48.8839285714,16.1949515431)--(49.1071428572,16.5700718485)--(49.3303571428,16.958524675)--(49.5535714286,17.3602616375)--(49.7767857142,17.7752326947)--(50.0,18.2033861585)--(50.8928571428,20.0467329683)--(51.3392857142,21.0460368548)--(51.7857142858,22.0964391266)--(52.2321428572,23.1974164458)--(52.6785714286,24.3484202779)--(53.5714285714,26.7981890039)--(54.4642857142,29.4408637639)--(55.3571428572,32.2711786229)--(56.25,35.2834937423)--(57.1428571428,38.4718066215)--(58.9285714286,45.350674804)--(60.7142857142,52.8529816736)--(64.2857142858,69.484348078)--(71.4285714286,107.32719679)--(78.5714285714,147.224547419)--(82.1428571428,166.362818119)--(85.7142857142,184.141314428)--(89.2857142858,199.994624882)--(91.0714285714,207.038931962)--(91.9642857142,210.315138286)--(92.8571428572,213.418564914)--(93.75,216.34302779)--(94.6428571428,219.082699473)--(95.0892857142,220.381517924)--(95.5357142858,221.632120745)--(95.9821428572,222.833884851)--(96.4285714286,223.986211493)--(96.875,225.088526552)--(97.3214285714,226.140280828)--(97.7678571428,227.14095031)--(97.9910714286,227.621971452)--(98.2142857142,228.090036438)--(98.6607142858,228.987066354)--(98.8839285714,229.415919549)--(99.1071428572,229.831593134)--(99.3303571428,230.234035331)--(99.5535714286,230.623196014)--(99.7767857142,230.999026706)--(100.0,231.361480596)--(100.892857143,232.67665029)--(101.339285714,233.252880149)--(101.785714286,233.774481536)--(102.232142857,234.241194575)--(102.455357143,234.453894227)--(102.678571429,234.652786737)--(103.125,235.009052958)--(103.348214286,235.166382292)--(103.571428571,235.309815736)--(104.017857143,235.554925224)--(104.241071429,235.656570736)--(104.464285714,235.744259301)--(104.6875,235.817979996)--(104.799107143,235.849599454)--(104.910714286,235.877723637)--(105.133928571,235.923482784)--(105.245535714,235.941116323)--(105.357142857,235.955251736)--(105.803571429,235.976804973)--(106.026785714,235.966586572)--(106.25,235.942372607)--(106.473214286,235.904166096)--(106.584821429,235.879817054)--(106.696428571,235.851971796)--(106.919642857,235.785796209)--(107.03125,235.74746794)--(107.142857143,235.705647577)--(108.035714286,235.245548358)--(108.482142857,234.932002589)--(108.928571429,234.562991767)--(109.375,234.13869974)--(109.598214286,233.905888263)--(109.821428571,233.659337903)--(110.267857143,233.125145086)--(110.491071429,232.837569168)--(110.714285714,232.536387437)--(111.160714286,231.89335829)--(111.383928571,231.551590969)--(111.607142857,231.196378018)--(111.830357143,230.827763683)--(112.053571429,230.445793876)--(112.276785714,230.050516178)--(112.5,229.641979823)--(112.946428571,228.78533634)--(113.392857143,227.876290228)--(113.839285714,226.915294398)--(114.0625,226.415463956)--(114.285714286,225.902827641)--(115.178571429,223.72552449)--(116.071428571,221.348719387)--(116.964285714,218.777148479)--(117.857142857,216.015936018)--(118.75,213.070584145)--(119.642857143,209.946961926)--(120.535714286,206.651293656)--(121.428571429,203.190146464)--(123.214285714,195.79931878)--(125.0,187.833358966)--(128.571428571,170.433967117)--(135.714285714,131.768152182)--(142.857142857,92.0723661569)--(146.428571429,73.4162030551)--(150.0,56.356256926)--(151.785714286,48.596883364)--(153.571428571,41.4350871022)--(154.464285714,38.0963089655)--(155.357142857,34.9279236214)--(156.25,31.9362445663)--(156.696428571,30.5085469122)--(157.142857143,29.1272331795)--(158.035714286,26.5064868477)--(158.482142857,25.2683599718)--(158.928571429,24.079227812)--(159.375,22.9396828241)--(159.821428571,21.8502927584)--(160.267857143,20.8116003768)--(160.714285714,19.8241231826)--(161.160714286,18.8883531613)--(161.607142857,18.0047565387)--(161.830357143,17.5826618452)--(162.053571429,17.1737735442)--(162.276785714,16.7781425678)--(162.388392857,16.5853140404)--(162.5,16.395818195)--(162.946428571,15.6712780883)--(163.169642857,15.3291526027)--(163.392857143,15.0005142083)--(163.616071429,14.6854038393)--(163.727678571,14.5329339962)--(163.839285714,14.3838607466)--(164.0625,14.0959224902)--(164.174107143,13.9570664501)--(164.285714286,13.8216249358)--(165.178571429,12.8614994962)--(165.625,12.4640882263)--(166.071428571,12.1220510869)--(166.517857143,11.8355584896)--(166.741071429,11.7131870828)--(166.964285714,11.6047531724)--(167.410714286,11.4297501281)--(167.633928571,11.363202793)--(167.857142857,11.3106365481)--(168.303571429,11.2474717777)--(168.526785714,11.2368811198)--(168.75,11.240287287)--(168.973214286,11.2576898548)--(169.084821429,11.2716391797)--(169.196428571,11.2890866556)--(169.419642857,11.3344737788)--(169.53125,11.3624120124)--(169.642857143,11.3938455706)--(170.089285714,11.5545118381)--(170.3125,11.6557863012)--(170.535714286,11.7710054104)--(170.758928571,11.9001548138)--(170.870535714,11.9699484163)--(170.982142857,12.0432184247)--(171.205357143,12.2001784228)--(171.316964286,12.2838635251)--(171.428571429,12.3710152575)--(172.321428571,13.1926795)--(172.767857143,13.6861375355)--(173.214285714,14.2343608455)--(173.660714286,14.8370762914)--(173.883928571,15.1587757813)--(174.107142857,15.4939835843)--(174.553571429,16.2047554367)--(174.776785714,16.5802309521)--(175.0,16.9690377237)--(175.446428571,17.7864496608)--(175.892857143,18.6565839921)--(176.339285714,19.5790071947)--(176.5625,20.0596845174)--(176.785714286,20.5532596944)--(177.232142857,21.5788560927)--(177.678571429,22.6552854118)--(178.125,23.7820113474)--(178.348214286,24.3640610916)--(178.571428571,24.9584725356)--(179.464285714,27.4582316112)--(180.357142857,30.1495814849)--(182.142857143,36.0852308239)--(183.928571429,42.7181333465)--(185.714285714,49.9954470778)--(189.285714286,66.2467331685)--(192.857142857,84.3222476667)--(200.0,123.60679775)--(207.142857143,162.891347833)--(210.714285714,180.966862331)--(212.5,189.354399251)--(214.285714286,197.218148422)--(216.071428571,204.495462153)--(217.857142857,211.128364676)--(218.75,214.186436272)--(219.642857143,217.064014015)--(220.535714286,219.755363889)--(220.982142857,221.029512666)--(221.205357143,221.64842386)--(221.428571429,222.255122964)--(222.321428571,224.558310088)--(222.767857143,225.634739407)--(223.214285714,226.660335806)--(223.660714286,227.634588305)--(223.883928571,228.1023079)--(224.107142857,228.557011508)--(224.553571429,229.427145839)--(224.776785714,229.842468178)--(225.0,230.244557776)--(225.446428571,231.008840063)--(225.669642857,231.370937554)--(225.892857143,231.719611916)--(226.116071429,232.054819719)--(226.227678571,232.217360547)--(226.339285714,232.376519209)--(226.5625,232.684670315)--(226.674107143,232.833653163)--(226.785714286,232.979234654)--(227.232142857,233.527457964)--(227.455357143,233.781048648)--(227.678571429,234.020916)--(227.901785714,234.247030141)--(228.013392857,234.35492089)--(228.125,234.459362908)--(228.348214286,234.657887851)--(228.459821429,234.751964594)--(228.571428571,234.842580242)--(229.464285714,235.44259009)--(229.910714286,235.659083662)--(230.357142857,235.819749929)--(230.803571429,235.924508844)--(231.026785714,235.955905645)--(231.25,235.973308213)--(231.696428571,235.966123722)--(231.919642857,235.941537559)--(232.142857143,235.902958952)--(232.589285714,235.783845372)--(232.8125,235.703325236)--(233.035714286,235.608842328)--(233.258928571,235.500408417)--(233.370535714,235.440963989)--(233.482142857,235.37803701)--(233.705357143,235.24174335)--(233.816964286,235.168380912)--(233.928571429,235.091544413)--(234.375,234.749507274)--(234.598214286,234.557711675)--(234.821428571,234.352096004)--(235.044642857,234.13268587)--(235.15625,234.017816353)--(235.267857143,233.899508604)--(235.491071429,233.65259325)--(235.602678571,233.523993334)--(235.714285714,233.391970564)--(236.607142857,232.213081292)--(237.053571429,231.542317412)--(237.5,230.817777305)--(237.946428571,230.039821956)--(238.169642857,229.630933655)--(238.392857143,229.208838961)--(238.839285714,228.325242339)--(239.0625,227.86385047)--(239.285714286,227.389472317)--(239.732142857,226.401995123)--(240.178571429,225.363302742)--(240.625,224.273912676)--(241.071428571,223.134367688)--(241.964285714,220.707108652)--(242.410714286,219.420603926)--(242.857142857,218.08636232)--(243.75,215.277350934)--(244.642857143,212.285671879)--(245.535714286,209.117286534)--(246.428571429,205.778508398)--(248.214285714,198.616712136)--(250.0,190.857338574)--(253.571428571,173.797392445)--(257.142857143,155.141229343)--(264.285714286,115.445443318)--(267.857142857,95.6682698206)--(271.428571429,76.7796283826)--(275.0,59.3802365338)--(276.785714286,51.41427672)--(277.678571429,47.6431782836)--(278.571428571,44.0234490359)--(280.357142857,37.2666335744)--(281.25,34.1430113548)--(282.142857143,31.1976594816)--(283.035714286,28.4364470207)--(283.482142857,27.1266271271)--(283.928571429,25.8648761134)--(284.821428571,23.4880710097)--(285.267857143,22.3742011044)--(285.491071429,21.8361461925)--(285.714285714,21.3107678588)--(286.607142857,19.3373052717)--(287.053571429,18.42825916)--(287.5,17.5716156768)--(287.946428571,16.7678016238)--(288.169642857,16.3858318173)--(288.392857143,16.0172174815)--(288.839285714,15.3202372102)--(289.0625,14.9919580907)--(289.285714286,14.677208063)--(289.732142857,14.0884504138)--(289.955357143,13.8145161282)--(290.178571429,13.5542575965)--(290.401785714,13.3077072369)--(290.513392857,13.1895822852)--(290.625,13.0748957595)--(290.848214286,12.8558521635)--(290.959821429,12.7515019144)--(291.071428571,12.6506037331)--(291.517857143,12.2815929105)--(291.741071429,12.1178764823)--(291.964285714,11.9680471421)--(292.1875,11.8321235527)--(292.299107143,11.769381773)--(292.410714286,11.7101226445)--(292.633928571,11.6020596144)--(292.745535714,11.5532590778)--(292.857142857,11.5079479225)--(293.75,11.2712228926)--(294.196428571,11.2367905273)--(294.642857143,11.2583437635)--(295.089285714,11.3358718628)--(295.3125,11.3956155044)--(295.535714286,11.4693361989)--(295.982142857,11.6586702762)--(296.205357143,11.7742600755)--(296.428571429,11.9037797638)--(296.875,12.2045425417)--(297.098214286,12.3757481685)--(297.321428571,12.5608087626)--(297.544642857,12.759701273)--(297.65625,12.8643268219)--(297.767857143,12.9724009252)--(297.991071429,13.1988812259)--(298.102678571,13.3172803704)--(298.214285714,13.4391139641)--(298.660714286,13.960715351)--(298.883928571,14.2420190284)--(299.107142857,14.5369452104)--(299.330357143,14.8454571602)--(299.441964286,15.0047958555)--(299.553571429,15.1675164501)--(299.776785714,15.5030829638)--(299.888392857,15.6759184336)--(300.0,15.8521149035)--(300.892857143,17.3820023658)--(301.339285714,18.226529146)--(301.785714286,19.123559062)--(302.232142857,20.0726451901)--(302.678571429,21.0733146717)--(303.125,22.1250689476)--(303.571428571,23.2273840074)--(304.017857143,24.3797106494)--(304.464285714,25.581474755)--(304.910714286,26.8320775755)--(305.357142857,28.1308960275)--(306.25,30.8705677098)--(306.696428571,32.3100559658)--(307.142857143,33.7950305855)--(308.928571429,40.1746635379)--(310.714285714,47.2189706178)--(312.5,54.8718323382)--(314.285714286,63.0722810721)--(317.857142857,80.8507773806)--(321.428571429,99.9890480812)--(328.571428571,139.88639871)--(332.142857143,159.376618832)--(335.714285714,177.729247422)--(339.285714286,194.360613826)--(341.071428571,201.862920696)--(341.964285714,205.383831442)--(342.857142857,208.741788878)--(344.642857143,214.942416877)--(345.535714286,217.772731736)--(346.428571429,220.415406496)--(347.321428571,222.865175222)--(347.767857143,224.016179054)--(348.214285714,225.117156373)--(348.660714286,226.167558645)--(349.107142857,227.166862532)--(349.330357143,227.647195992)--(349.553571429,228.114570154)--(349.776785714,228.568926802)--(350.0,229.010209341)--(350.892857143,230.643523651)--(351.339285714,231.380385016)--(351.785714286,232.063550832)--(352.232142857,232.69268073)--(352.455357143,232.9868832)--(352.678571429,233.26746126)--(353.125,233.787606053)--(353.348214286,234.027107997)--(353.571428571,234.25285596)--(354.017857143,234.66297918)--(354.241071429,234.847303352)--(354.464285714,235.01777138)--(354.6875,235.174362029)--(354.799107143,235.247447173)--(354.910714286,235.317055794)--(355.133928571,235.445834901)--(355.245535714,235.505001377)--(355.357142857,235.56068331)--(355.803571429,235.748532546)--(356.026785714,235.821509976)--(356.25,235.880509913)--(356.473214286,235.925525008)--(356.584821429,235.94278642)--(356.696428571,235.956549655)--(356.919642857,235.973579988)--(357.03125,235.976846556)--(357.142857143,235.976613887)--(358.035714286,235.848803728)--(358.482142857,235.700993017)--(358.928571429,235.49733412)--(359.375,235.237928506)--(359.598214286,235.087359985)--(359.821428571,234.922905418)--(360.267857143,234.552421808)--(360.491071429,234.346438913)--(360.714285714,234.126662261)--(361.160714286,233.6458389)--(361.383928571,233.384852083)--(361.607142857,233.110191284)--(361.830357143,232.821890715)--(361.941964286,232.672636673)--(362.053571429,232.519986287)--(362.276785714,232.204515605)--(362.388392857,232.041705132)--(362.5,231.875517964)--(362.946428571,231.177107405)--(363.169642857,230.807781481)--(363.392857143,230.425102576)--(363.616071429,230.029118356)--(363.839285714,229.619878145)--(364.0625,229.197432918)--(364.285714286,228.761835295)--(365.178571429,226.889030439)--(365.625,225.87520151)--(366.071428571,224.810419857)--(366.517857143,223.69521598)--(366.964285714,222.530145502)--(367.857142857,220.05275117)--(368.75,217.38317345)--(369.642857143,214.526731888)--(370.535714286,211.489118379)--(371.428571429,208.276385839)--(373.214285714,201.351507308)--(375.0,193.807264337)--(378.571428571,177.105549719)--(385.714285714,139.183117616)--(392.857142857,99.294938373)--(400.0,62.4749400898), rgb(0.2472, 0.24, 0.6)+linewidth(0.666666666667));
clip(box((-16.6666666667,-13.6109385767), (416.666666667,260.824534077)));
draw((-16.0,123.60679775)--(416.0,123.60679775), rgb(0, 0, 0)+linewidth(0.666666666667));
label("$-10.$", (0.0,120.940131083), (0,-1), rgb(0, 0, 0));
label("$-5.$", (100.0,120.940131083), (0,-1), rgb(0, 0, 0));
label("$5.$", (300.0,120.940131083), (0,-1), rgb(0, 0, 0));
label("$10.$", (400.0,120.940131083), (0,-1), rgb(0, 0, 0));
draw((0.0,123.60679775)--(0.0,130.273464417), rgb(0, 0, 0)+linewidth(0.666666666667));draw((100.0,123.60679775)--(100.0,130.273464417), rgb(0, 0, 0)+linewidth(0.666666666667));draw((300.0,123.60679775)--(300.0,130.273464417), rgb(0, 0, 0)+linewidth(0.666666666667));draw((400.0,123.60679775)--(400.0,130.273464417), rgb(0, 0, 0)+linewidth(0.666666666667));draw((20.0,123.60679775)--(20.0,127.60679775), rgb(0, 0, 0)+linewidth(0.666666666667));draw((40.0,123.60679775)--(40.0,127.60679775), rgb(0, 0, 0)+linewidth(0.666666666667));draw((60.0,123.60679775)--(60.0,127.60679775), rgb(0, 0, 0)+linewidth(0.666666666667));draw((80.0,123.60679775)--(80.0,127.60679775), rgb(0, 0, 0)+linewidth(0.666666666667));draw((120.0,123.60679775)--(120.0,127.60679775), rgb(0, 0, 0)+linewidth(0.666666666667));draw((140.0,123.60679775)--(140.0,127.60679775), rgb(0, 0, 0)+linewidth(0.666666666667));draw((160.0,123.60679775)--(160.0,127.60679775), rgb(0, 0, 0)+linewidth(0.666666666667));draw((180.0,123.60679775)--(180.0,127.60679775), rgb(0, 0, 0)+linewidth(0.666666666667));draw((220.0,123.60679775)--(220.0,127.60679775), rgb(0, 0, 0)+linewidth(0.666666666667));draw((240.0,123.60679775)--(240.0,127.60679775), rgb(0, 0, 0)+linewidth(0.666666666667));draw((260.0,123.60679775)--(260.0,127.60679775), rgb(0, 0, 0)+linewidth(0.666666666667));draw((280.0,123.60679775)--(280.0,127.60679775), rgb(0, 0, 0)+linewidth(0.666666666667));draw((320.0,123.60679775)--(320.0,127.60679775), rgb(0, 0, 0)+linewidth(0.666666666667));draw((340.0,123.60679775)--(340.0,127.60679775), rgb(0, 0, 0)+linewidth(0.666666666667));draw((360.0,123.60679775)--(360.0,127.60679775), rgb(0, 0, 0)+linewidth(0.666666666667));draw((380.0,123.60679775)--(380.0,127.60679775), rgb(0, 0, 0)+linewidth(0.666666666667));
draw((200.0,-12.94427191)--(200.0,260.15786741), rgb(0, 0, 0)+linewidth(0.666666666667));
label("$-1.$", (197.333333333,11.2364201367), (-1,0), rgb(0, 0, 0));
label("$-0.5$", (197.333333333,67.4216089433), (-1,0), rgb(0, 0, 0));
label("$0.5$", (197.333333333,179.791986557), (-1,0), rgb(0, 0, 0));
label("$1.$", (197.333333333,235.977175363), (-1,0), rgb(0, 0, 0));
draw((200.0,11.2364201367)--(206.666666667,11.2364201367), rgb(0, 0, 0)+linewidth(0.666666666667));draw((200.0,67.4216089433)--(206.666666667,67.4216089433), rgb(0, 0, 0)+linewidth(0.666666666667));draw((200.0,179.791986557)--(206.666666667,179.791986557), rgb(0, 0, 0)+linewidth(0.666666666667));draw((200.0,235.977175363)--(206.666666667,235.977175363), rgb(0, 0, 0)+linewidth(0.666666666667));draw((200.0,-0.00061762467759)--(204.0,-0.00061762467759), rgb(0, 0, 0)+linewidth(0.666666666667));draw((200.0,22.473457898)--(204.0,22.473457898), rgb(0, 0, 0)+linewidth(0.666666666667));draw((200.0,33.7104956593)--(204.0,33.7104956593), rgb(0, 0, 0)+linewidth(0.666666666667));draw((200.0,44.9475334207)--(204.0,44.9475334207), rgb(0, 0, 0)+linewidth(0.666666666667));draw((200.0,56.184571182)--(204.0,56.184571182), rgb(0, 0, 0)+linewidth(0.666666666667));draw((200.0,78.6586467046)--(204.0,78.6586467046), rgb(0, 0, 0)+linewidth(0.666666666667));draw((200.0,89.895684466)--(204.0,89.895684466), rgb(0, 0, 0)+linewidth(0.666666666667));draw((200.0,101.132722227)--(204.0,101.132722227), rgb(0, 0, 0)+linewidth(0.666666666667));draw((200.0,112.369759989)--(204.0,112.369759989), rgb(0, 0, 0)+linewidth(0.666666666667));draw((200.0,134.843835511)--(204.0,134.843835511), rgb(0, 0, 0)+linewidth(0.666666666667));draw((200.0,146.080873273)--(204.0,146.080873273), rgb(0, 0, 0)+linewidth(0.666666666667));draw((200.0,157.317911034)--(204.0,157.317911034), rgb(0, 0, 0)+linewidth(0.666666666667));draw((200.0,168.554948795)--(204.0,168.554948795), rgb(0, 0, 0)+linewidth(0.666666666667));draw((200.0,191.029024318)--(204.0,191.029024318), rgb(0, 0, 0)+linewidth(0.666666666667));draw((200.0,202.266062079)--(204.0,202.266062079), rgb(0, 0, 0)+linewidth(0.666666666667));draw((200.0,213.503099841)--(204.0,213.503099841), rgb(0, 0, 0)+linewidth(0.666666666667));draw((200.0,224.740137602)--(204.0,224.740137602), rgb(0, 0, 0)+linewidth(0.666666666667));draw((200.0,247.214213125)--(204.0,247.214213125), rgb(0, 0, 0)+linewidth(0.666666666667));

