{
  "tasks": [
    {
      "title": "create angular app 32",
      "description": "use cli and make code styles",
      "points": 5,
      "id": 1
    },
    {
      "title": "New task2",
      "description": "task desc",
      "points": 3,
      "id": 2
    },
    {
      "title": null,
      "description": null,
      "points": 0,
      "id": 3
    }
  ]
}