# Blender v2.69 (sub 0) OBJ File: ''
# www.blender.org
mtllib cruiser.mtl
o space_frigate_6
v 1.180540 -1.958407 -0.009786
v 1.165112 -1.958923 -1.767491
v 5.501984 -1.860996 -1.431590
v 5.514129 -1.860590 -0.047852
v 2.500122 1.816661 -0.957266
v 2.508326 1.816936 -0.022549
v 4.770961 1.316180 -0.042262
v 4.765218 1.315988 -0.696558
v -7.302705 -0.851251 0.064347
v -7.338624 0.223022 0.064347
v -7.345663 0.222786 -0.737586
v -7.310146 -0.851500 -0.783448
v 9.987879 -1.468630 -0.421266
v 9.948499 -0.313934 -0.509201
v 9.952202 -0.313810 -0.087260
v 9.990810 -1.468532 -0.087260
v -7.787476 -1.025577 0.068654
v -7.795913 -1.025859 -0.892527
v -3.962932 -1.861361 -1.670925
v -3.947956 -1.860860 0.035199
v 10.480377 -1.596532 -0.522934
v 10.484163 -1.596405 -0.091552
v -2.982763 1.547380 -0.951030
v -2.974191 1.547666 0.025651
v -0.292245 1.804920 0.002035
v -0.301146 1.804623 -1.012058
v -6.073019 -0.863367 -8.539454
v -6.104267 -0.677129 -8.537720
v -3.818529 -0.600705 -9.591537
v -3.770852 -0.800806 -9.590455
v 5.436956 -0.139632 -2.282126
v 10.447186 -0.699057 -0.885203
v -3.921847 -1.377481 -2.380010
v 1.147486 -1.437467 -2.469980
v -5.010239 -0.930636 -2.466955
v -7.811563 -0.631312 -1.172372
v -7.842002 0.364308 -0.848011
v -5.024259 -0.511313 -2.466955
v -4.043513 0.532355 -1.733174
v -4.231499 -0.118158 -2.367181
v 0.784035 0.693766 -1.827180
v 2.281688 0.088792 -1.720857
v 2.266202 -0.260699 -2.668634
v 0.774005 0.693430 -2.969882
v 2.275858 -0.549487 -2.668634
v -4.080160 -0.218939 -4.874460
v 2.158463 -0.253091 -4.135984
v 1.043200 -0.036580 -2.949996
v 2.180463 -0.555572 -4.135670
v 5.432549 0.199377 -1.493839
v 10.431439 -0.153419 -0.601043
v 10.435911 -0.153269 -0.091552
v 9.236734 -0.055220 -0.628779
v 9.241543 -0.055059 -0.081098
v 5.450388 0.146335 -1.261282
v 4.883562 1.121943 -0.569931
v 4.888185 1.122098 -0.043234
v -4.062682 0.495064 -1.497479
v -3.144896 1.390146 -0.814448
v -6.297712 0.454480 -0.914971
v -7.833956 0.364578 0.068653
v -6.289196 0.454765 0.055068
v -3.137509 1.390393 0.027131
v -1.649703 -0.137676 -5.715818
v -4.458992 3.084428 -2.265762
v -2.466929 3.151034 -2.292328
v -2.467933 3.151000 -2.406663
v -4.459995 3.084395 -2.380097
v -4.053543 0.532019 -2.875876
v -1.647073 0.231128 -5.408986
v -4.009923 0.152126 -4.654146
v 0.557101 0.686178 -2.104079
v -3.530015 0.549524 -2.022252
v 0.552017 0.686008 -2.683365
v -3.535100 0.549354 -2.601539
v -7.800198 -0.867885 -0.779142
v -7.810133 -0.630331 -1.005877
v -7.792757 -0.867636 0.068653
v -7.835714 0.206401 -0.733280
v -7.828676 0.206637 0.068653
v -7.320082 -0.613946 -1.010183
v 10.476410 -1.452296 -0.425558
v 10.479342 -1.452198 -0.091552
v 10.448835 -0.706672 -0.726532
v 10.437030 -0.297600 -0.513493
v 10.440733 -0.297476 -0.091552
v 9.960304 -0.723006 -0.722239
v 5.526275 -1.860183 1.335886
v 1.195968 -1.957891 1.747919
v 2.516530 1.817210 0.912167
v 4.776704 1.316372 0.612035
v -7.295264 -0.851002 0.912143
v -7.331586 0.223257 0.866280
v 9.993742 -1.468434 0.246747
v 9.955905 -0.313686 0.334681
v -3.932982 -1.860359 1.741322
v -7.779039 -1.025295 1.029834
v 10.487949 -1.596279 0.339830
v -2.965618 1.547953 1.002332
v -0.283345 1.805218 1.016129
v -5.922185 -0.858321 8.645244
v -3.601926 -0.795155 9.655635
v -3.649578 -0.595053 9.657435
v -5.953461 -0.672084 8.643948
v 10.461118 -0.698591 0.702098
v 5.476177 -0.138320 2.186422
v 1.190672 -1.436022 2.450302
v -3.879459 -1.376063 2.449293
v -4.966160 -0.929161 2.555066
v -7.789778 -0.630583 1.309679
v -4.980180 -0.509838 2.555066
v -7.825911 0.364847 0.985317
v -4.189295 -0.116746 2.441161
v -4.012470 0.533393 1.803571
v 0.815983 0.694834 1.812729
v 0.826012 0.695170 2.955431
v 2.312697 -0.259144 2.628598
v 2.311542 0.089791 1.680490
v 2.322353 -0.547931 2.628598
v -3.993969 -0.216056 4.945455
v 1.094821 -0.034853 2.931251
v 2.230731 -0.250673 4.097608
v 2.252723 -0.553154 4.097085
v 10.440383 -0.153120 0.417938
v 5.457932 0.200226 1.398135
v 9.246349 -0.054899 0.466583
v 5.471687 0.147047 1.165332
v 4.892807 1.122253 0.483463
v -3.130122 1.390640 0.868709
v -4.035773 0.495964 1.568270
v -6.280683 0.455050 1.025107
v -1.549118 -0.134311 5.743974
v -4.418550 3.085782 2.341870
v -4.417546 3.085815 2.456206
v -2.425325 3.152426 2.447762
v -2.426328 3.152392 2.333427
v -4.002440 0.533729 2.946273
v -3.927611 0.154879 4.723725
v -1.551877 0.234313 5.436927
v -3.493978 0.550729 2.083581
v 0.593945 0.687411 2.093573
v 0.599029 0.687581 2.672859
v -3.488893 0.550899 2.662868
v -7.791270 -0.629700 1.143184
v -7.785316 -0.867387 0.916449
v -7.821637 0.206872 0.870587
v -7.301219 -0.613315 1.138878
v 10.482273 -1.452100 0.242454
v 10.459982 -0.706299 0.543427
v 10.444436 -0.297352 0.330388
v 9.971451 -0.722634 0.547720
vt 0.489329 0.329477
vt 0.489328 0.419322
vt 0.267761 0.400206
vt 0.267761 0.329476
vt 0.162391 0.247822
vt 0.162127 0.295599
vt 0.043676 0.294940
vt 0.043861 0.261500
vt 0.819348 0.215699
vt 0.874288 0.215699
vt 0.874288 0.256605
vt 0.819348 0.258949
vt 0.844315 0.081024
vt 0.785260 0.085519
vt 0.785260 0.064027
vt 0.844315 0.064028
vt 0.952139 0.329481
vt 0.952138 0.378611
vt 0.751291 0.416687
vt 0.751292 0.329478
vt 0.013478 0.351526
vt 0.013478 0.329475
vt 0.443267 0.247229
vt 0.442992 0.297151
vt 0.305277 0.296390
vt 0.305564 0.244556
vt 0.634246 0.311758
vt 0.635061 0.321374
vt 0.506453 0.316228
vt 0.504990 0.305829
vt 0.016437 0.417444
vt 0.275029 0.432080
vt 0.275975 0.530240
vt 0.016213 0.466882
vt 0.496987 0.438969
vt 0.758987 0.428684
vt 0.758401 0.472604
vt 0.499469 0.483618
vt 0.962828 0.413255
vt 0.816896 0.487257
vt 0.967351 0.436712
vt 0.996402 0.481690
vt 0.826049 0.505599
vt 0.827450 0.587838
vt 0.805205 0.546012
vt 0.297138 0.544003
vt 0.379118 0.551177
vt 0.378493 0.602297
vt 0.286467 0.601354
vt 0.439901 0.524232
vt 0.438799 0.537640
vt 0.439585 0.524054
vt 0.499379 0.481985
vt 0.794338 0.644405
vt 0.679892 0.876934
vt 0.348617 0.830529
vt 0.354474 0.701269
vt 0.648206 0.928238
vt 0.947278 0.275558
vt 0.949387 0.296880
vt 0.635057 0.321336
vt 0.362484 0.625838
vt 0.291451 0.738304
vt 0.077396 0.760472
vt 0.569177 0.943286
vt 0.503753 0.980371
vt 0.521928 0.898417
vt 0.017041 0.304601
vt 0.092174 0.303383
vt 0.092451 0.318874
vt 0.017250 0.319366
vt 0.810277 0.572049
vt 0.738504 0.549797
vt 0.540394 0.581304
vt 0.540164 0.538278
vt 0.797043 0.498743
vt 0.802183 0.527396
vt 0.817003 0.487202
vt 0.967238 0.436767
vt 0.256175 0.169826
vt 0.502528 0.186402
vt 0.443222 0.247228
vt 0.008942 0.168055
vt 0.169232 0.151018
vt 0.163071 0.247398
vt 0.044767 0.236446
vt 0.163131 0.247933
vt 0.876061 0.601385
vt 0.901844 0.605051
vt 0.895154 0.665972
vt 0.867499 0.662039
vt 0.913239 0.864961
vt 0.901609 0.862270
vt 0.872751 0.931610
vt 0.866236 0.920023
vt 0.901333 0.862207
vt 0.839311 0.931610
vt 0.839383 0.920023
vt 0.815242 0.897526
vt 0.815249 0.667013
vt 0.843182 0.667014
vt 0.842103 0.897527
vt 0.895750 0.856335
vt 0.020646 0.063096
vt 0.095647 0.023043
vt 0.097687 0.035092
vt 0.032197 0.070066
vt 0.293008 0.052381
vt 0.213946 0.055379
vt 0.097666 0.034965
vt 0.296397 0.099113
vt 0.217532 0.104833
vt 0.209139 0.134955
vt 0.041095 0.134025
vt 0.041333 0.091009
vt 0.209413 0.085373
vt 0.098818 0.044020
vt 0.100291 0.887127
vt 0.327434 0.864811
vt 0.715080 0.159076
vt 0.613211 0.157236
vt 0.613290 0.151392
vt 0.715159 0.153233
vt 0.044252 0.555484
vt 0.142927 0.704910
vt 0.030096 0.647024
vt 0.308793 0.634040
vt 0.135562 0.728091
vt 0.019556 0.502785
vt 0.002002 0.546829
vt 0.019344 0.666585
vt 0.054573 0.497754
vt 0.283318 0.556003
vt 0.077976 0.516735
vt 0.278083 0.585147
vt 0.072741 0.545879
vt 0.669752 0.290005
vt 0.460726 0.286092
vt 0.413741 0.165480
vt 0.414142 0.135873
vt 0.465452 0.017062
vt 0.674478 0.020956
vt 0.703379 0.014517
vt 0.720863 0.151962
vt 0.820098 0.100032
vt 0.840280 0.114336
vt 0.832202 0.120132
vt 0.820050 0.108542
vt 0.840280 0.163466
vt 0.832202 0.163382
vt 0.769185 0.163466
vt 0.769185 0.116612
vt 0.777263 0.122476
vt 0.777263 0.163381
vt 0.814415 0.172660
vt 0.831208 0.172660
vt 0.831208 0.211110
vt 0.814415 0.211110
vt 0.874458 0.172661
vt 0.874458 0.211110
vt 0.728510 0.172660
vt 0.769416 0.172660
vt 0.769416 0.211110
vt 0.728510 0.211110
vt 0.863882 0.015441
vt 0.863881 0.037492
vt 0.856507 0.032514
vt 0.856507 0.015517
vt 0.817978 0.056009
vt 0.818369 0.047898
vt 0.790077 0.041484
vt 0.797452 0.037009
vt 0.790077 0.015441
vt 0.797452 0.015517
vt 0.871713 0.064028
vt 0.871713 0.081025
vt 0.871712 0.122147
vt 0.844315 0.122147
vt 0.871712 0.145730
vt 0.844314 0.145729
vt 0.871712 0.167221
vt 0.844314 0.167221
vt 0.393014 0.659597
vt 0.100512 0.887105
vt 0.163031 0.248020
vt 0.806178 0.096408
vt 0.831500 0.270538
vt 0.020370 0.113018
vt 0.031959 0.113082
vn 0.001770 -0.999969 0.000275
vn 0.001258 -0.999999 0.000283
vn 0.036446 -0.999336 -0.000027
vn 0.037812 -0.999268 -0.000031
vn 0.101134 0.994872 -0.001180
vn 0.106540 0.994293 -0.001221
vn 0.216068 0.976376 -0.002183
vn -0.999403 -0.033416 0.008782
vn 0.999403 0.033416 -0.008781
vn 0.999403 0.033417 -0.008781
vn 0.999403 0.033415 -0.008782
vn -0.212558 -0.977146 0.002153
vn -0.109861 -0.993946 0.001256
vn -0.116337 -0.993194 0.001312
vn 0.053079 -0.998590 -0.000172
vn 0.053079 -0.998590 -0.000173
vn -0.095478 0.995431 0.000546
vn -0.049928 0.998749 0.000122
vn -0.050150 0.998742 0.000147
vn -0.415961 -0.063355 -0.907173
vn -0.416202 -0.061384 -0.907198
vn -0.411031 -0.101006 -0.906009
vn -0.410784 -0.102775 -0.905921
vn 0.206625 -0.375619 -0.903447
vn 0.161675 -0.454129 -0.876144
vn 0.174175 -0.414924 -0.893029
vn 0.213279 -0.358904 -0.908681
vn 0.115555 -0.735505 -0.667592
vn -0.160553 -0.811630 -0.561675
vn -0.159877 -0.809944 -0.564297
vn 0.259565 -0.772309 -0.579797
vn -0.282883 -0.787111 -0.548118
vn -0.281892 -0.786806 -0.549066
vn -0.415105 0.270318 -0.868686
vn -0.367012 0.390861 -0.844115
vn -0.250868 0.598872 -0.760538
vn -0.188924 0.712849 -0.675391
vn -0.201668 0.687493 -0.697627
vn 0.492927 0.863006 -0.110652
vn 0.373871 0.868203 -0.326257
vn 0.444820 0.871766 -0.205327
vn 0.539409 0.842029 -0.004982
vn 0.150175 -0.382005 -0.911877
vn 0.120849 0.004041 -0.992663
vn 0.288292 -0.944095 -0.159915
vn -0.156655 -0.987265 -0.027693
vn -0.047155 -0.996557 -0.068192
vn 0.028955 -0.993637 -0.108844
vn -0.383061 -0.921973 0.056828
vn -0.983784 -0.035490 0.175808
vn -0.983853 -0.032893 0.175929
vn -0.972761 -0.159024 0.168663
vn -0.971893 -0.164644 0.168272
vn -0.382887 0.923011 -0.038056
vn -0.193545 0.980645 -0.029598
vn -0.105749 0.992222 -0.065673
vn 0.182086 0.983248 -0.008271
vn 0.116962 0.989567 -0.084122
vn 0.118849 0.990508 -0.069063
vn 0.996667 0.038373 -0.071987
vn 0.995260 0.072317 -0.065018
vn 0.995534 0.067482 -0.066016
vn 0.996774 0.033329 -0.073015
vn 0.614016 -0.788442 -0.036657
vn 0.404452 -0.887885 -0.219268
vn 0.074322 0.906922 -0.414692
vn 0.075607 0.918127 -0.389007
vn 0.276447 0.505768 -0.817175
vn 0.286141 0.449070 -0.846439
vn -0.424306 -0.064608 -0.903211
vn -0.399797 -0.540783 -0.740079
vn -0.405597 -0.507263 -0.760378
vn -0.420699 -0.014067 -0.907091
vn 0.052114 0.534705 -0.843431
vn -0.036231 0.633456 -0.772930
vn -0.041892 0.619617 -0.783786
vn -0.046212 0.561228 -0.826370
vn 0.145171 0.538584 -0.829971
vn 0.132699 0.386557 -0.912669
vn 0.110033 0.475623 -0.872740
vn 0.227395 0.652220 -0.723118
vn 0.081942 0.996637 -0.001012
vn 0.080908 0.996693 -0.007556
vn 0.084231 0.987816 -0.130864
vn 0.029498 0.975026 0.220124
vn 0.030595 0.976662 0.212594
vn 0.874128 0.484379 0.035730
vn 0.855940 0.517018 -0.007665
vn 0.856806 0.515607 -0.005741
vn 0.876565 0.479439 0.042110
vn 0.855942 0.517016 -0.007665
vn 0.855941 0.517017 -0.007665
vn 0.261006 0.965334 -0.002574
vn 0.261006 0.965334 -0.002575
vn 0.160380 0.631033 -0.758996
vn -0.696425 0.717608 0.005528
vn -0.376528 0.920631 0.103269
vn -0.372561 0.921099 0.113026
vn -0.695439 0.718583 0.001701
vn -0.058614 0.998252 -0.007517
vn -0.058566 0.997323 -0.043782
vn -0.058282 0.998300 0.000218
vn -0.284571 0.958652 0.002216
vn -0.189410 0.710990 -0.677212
vn -0.040795 0.994220 -0.099306
vn 0.045933 0.989228 -0.138986
vn -0.033417 0.999442 -0.000003
vn -0.049967 0.994781 -0.088959
vn -0.034383 0.998056 -0.051977
vn -0.052053 0.984681 -0.166414
vn -0.099673 0.972561 -0.210214
vn 0.666405 0.252254 -0.701621
vn 0.609310 0.504559 -0.611688
vn 0.617623 0.479324 -0.623531
vn 0.669212 0.227506 -0.707387
vn -0.962803 0.270074 0.008371
vn -0.971944 0.230886 -0.044915
vn -0.968513 0.247903 -0.022938
vn -0.972560 0.222512 -0.067930
vn -0.972187 0.224210 -0.067694
vn -0.033417 0.999442 -0.000000
vn 0.014065 0.097562 0.995130
vn 0.016698 0.096493 0.995194
vn 0.013494 0.097794 0.995115
vn 0.009952 0.099231 0.995015
vn 0.632006 0.774942 -0.005774
vn -0.020519 0.083103 -0.996330
vn -0.022588 0.078817 -0.996633
vn -0.020194 0.083776 -0.996280
vn -0.016345 0.091739 -0.995649
vn -0.939161 -0.343377 0.008344
vn -0.939160 -0.343378 0.008342
vn -0.939160 -0.343378 0.008341
vn 0.661622 0.151304 -0.734414
vn 0.661268 0.153591 -0.734258
vn 0.673677 0.049927 -0.737338
vn 0.673817 0.048242 -0.737321
vn -0.999403 -0.033416 0.008784
vn -0.999403 -0.033415 0.008783
vn -0.999403 -0.033418 0.008783
vn -0.999403 -0.033419 0.008783
vn -0.999403 -0.033415 0.008782
vn -0.999403 -0.033416 0.008781
vn -0.999403 -0.033417 0.008782
vn -0.016711 0.689981 0.723635
vn -0.033417 0.999441 -0.000000
vn 0.033417 -0.999441 0.000000
vn 0.033417 -0.999442 0.000000
vn 0.018693 -0.309193 0.950816
vn 0.018693 -0.309194 0.950815
vn 0.018693 -0.309192 0.950816
vn 0.999403 0.033421 -0.008782
vn 0.999403 0.033419 -0.008780
vn 0.999403 0.033422 -0.008782
vn 0.999403 0.033417 -0.008782
vn 0.999403 0.033418 -0.008782
vn 0.999403 0.033416 -0.008782
vn 0.999403 0.033407 -0.008782
vn 0.999403 0.033411 -0.008781
vn -0.033417 0.999441 -0.000001
vn -0.004362 0.374167 0.927351
vn 0.023216 -0.461249 0.886967
vn 0.023216 -0.461248 0.886967
vn 0.023216 -0.461250 0.886966
vn -0.004286 0.935002 -0.354617
vn -0.008012 0.938256 -0.345849
vn -0.437109 0.897238 -0.062449
vn -0.262204 0.608475 -0.749004
vn -0.293433 0.528511 -0.796601
vn -0.289531 0.539200 -0.790845
vn -0.257697 0.619048 -0.741871
vn 0.234217 0.059936 -0.970335
vn 0.999403 0.033415 -0.008781
vn -0.999403 -0.033416 0.008783
vn -0.693611 0.720326 0.005876
vn 0.036446 -0.999336 -0.000026
vn -0.399973 -0.062819 0.914372
vn -0.394819 -0.102237 0.913053
vn -0.395064 -0.100468 0.913143
vn -0.400214 -0.060848 0.914400
vn 0.222453 -0.375090 0.899901
vn 0.229198 -0.358371 0.905007
vn 0.189826 -0.414400 0.890078
vn 0.177032 -0.453615 0.873438
vn 0.127260 -0.735114 0.665892
vn 0.269706 -0.771970 0.575605
vn -0.149943 -0.809611 0.567492
vn -0.150665 -0.811300 0.564883
vn -0.272207 -0.786482 0.554391
vn -0.273215 -0.786788 0.553461
vn -0.399795 0.270829 0.875680
vn -0.237483 0.599320 0.764472
vn -0.352141 0.391358 0.850197
vn -0.189395 0.687903 0.700656
vn -0.177043 0.713247 0.678185
vn 0.494789 0.863068 0.101476
vn 0.448351 0.871884 0.196975
vn 0.379536 0.868393 0.319134
vn 0.138255 0.004623 0.990386
vn 0.166160 -0.381470 0.909325
vn 0.291060 -0.944002 0.155385
vn 0.030866 -0.993573 0.108902
vn -0.045946 -0.996517 0.069594
vn -0.156140 -0.987248 0.031018
vn -0.383994 -0.922005 -0.049554
vn -0.986719 -0.035593 -0.158492
vn -0.974698 -0.164732 -0.151090
vn -0.975572 -0.159113 -0.151469
vn -0.986789 -0.032995 -0.158613
vn -0.382165 0.923035 0.044229
vn -0.104585 0.992261 0.066937
vn -0.193001 0.980663 0.032414
vn 0.182198 0.983251 0.004496
vn 0.120038 0.990547 0.066384
vn 0.118416 0.989616 0.081475
vn 0.997777 0.038409 0.054459
vn 0.997902 0.033364 0.055488
vn 0.996539 0.067516 0.048492
vn 0.996248 0.072351 0.047495
vn 0.614569 -0.788423 0.026336
vn 0.408243 -0.887758 0.212656
vn 0.081585 0.907165 0.412791
vn 0.300952 0.449566 0.841022
vn 0.290746 0.506246 0.811900
vn 0.082419 0.918355 0.387081
vn -0.408386 -0.064074 0.910558
vn -0.404712 -0.013531 0.914344
vn -0.392185 -0.506816 0.767678
vn -0.386742 -0.540347 0.747299
vn 0.066908 0.535200 0.842072
vn -0.031703 0.561713 0.826725
vn -0.028131 0.620077 0.784036
vn -0.022661 0.633910 0.773074
vn 0.159714 0.539071 0.826979
vn 0.240050 0.652644 0.718632
vn 0.125333 0.476135 0.870395
vn 0.148696 0.387092 0.909972
vn 0.086511 0.987892 0.128785
vn 0.081023 0.996697 0.005549
vn 0.026853 0.976536 -0.213672
vn 0.025625 0.974896 -0.221180
vn 0.873362 0.484356 -0.051352
vn 0.875686 0.479413 -0.057771
vn 0.856773 0.515605 -0.009603
vn 0.855941 0.517016 -0.007665
vn 0.173675 0.631478 0.755694
vn -0.696418 0.717609 0.006276
vn -0.695365 0.718586 0.010085
vn -0.374493 0.921034 -0.107009
vn -0.378288 0.920572 -0.097185
vn -0.057794 0.997349 0.044217
vn -0.058479 0.998257 0.007958
vn -0.177497 0.711389 0.680015
vn -0.039051 0.994279 0.099423
vn 0.048361 0.989310 0.137577
vn -0.033417 0.999442 -0.000004
vn -0.048403 0.994834 0.089238
vn -0.095973 0.972685 0.211360
vn -0.049129 0.984779 0.166724
vn -0.033470 0.998087 0.051987
vn 0.678616 0.252662 0.689668
vn 0.681524 0.227917 0.695398
vn 0.628470 0.479687 0.612312
vn 0.619950 0.504915 0.600602
vn -0.967963 0.247921 0.039790
vn -0.971007 0.230916 0.061833
vn -0.970850 0.224256 0.084616
vn -0.971219 0.222558 0.084861
vn -0.003405 0.096977 -0.995281
vn -0.007516 0.098646 -0.995094
vn -0.003975 0.097209 -0.995256
vn -0.000774 0.095908 -0.995390
vn 0.632006 0.774942 -0.005775
vn -0.003028 0.083688 0.996487
vn 0.001134 0.092324 0.995728
vn -0.002703 0.084361 0.996431
vn -0.005091 0.079402 0.996830
vn -0.939161 -0.343376 0.008344
vn -0.939161 -0.343376 0.008341
vn -0.939161 -0.343376 0.008342
vn 0.674411 0.151732 0.722598
vn 0.686656 0.048672 0.725352
vn 0.686515 0.050358 0.725370
vn 0.674053 0.154019 0.722447
vn -0.999403 -0.033414 0.008782
vn -0.999403 -0.033411 0.008783
vn -0.999403 -0.033410 0.008783
vn -0.029414 0.689556 -0.723635
vn 0.002002 -0.309751 -0.950816
vn 0.002002 -0.309751 -0.950815
vn 0.999403 0.033416 -0.008778
vn 0.999403 0.033415 -0.008778
vn 0.999403 0.033428 -0.008781
vn 0.999403 0.033423 -0.008781
vn -0.020641 0.373622 -0.927351
vn -0.020641 0.373622 -0.927352
vn 0.007646 -0.461769 -0.886967
vn 0.007646 -0.461767 -0.886968
vn 0.007646 -0.461771 -0.886966
vn -0.001944 0.938459 0.345386
vn 0.001935 0.935210 0.354089
vn -0.435950 0.897277 0.069585
vn -0.249020 0.608916 0.753134
vn -0.244639 0.619484 0.745916
vn -0.275607 0.539665 0.795489
vn -0.279407 0.528980 0.801319
vn 0.251212 0.060504 0.966039
vn 0.999403 0.033415 -0.008784
vn -0.999403 -0.033417 0.008783
usemtl Hull
s 1
f 1/1/1 2/2/2 3/3/3
f 4/4/4 1/1/1 3/3/3
f 5/5/5 6/6/6 7/7/7
f 7/7/7 8/8/7 5/5/5
f 9/9/8 10/10/8 11/11/8
f 11/11/8 12/12/8 9/9/8
f 13/13/9 14/14/10 15/15/9
f 15/15/9 16/16/11 13/13/9
f 17/17/12 18/18/12 19/19/13
f 19/19/13 20/20/14 17/17/12
f 20/20/14 19/19/13 2/2/2
f 2/2/2 1/1/1 20/20/14
f 21/21/15 22/22/16 4/4/4
f 4/4/4 3/3/3 21/21/15
f 23/23/17 24/24/17 25/25/18
f 25/25/18 26/26/19 23/23/17
f 27/27/20 28/28/21 29/29/22
f 29/29/22 30/30/23 27/27/20
f 21/31/24 3/32/25 31/33/26
f 31/33/26 32/34/27 21/31/24
f 2/35/28 19/36/29 33/37/30
f 33/37/30 34/38/31 2/35/28
f 19/36/29 18/39/32 35/40/33
f 35/40/33 33/37/30 19/36/29
f 36/41/34 37/42/35 38/43/36
f 37/42/35 39/44/37 40/45/38
f 40/45/38 38/43/36 37/42/35
f 41/46/39 42/47/40 43/48/41
f 43/48/41 44/49/42 41/46/39
f 31/33/26 3/32/25 45/50/43
f 45/50/43 43/51/44 31/33/26
f 45/52/43 3/32/25 2/35/28
f 2/35/28 34/53/31 45/52/43
f 34/54/45 33/55/46 27/56/47
f 27/56/47 30/57/48 34/54/45
f 33/55/46 35/58/49 27/56/47
f 35/59/50 38/60/51 28/61/52
f 28/61/52 27/27/53 35/59/50
f 38/62/54 46/63/55 28/64/56
f 43/65/57 47/66/58 48/67/59
f 45/68/60 49/69/61 47/70/62
f 47/70/62 43/71/63 45/68/60
f 45/72/64 34/54/45 49/73/65
f 31/74/66 50/75/67 51/76/68
f 51/76/68 32/77/69 31/74/66
f 35/78/70 18/39/71 36/79/72
f 36/79/72 38/43/73 35/78/70
f 41/80/74 39/81/75 23/82/76
f 23/82/76 26/26/77 41/80/74
f 50/83/78 42/84/79 5/85/80
f 5/85/80 8/86/81 50/83/78
f 41/80/74 26/26/77 5/87/80
f 5/5/5 26/26/19 25/25/18
f 25/25/18 6/6/6 5/5/5
f 52/88/82 51/89/83 53/90/84
f 53/90/84 54/91/82 52/88/82
f 51/89/83 50/92/85 55/93/86
f 55/93/86 53/90/84 51/89/83
f 50/92/87 8/94/88 56/95/89
f 56/95/89 55/96/90 50/92/87
f 8/94/88 7/97/91 57/98/92
f 57/98/92 56/95/89 8/94/88
f 57/99/93 54/100/93 53/101/94
f 53/101/94 56/102/93 57/99/93
f 55/103/95 56/102/95 53/101/95
f 23/104/96 39/105/97 58/106/98
f 58/106/98 59/107/99 23/104/96
f 39/105/97 37/108/100 60/109/101
f 60/109/101 58/110/98 39/105/97
f 37/108/100 61/111/102 62/112/102
f 62/112/102 60/109/101 37/108/100
f 62/113/103 63/114/103 59/115/103
f 59/115/103 60/116/103 62/113/103
f 58/117/104 60/116/104 59/115/104
f 29/118/105 28/64/56 46/63/55
f 46/63/55 64/119/106 29/118/105
f 65/120/107 66/121/107 67/122/107
f 67/122/107 68/123/107 65/120/107
f 69/124/108 44/49/109 70/125/110
f 70/125/110 71/126/111 69/124/108
f 48/127/112 64/128/113 70/125/114
f 70/125/114 44/49/115 48/127/112
f 39/129/116 69/124/117 40/130/118
f 40/130/118 69/124/117 71/126/119
f 71/126/119 46/131/120 40/130/118
f 39/132/121 41/46/121 72/133/121
f 72/133/121 73/134/121 39/132/121
f 41/46/121 44/49/109 74/135/121
f 74/135/121 72/133/121 41/46/121
f 44/49/109 69/124/108 75/136/121
f 75/136/121 74/135/121 44/49/109
f 69/124/108 39/132/121 73/134/121
f 73/134/121 75/136/121 69/124/108
f 73/137/122 72/138/123 66/121/124
f 66/121/124 65/120/125 73/137/122
f 72/139/126 74/140/126 67/122/126
f 67/122/126 66/121/126 72/139/126
f 74/141/127 75/142/128 68/123/129
f 68/123/129 67/122/130 74/141/127
f 75/142/131 73/143/131 65/144/132
f 65/144/132 68/123/133 75/142/131
f 47/66/58 64/119/106 48/67/59
f 30/30/134 29/29/135 47/70/136
f 47/70/136 49/69/137 30/30/134
f 34/54/45 30/57/48 49/73/65
f 36/145/138 18/146/139 76/147/140
f 76/147/140 77/148/141 36/145/138
f 18/146/139 17/149/142 78/150/142
f 78/150/142 76/147/140 18/146/139
f 61/151/8 37/152/143 79/153/143
f 79/153/143 80/154/144 61/151/8
f 37/152/143 36/145/138 77/148/141
f 77/148/141 79/153/143 37/152/143
f 77/155/145 76/156/145 12/157/145
f 12/157/145 81/158/145 77/155/145
f 76/156/121 78/159/146 9/160/121
f 9/160/121 12/157/121 76/156/121
f 80/161/147 79/162/148 11/163/148
f 11/163/148 10/164/147 80/161/147
f 79/162/149 77/155/150 81/158/149
f 81/158/149 11/163/151 79/162/149
f 22/165/152 21/166/153 82/167/153
f 82/167/153 83/168/154 22/165/152
f 21/166/153 32/169/155 84/170/156
f 84/170/156 82/167/153 21/166/153
f 32/169/155 51/171/11 85/172/157
f 85/172/157 84/170/156 32/169/155
f 51/171/11 52/173/158 86/174/159
f 86/174/159 85/172/157 51/171/11
f 83/175/121 82/176/160 13/13/146
f 13/13/146 16/16/121 83/175/121
f 82/176/161 84/177/161 87/178/161
f 87/178/161 13/13/161 82/176/161
f 84/177/162 85/179/163 14/180/162
f 14/180/162 87/178/164 84/177/162
f 85/179/148 86/181/148 15/182/148
f 15/182/148 14/180/148 85/179/148
f 50/75/67 31/74/66 43/48/165
f 43/48/165 42/47/166 50/75/67
f 38/62/54 40/183/167 46/63/55
f 47/66/58 29/184/105 64/119/106
f 64/128/168 46/131/169 71/126/170
f 71/126/170 70/125/171 64/128/168
f 43/48/172 48/127/172 44/49/172
f 42/84/79 41/80/74 5/185/80
f 13/13/9 87/186/173 14/14/10
f 11/11/8 81/187/174 12/12/8
f 24/188/175 23/104/96 59/107/99
f 59/107/99 63/189/175 24/188/175
f 1/1/1 4/4/4 88/3/176
f 89/2/2 1/1/1 88/3/176
f 90/5/5 91/8/7 7/7/7
f 7/7/7 6/6/6 90/5/5
f 9/9/8 92/12/8 93/11/8
f 93/11/8 10/10/8 9/9/8
f 94/13/11 16/16/11 15/15/9
f 15/15/9 95/14/157 94/13/11
f 17/17/12 20/20/14 96/19/13
f 96/19/13 97/18/12 17/17/12
f 20/20/14 1/1/1 89/2/2
f 89/2/2 96/19/13 20/20/14
f 98/21/16 88/3/176 4/4/4
f 4/4/4 22/22/16 98/21/16
f 99/23/17 100/26/19 25/25/18
f 25/25/18 24/24/17 99/23/17
f 101/27/177 102/30/178 103/29/179
f 103/29/179 104/28/180 101/27/177
f 98/31/181 105/34/182 106/33/183
f 106/33/183 88/32/184 98/31/181
f 89/35/185 107/38/186 108/37/187
f 108/37/187 96/36/188 89/35/185
f 96/36/188 108/37/187 109/40/189
f 109/40/189 97/39/190 96/36/188
f 110/41/191 111/43/192 112/42/193
f 112/42/193 111/43/192 113/45/194
f 113/45/194 114/44/195 112/42/193
f 115/46/196 116/49/42 117/48/197
f 117/48/197 118/47/198 115/46/196
f 106/33/183 117/51/199 119/50/200
f 119/50/200 88/32/184 106/33/183
f 119/52/200 107/53/186 89/35/185
f 89/35/185 88/32/184 119/52/200
f 107/54/201 102/57/202 101/56/203
f 101/56/203 108/55/204 107/54/201
f 108/55/204 101/56/203 109/58/205
f 109/59/206 101/27/207 104/61/208
f 104/61/208 111/60/209 109/59/206
f 111/62/210 104/64/211 120/63/212
f 117/65/213 121/67/214 122/66/215
f 119/68/216 117/71/217 122/70/218
f 122/70/218 123/69/219 119/68/216
f 119/72/220 123/73/221 107/54/201
f 106/74/222 105/77/223 124/76/224
f 124/76/224 125/75/225 106/74/222
f 109/78/226 111/43/227 110/79/228
f 110/79/228 97/39/229 109/78/226
f 115/80/230 100/26/231 99/82/232
f 99/82/232 114/81/233 115/80/230
f 125/83/234 91/86/235 90/85/236
f 90/85/236 118/84/237 125/83/234
f 115/80/230 90/87/236 100/26/231
f 90/5/5 6/6/6 25/25/18
f 25/25/18 100/26/19 90/5/5
f 52/88/82 54/91/82 126/90/238
f 126/90/238 124/89/239 52/88/82
f 124/89/239 126/90/238 127/93/240
f 127/93/240 125/92/241 124/89/239
f 125/92/242 127/96/243 128/95/244
f 128/95/244 91/94/245 125/92/242
f 91/94/245 128/95/244 57/98/92
f 57/98/92 7/97/91 91/94/245
f 57/99/93 128/102/93 126/101/93
f 126/101/93 54/100/93 57/99/93
f 127/103/246 126/101/246 128/102/246
f 99/104/247 129/107/248 130/106/249
f 130/106/249 114/105/250 99/104/247
f 114/105/250 130/110/249 131/109/251
f 131/109/251 112/108/252 114/105/250
f 112/108/252 131/109/251 62/112/102
f 62/112/102 61/111/102 112/108/252
f 62/113/103 131/116/103 129/115/103
f 129/115/103 63/114/103 62/113/103
f 130/117/253 129/115/253 131/116/253
f 103/118/254 132/119/255 120/63/212
f 120/63/212 104/64/211 103/118/254
f 133/120/121 134/123/121 135/122/256
f 135/122/256 136/121/256 133/120/121
f 137/124/257 138/126/258 139/125/259
f 139/125/259 116/49/260 137/124/257
f 121/127/261 116/49/262 139/125/263
f 139/125/263 132/128/264 121/127/261
f 114/129/116 113/130/265 137/124/266
f 113/130/265 120/131/267 138/126/268
f 138/126/268 137/124/266 113/130/265
f 114/132/121 140/134/121 141/133/121
f 141/133/121 115/46/121 114/132/121
f 115/46/121 141/133/121 142/135/146
f 142/135/146 116/49/260 115/46/121
f 116/49/260 142/135/146 143/136/121
f 143/136/121 137/124/257 116/49/260
f 137/124/257 143/136/121 140/134/121
f 140/134/121 114/132/121 137/124/257
f 140/137/269 133/120/270 136/121/271
f 136/121/271 141/138/272 140/137/269
f 141/139/273 136/121/273 135/122/273
f 135/122/273 142/140/273 141/139/273
f 142/141/274 135/122/275 134/123/276
f 134/123/276 143/142/277 142/141/274
f 143/142/278 134/123/279 133/144/280
f 133/144/280 140/143/278 143/142/278
f 122/66/215 121/67/214 132/119/255
f 102/30/281 123/69/282 122/70/283
f 122/70/283 103/29/284 102/30/281
f 107/54/201 123/73/221 102/57/202
f 110/145/8 144/148/8 145/147/285
f 145/147/285 97/146/8 110/145/8
f 97/146/8 145/147/285 78/150/142
f 78/150/142 17/149/142 97/146/8
f 61/151/8 80/154/144 146/153/286
f 146/153/286 112/152/287 61/151/8
f 112/152/287 146/153/286 144/148/8
f 144/148/8 110/145/8 112/152/287
f 144/155/288 147/158/288 92/157/288
f 92/157/288 145/156/288 144/155/288
f 145/156/121 92/157/121 9/160/121
f 9/160/121 78/159/146 145/156/121
f 80/161/147 10/164/147 93/163/147
f 93/163/147 146/162/148 80/161/147
f 146/162/289 93/163/289 147/158/289
f 147/158/289 144/155/290 146/162/289
f 22/165/152 83/168/154 148/167/156
f 148/167/156 98/166/10 22/165/152
f 98/166/10 148/167/156 149/170/291
f 149/170/291 105/169/292 98/166/10
f 105/169/292 149/170/291 150/172/293
f 150/172/293 124/171/294 105/169/292
f 124/171/294 150/172/293 86/174/159
f 86/174/159 52/173/158 124/171/294
f 83/175/121 16/16/121 94/13/121
f 94/13/121 148/176/146 83/175/121
f 148/176/295 94/13/295 151/178/296
f 151/178/296 149/177/295 148/176/295
f 149/177/297 151/178/298 95/180/297
f 95/180/297 150/179/299 149/177/297
f 150/179/148 95/180/148 15/182/148
f 15/182/148 86/181/148 150/179/148
f 125/75/225 118/47/300 117/48/301
f 117/48/301 106/74/222 125/75/225
f 111/62/210 120/63/212 113/183/302
f 122/66/215 132/119/255 103/184/254
f 132/128/303 139/125/304 138/126/305
f 138/126/305 120/131/306 132/128/303
f 117/48/307 116/49/307 121/127/307
f 118/84/237 90/185/236 115/80/230
f 94/13/11 95/14/157 151/186/308
f 93/11/8 92/12/8 147/187/309
f 24/188/175 63/189/175 129/107/248
f 129/107/248 99/104/247 24/188/175
