{
  "profiles" : [
    {
      "profile-name" : "Default",
      "hostname" : "plex.domain.net",
      "port" : 9091,
      "rpc-url-path" : "/transmission/rpc",
      "username" : "arch",
      "password" : "linux",
      "auto-connect" : false,
      "ssl" : false,
      "ssl-validate" : false,
      "timeout" : 40,
      "retries" : 3,
      "update-active-only" : false,
      "activeonly-fullsync-enabled" : false,
      "activeonly-fullsync-every" : 2,
      "update-interval" : 3,
      "min-update-interval" : 3,
      "session-update-interval" : 60,
      "exec-commands" : [
      ],
      "destinations" : [
      ],
      "last-add-destination" : "/srv/fs/video/tv"
    }
  ],
  "profile-id" : 0,
  "tree-views" : {
    "TrgTorrentTreeView" : {
      "sort-col" : -1,
      "sort-type" : 0
    },
    "TrgTrackersTreeView" : {
      "sort-col" : -2,
      "sort-type" : 0,
      "widths" : [
        61,
        156,
        75,
        142,
        151,
        155,
        123,
        133
      ],
      "columns" : [
        "tier",
        "announce-url",
        "last-announce-peer-count",
        "seeder-count",
        "leecher-count",
        "last-announce-time",
        "last-result",
        "scrape-url"
      ]
    },
    "TrgFilesTreeView" : {
      "sort-col" : -2,
      "sort-type" : 0,
      "widths" : [
        187,
        170,
        213,
        225,
        201
      ],
      "columns" : [
        "name",
        "size",
        "progress",
        "wanted",
        "priority"
      ]
    },
    "TrgPeersTreeView" : {
      "sort-col" : -2,
      "sort-type" : 0,
      "widths" : [
        80,
        104,
        132,
        171,
        144,
        140,
        109,
        116
      ],
      "columns" : [
        "ip",
        "host",
        "country",
        "down-speed",
        "up-speed",
        "progress",
        "flags",
        "client"
      ]
    }
  },
  "start-paused" : false,
  "add-options-dialog" : true,
  "delete-local-torrent" : false,
  "show-state-selector" : true,
  "filter-dirs" : true,
  "filter-trackers" : true,
  "directories-first" : true,
  "show-notebook" : false,
  "system-tray" : false,
  "system-tray-minimise" : false,
  "add-notify" : false,
  "complete-notify" : false,
  "window-height" : 1003,
  "window-width" : 1898,
  "notebook-paned-pos" : 300,
  "states-paned-pos" : 120
}