<mxfile host="app.diagrams.net" modified="2023-06-13T08:01:39.751Z" agent="Mozilla/5.0 (Windows NT 10.0; Win64; x64) AppleWebKit/537.36 (KHTML, like Gecko) Chrome/114.0.0.0 Safari/537.36" etag="OayY9RzzxL1wPcnrKsB_" version="21.3.8" type="gitlab" pages="4">
  <diagram id="ZgKog_Wt0WzC5LjRLpQj" name="Diagrama de Casos de Uso">
    <mxGraphModel dx="1050" dy="579" grid="1" gridSize="10" guides="1" tooltips="1" connect="1" arrows="1" fold="1" page="1" pageScale="1" pageWidth="1169" pageHeight="1654" math="0" shadow="0">
      <root>
        <mxCell id="0" />
        <mxCell id="1" parent="0" />
        <mxCell id="hUl7kCmaii4N9UEpbLIU-1" style="rounded=0;orthogonalLoop=1;jettySize=auto;html=1;entryX=0;entryY=0.5;entryDx=0;entryDy=0;endArrow=none;endFill=0;" parent="1" source="hUl7kCmaii4N9UEpbLIU-7" target="hUl7kCmaii4N9UEpbLIU-10" edge="1">
          <mxGeometry relative="1" as="geometry" />
        </mxCell>
        <mxCell id="hUl7kCmaii4N9UEpbLIU-2" style="rounded=0;orthogonalLoop=1;jettySize=auto;html=1;endArrow=none;endFill=0;" parent="1" source="hUl7kCmaii4N9UEpbLIU-7" target="hUl7kCmaii4N9UEpbLIU-12" edge="1">
          <mxGeometry relative="1" as="geometry" />
        </mxCell>
        <mxCell id="hUl7kCmaii4N9UEpbLIU-3" style="rounded=0;orthogonalLoop=1;jettySize=auto;html=1;entryX=0;entryY=0.5;entryDx=0;entryDy=0;endArrow=none;endFill=0;" parent="1" source="hUl7kCmaii4N9UEpbLIU-7" target="hUl7kCmaii4N9UEpbLIU-16" edge="1">
          <mxGeometry relative="1" as="geometry" />
        </mxCell>
        <mxCell id="hUl7kCmaii4N9UEpbLIU-4" style="rounded=0;orthogonalLoop=1;jettySize=auto;html=1;entryX=0;entryY=0.5;entryDx=0;entryDy=0;endArrow=none;endFill=0;" parent="1" source="hUl7kCmaii4N9UEpbLIU-7" target="hUl7kCmaii4N9UEpbLIU-17" edge="1">
          <mxGeometry relative="1" as="geometry" />
        </mxCell>
        <mxCell id="hUl7kCmaii4N9UEpbLIU-5" style="rounded=0;orthogonalLoop=1;jettySize=auto;html=1;entryX=0;entryY=0.5;entryDx=0;entryDy=0;endArrow=none;endFill=0;" parent="1" source="hUl7kCmaii4N9UEpbLIU-7" target="hUl7kCmaii4N9UEpbLIU-14" edge="1">
          <mxGeometry relative="1" as="geometry" />
        </mxCell>
        <mxCell id="hUl7kCmaii4N9UEpbLIU-6" style="rounded=0;orthogonalLoop=1;jettySize=auto;html=1;entryX=0;entryY=0.5;entryDx=0;entryDy=0;endArrow=none;endFill=0;" parent="1" source="hUl7kCmaii4N9UEpbLIU-7" target="hUl7kCmaii4N9UEpbLIU-21" edge="1">
          <mxGeometry relative="1" as="geometry" />
        </mxCell>
        <mxCell id="hUl7kCmaii4N9UEpbLIU-7" value="Cliente" style="shape=umlActor;verticalLabelPosition=bottom;verticalAlign=top;html=1;outlineConnect=0;" parent="1" vertex="1">
          <mxGeometry x="140" y="280" width="30" height="60" as="geometry" />
        </mxCell>
        <mxCell id="hUl7kCmaii4N9UEpbLIU-8" style="rounded=0;orthogonalLoop=1;jettySize=auto;html=1;entryX=1;entryY=0.5;entryDx=0;entryDy=0;endArrow=none;endFill=0;" parent="1" source="hUl7kCmaii4N9UEpbLIU-9" target="hUl7kCmaii4N9UEpbLIU-18" edge="1">
          <mxGeometry relative="1" as="geometry" />
        </mxCell>
        <mxCell id="hUl7kCmaii4N9UEpbLIU-9" value="Administrador&lt;br&gt;" style="shape=umlActor;verticalLabelPosition=bottom;verticalAlign=top;html=1;outlineConnect=0;" parent="1" vertex="1">
          <mxGeometry x="1050" y="260" width="30" height="60" as="geometry" />
        </mxCell>
        <mxCell id="hUl7kCmaii4N9UEpbLIU-10" value="Ver catalogo de productos" style="ellipse;whiteSpace=wrap;html=1;" parent="1" vertex="1">
          <mxGeometry x="370" y="120" width="140" height="70" as="geometry" />
        </mxCell>
        <mxCell id="hUl7kCmaii4N9UEpbLIU-11" value="&amp;lt;&amp;lt;include&amp;gt;&amp;gt;" style="rounded=0;orthogonalLoop=1;jettySize=auto;html=1;dashed=1;dashPattern=8 8;entryX=0;entryY=0.5;entryDx=0;entryDy=0;" parent="1" source="hUl7kCmaii4N9UEpbLIU-12" target="hUl7kCmaii4N9UEpbLIU-13" edge="1">
          <mxGeometry relative="1" as="geometry" />
        </mxCell>
        <mxCell id="hUl7kCmaii4N9UEpbLIU-12" value="Administrar carrito de compras" style="ellipse;whiteSpace=wrap;html=1;" parent="1" vertex="1">
          <mxGeometry x="400" y="240" width="140" height="70" as="geometry" />
        </mxCell>
        <mxCell id="hUl7kCmaii4N9UEpbLIU-13" value="Verificar disponibilidad del producto" style="ellipse;whiteSpace=wrap;html=1;" parent="1" vertex="1">
          <mxGeometry x="670" y="160" width="140" height="70" as="geometry" />
        </mxCell>
        <mxCell id="hUl7kCmaii4N9UEpbLIU-14" value="Visualizar detalle de factura" style="ellipse;whiteSpace=wrap;html=1;" parent="1" vertex="1">
          <mxGeometry x="440" y="330" width="140" height="70" as="geometry" />
        </mxCell>
        <mxCell id="hUl7kCmaii4N9UEpbLIU-15" value="Envió de factura al correo de clientes" style="ellipse;whiteSpace=wrap;html=1;" parent="1" vertex="1">
          <mxGeometry x="720" y="480" width="170" height="70" as="geometry" />
        </mxCell>
        <mxCell id="hUl7kCmaii4N9UEpbLIU-16" value="Consultar compras realizadas" style="ellipse;whiteSpace=wrap;html=1;" parent="1" vertex="1">
          <mxGeometry x="460" y="530" width="140" height="70" as="geometry" />
        </mxCell>
        <mxCell id="hUl7kCmaii4N9UEpbLIU-17" value="Ingresar cupones de descuento" style="ellipse;whiteSpace=wrap;html=1;" parent="1" vertex="1">
          <mxGeometry x="440" y="630" width="140" height="70" as="geometry" />
        </mxCell>
        <mxCell id="hUl7kCmaii4N9UEpbLIU-18" value="Administrar precios y descuentos" style="ellipse;whiteSpace=wrap;html=1;" parent="1" vertex="1">
          <mxGeometry x="720" y="310" width="140" height="70" as="geometry" />
        </mxCell>
        <mxCell id="hUl7kCmaii4N9UEpbLIU-19" value="Ventas en línea" style="shape=umlFrame;whiteSpace=wrap;html=1;pointerEvents=0;width=90;height=50;" parent="1" vertex="1">
          <mxGeometry x="290" y="70" width="650" height="660" as="geometry" />
        </mxCell>
        <mxCell id="hUl7kCmaii4N9UEpbLIU-20" value="&amp;lt;&amp;lt;include&amp;gt;&amp;gt;" style="rounded=0;orthogonalLoop=1;jettySize=auto;html=1;entryX=0;entryY=0.5;entryDx=0;entryDy=0;dashed=1;dashPattern=8 8;" parent="1" source="hUl7kCmaii4N9UEpbLIU-21" target="hUl7kCmaii4N9UEpbLIU-15" edge="1">
          <mxGeometry relative="1" as="geometry" />
        </mxCell>
        <mxCell id="hUl7kCmaii4N9UEpbLIU-21" value="Pago de factura" style="ellipse;whiteSpace=wrap;html=1;" parent="1" vertex="1">
          <mxGeometry x="460" y="420" width="140" height="70" as="geometry" />
        </mxCell>
      </root>
    </mxGraphModel>
  </diagram>
  <diagram name="Diagrama de Clases" id="mrSniToNLT3GibCcFVxH">
    <mxGraphModel dx="1050" dy="579" grid="1" gridSize="10" guides="1" tooltips="1" connect="1" arrows="1" fold="1" page="1" pageScale="1" pageWidth="1169" pageHeight="1654" math="0" shadow="0">
      <root>
        <mxCell id="0" />
        <mxCell id="1" parent="0" />
        <mxCell id="HsYgSBCZ7J4jQA-JqUkq-4" style="edgeStyle=orthogonalEdgeStyle;rounded=0;orthogonalLoop=1;jettySize=auto;html=1;entryX=0.373;entryY=0.011;entryDx=0;entryDy=0;entryPerimeter=0;" parent="1" source="HsYgSBCZ7J4jQA-JqUkq-11" target="HsYgSBCZ7J4jQA-JqUkq-15" edge="1">
          <mxGeometry relative="1" as="geometry">
            <Array as="points">
              <mxPoint x="762" y="978" />
              <mxPoint x="762" y="1000" />
              <mxPoint x="937" y="1000" />
            </Array>
          </mxGeometry>
        </mxCell>
        <mxCell id="HsYgSBCZ7J4jQA-JqUkq-6" value="&lt;p style=&quot;margin:0px;margin-top:4px;text-align:center;&quot;&gt;&lt;b&gt;Usuario&lt;/b&gt;&lt;/p&gt;&lt;hr size=&quot;1&quot;&gt;&lt;p style=&quot;margin:0px;margin-left:4px;&quot;&gt;+ Cédula: String&lt;/p&gt;&lt;p style=&quot;margin:0px;margin-left:4px;&quot;&gt;+ Nombre: String&lt;/p&gt;&lt;p style=&quot;margin:0px;margin-left:4px;&quot;&gt;+ Teléfono: String&lt;/p&gt;&lt;p style=&quot;margin:0px;margin-left:4px;&quot;&gt;+ Dirección: String&lt;/p&gt;&lt;p style=&quot;margin:0px;margin-left:4px;&quot;&gt;&lt;br&gt;&lt;/p&gt;&lt;p class=&quot;MsoNormal&quot;&gt;&lt;span lang=&quot;ES-US&quot;&gt;&lt;/span&gt;&lt;/p&gt;" style="verticalAlign=top;align=left;overflow=fill;fontSize=12;fontFamily=Helvetica;html=1;whiteSpace=wrap;" parent="1" vertex="1">
          <mxGeometry x="20" y="210" width="210" height="98" as="geometry" />
        </mxCell>
        <mxCell id="HsYgSBCZ7J4jQA-JqUkq-9" value="&lt;p style=&quot;margin:0px;margin-top:4px;text-align:center;&quot;&gt;&lt;b&gt;Producto&lt;/b&gt;&lt;/p&gt;&lt;hr size=&quot;1&quot;&gt;&lt;p style=&quot;margin:0px;margin-left:4px;&quot;&gt;+ Id Producto: String&lt;/p&gt;&lt;p style=&quot;margin:0px;margin-left:4px;&quot;&gt;+ Nombre: String&lt;/p&gt;&lt;p style=&quot;margin:0px;margin-left:4px;&quot;&gt;+ Cantidad: String&lt;/p&gt;&lt;p style=&quot;margin:0px;margin-left:4px;&quot;&gt;+ Precio: Float&lt;/p&gt;&lt;p class=&quot;MsoNormal&quot;&gt;&lt;span lang=&quot;ES-US&quot;&gt;&lt;/span&gt;&lt;/p&gt;" style="verticalAlign=top;align=left;overflow=fill;fontSize=12;fontFamily=Helvetica;html=1;whiteSpace=wrap;" parent="1" vertex="1">
          <mxGeometry x="917" y="482" width="160" height="90" as="geometry" />
        </mxCell>
        <mxCell id="HsYgSBCZ7J4jQA-JqUkq-11" value="&lt;p style=&quot;margin:0px;margin-top:4px;text-align:center;&quot;&gt;&lt;b&gt;Factura&lt;/b&gt;&lt;/p&gt;&lt;hr size=&quot;1&quot;&gt;&lt;p style=&quot;margin:0px;margin-left:4px;&quot;&gt;+ Id Factura: String&lt;/p&gt;&lt;p style=&quot;margin:0px;margin-left:4px;&quot;&gt;+ Id Cliente: String&lt;/p&gt;&lt;p style=&quot;margin:0px;margin-left:4px;&quot;&gt;+ Cedula: String&lt;/p&gt;&lt;p style=&quot;margin:0px;margin-left:4px;&quot;&gt;+ Nombre: String&lt;br&gt;&lt;/p&gt;&lt;p style=&quot;margin:0px;margin-left:4px;&quot;&gt;+ Teléfono: String&lt;/p&gt;&lt;p style=&quot;margin:0px;margin-left:4px;&quot;&gt;+Dirección: String&lt;/p&gt;&lt;p style=&quot;margin:0px;margin-left:4px;&quot;&gt;+ Nombre producto: String&lt;/p&gt;&lt;p style=&quot;margin:0px;margin-left:4px;&quot;&gt;+ Cantidad producto: Int&lt;/p&gt;&lt;p style=&quot;margin:0px;margin-left:4px;&quot;&gt;+ Descripción del producto: String&lt;/p&gt;&lt;p style=&quot;margin:0px;margin-left:4px;&quot;&gt;+ Valor unitario: String&lt;/p&gt;&lt;p style=&quot;margin:0px;margin-left:4px;&quot;&gt;+ Valor total: String&lt;/p&gt;&lt;p class=&quot;MsoNormal&quot;&gt;&lt;span lang=&quot;ES-US&quot;&gt;&lt;/span&gt;&lt;/p&gt;" style="verticalAlign=top;align=left;overflow=fill;fontSize=12;fontFamily=Helvetica;html=1;whiteSpace=wrap;" parent="1" vertex="1">
          <mxGeometry x="467" y="960" width="190" height="190" as="geometry" />
        </mxCell>
        <mxCell id="HsYgSBCZ7J4jQA-JqUkq-13" value="" style="edgeStyle=orthogonalEdgeStyle;rounded=0;orthogonalLoop=1;jettySize=auto;html=1;endArrow=none;endFill=0;startArrow=block;startFill=0;" parent="1" source="HsYgSBCZ7J4jQA-JqUkq-15" target="HsYgSBCZ7J4jQA-JqUkq-17" edge="1">
          <mxGeometry relative="1" as="geometry">
            <Array as="points">
              <mxPoint x="777" y="1187" />
            </Array>
          </mxGeometry>
        </mxCell>
        <mxCell id="HsYgSBCZ7J4jQA-JqUkq-14" value="" style="edgeStyle=orthogonalEdgeStyle;rounded=0;orthogonalLoop=1;jettySize=auto;html=1;startArrow=block;startFill=0;endArrow=none;endFill=0;entryX=0.5;entryY=0;entryDx=0;entryDy=0;" parent="1" source="HsYgSBCZ7J4jQA-JqUkq-15" target="HsYgSBCZ7J4jQA-JqUkq-18" edge="1">
          <mxGeometry relative="1" as="geometry">
            <Array as="points">
              <mxPoint x="1242" y="1187" />
              <mxPoint x="1242" y="1288" />
            </Array>
            <mxPoint x="1127" y="1360" as="targetPoint" />
          </mxGeometry>
        </mxCell>
        <mxCell id="HsYgSBCZ7J4jQA-JqUkq-15" value="&lt;p style=&quot;margin:0px;margin-top:4px;text-align:center;&quot;&gt;&lt;b&gt;Pago&lt;/b&gt;&lt;/p&gt;&lt;hr size=&quot;1&quot;&gt;&lt;p style=&quot;margin:0px;margin-left:4px;&quot;&gt;+ Id Pago: String&lt;/p&gt;&lt;p style=&quot;margin:0px;margin-left:4px;&quot;&gt;+ id Cliente: String&lt;/p&gt;&lt;p style=&quot;margin:0px;margin-left:4px;&quot;&gt;+ Fecha de pago: String&lt;/p&gt;&lt;p style=&quot;margin:0px;margin-left:4px;&quot;&gt;+ Valor total: String&lt;/p&gt;&lt;p class=&quot;MsoNormal&quot;&gt;&lt;span lang=&quot;ES-US&quot;&gt;&lt;/span&gt;&lt;/p&gt;" style="verticalAlign=top;align=left;overflow=fill;fontSize=12;fontFamily=Helvetica;html=1;whiteSpace=wrap;" parent="1" vertex="1">
          <mxGeometry x="877" y="1142" width="160" height="90" as="geometry" />
        </mxCell>
        <mxCell id="HsYgSBCZ7J4jQA-JqUkq-16" value="1" style="text;html=1;align=center;verticalAlign=middle;resizable=0;points=[];autosize=1;strokeColor=none;fillColor=none;" parent="1" vertex="1">
          <mxGeometry x="904" y="1112" width="30" height="30" as="geometry" />
        </mxCell>
        <mxCell id="HsYgSBCZ7J4jQA-JqUkq-17" value="&lt;p style=&quot;margin:0px;margin-top:4px;text-align:center;&quot;&gt;&lt;b&gt;Transferencia Bancaria&lt;/b&gt;&lt;/p&gt;&lt;hr size=&quot;1&quot;&gt;&lt;p style=&quot;margin:0px;margin-left:4px;&quot;&gt;+ Id transferencia: String&lt;/p&gt;&lt;p style=&quot;margin:0px;margin-left:4px;&quot;&gt;+ Nombre del titular: String&lt;/p&gt;&lt;p style=&quot;margin:0px;margin-left:4px;&quot;&gt;+ Monto a pagar: String&lt;/p&gt;&lt;p class=&quot;MsoNormal&quot;&gt;&lt;span lang=&quot;ES-US&quot;&gt;&lt;/span&gt;&lt;/p&gt;" style="verticalAlign=top;align=left;overflow=fill;fontSize=12;fontFamily=Helvetica;html=1;whiteSpace=wrap;" parent="1" vertex="1">
          <mxGeometry x="668" y="1250" width="160" height="80" as="geometry" />
        </mxCell>
        <mxCell id="HsYgSBCZ7J4jQA-JqUkq-18" value="&lt;p style=&quot;margin:0px;margin-top:4px;text-align:center;&quot;&gt;&lt;b&gt;Tarjeta de crédito&lt;/b&gt;&lt;/p&gt;&lt;hr size=&quot;1&quot;&gt;&lt;p style=&quot;margin:0px;margin-left:4px;&quot;&gt;+ Id Tarjeta de credito: String&lt;/p&gt;&lt;p style=&quot;margin:0px;margin-left:4px;&quot;&gt;+ Nombre cliente: String&lt;/p&gt;&lt;p style=&quot;margin:0px;margin-left:4px;&quot;&gt;+ Valor a pagar: String&lt;/p&gt;&lt;p class=&quot;MsoNormal&quot;&gt;&lt;span lang=&quot;ES-US&quot;&gt;&lt;/span&gt;&lt;/p&gt;" style="verticalAlign=top;align=left;overflow=fill;fontSize=12;fontFamily=Helvetica;html=1;whiteSpace=wrap;" parent="1" vertex="1">
          <mxGeometry x="1152" y="1232" width="190" height="80" as="geometry" />
        </mxCell>
        <mxCell id="HsYgSBCZ7J4jQA-JqUkq-22" value="1" style="text;html=1;align=center;verticalAlign=middle;resizable=0;points=[];autosize=1;strokeColor=none;fillColor=none;" parent="1" vertex="1">
          <mxGeometry x="657" y="978" width="30" height="30" as="geometry" />
        </mxCell>
        <mxCell id="1UZwpzc6q1hvR2u_jQSi-7" style="edgeStyle=orthogonalEdgeStyle;rounded=0;orthogonalLoop=1;jettySize=auto;html=1;entryX=1.011;entryY=0.813;entryDx=0;entryDy=0;entryPerimeter=0;" parent="1" source="HsYgSBCZ7J4jQA-JqUkq-25" target="HsYgSBCZ7J4jQA-JqUkq-9" edge="1">
          <mxGeometry relative="1" as="geometry">
            <Array as="points">
              <mxPoint x="1337" y="555" />
            </Array>
          </mxGeometry>
        </mxCell>
        <mxCell id="HsYgSBCZ7J4jQA-JqUkq-25" value="&lt;p style=&quot;border-color: var(--border-color); margin: 4px 0px 0px; text-align: center;&quot;&gt;&lt;b style=&quot;border-color: var(--border-color);&quot;&gt;Carrito de compras&lt;/b&gt;&lt;/p&gt;&lt;hr style=&quot;border-color: var(--border-color);&quot; size=&quot;1&quot;&gt;&lt;p style=&quot;border-color: var(--border-color); margin: 0px 0px 0px 4px;&quot;&gt;+ Id carrito de compras: String&lt;/p&gt;&lt;p style=&quot;border-color: var(--border-color); margin: 0px 0px 0px 4px;&quot;&gt;+ Nombre de productos: String&lt;/p&gt;&lt;p style=&quot;border-color: var(--border-color); margin: 0px 0px 0px 4px;&quot;&gt;+ Cantidad de productos: Int&lt;/p&gt;&lt;p style=&quot;border-color: var(--border-color); margin: 0px 0px 0px 4px;&quot;&gt;+ Precio: Float&lt;/p&gt;&lt;hr size=&quot;1&quot;&gt;&lt;p style=&quot;margin:0px;margin-left:4px;&quot;&gt;+ Verificar disponibilidad del producto ()&lt;/p&gt;&lt;p class=&quot;MsoNormal&quot;&gt;&lt;span lang=&quot;ES-US&quot;&gt;&lt;/span&gt;&lt;/p&gt;" style="verticalAlign=top;align=left;overflow=fill;fontSize=12;fontFamily=Helvetica;html=1;whiteSpace=wrap;" parent="1" vertex="1">
          <mxGeometry x="1277" y="616" width="190" height="142" as="geometry" />
        </mxCell>
        <mxCell id="fSV53SAg83PH5_xKsdlr-2" style="edgeStyle=orthogonalEdgeStyle;rounded=0;orthogonalLoop=1;jettySize=auto;html=1;" parent="1" source="XTo-Y6ECLWpTsnrsbOr_-1" target="fSV53SAg83PH5_xKsdlr-1" edge="1">
          <mxGeometry relative="1" as="geometry">
            <Array as="points">
              <mxPoint x="117" y="718" />
            </Array>
            <mxPoint x="170" y="780" as="targetPoint" />
          </mxGeometry>
        </mxCell>
        <mxCell id="fSV53SAg83PH5_xKsdlr-4" style="edgeStyle=orthogonalEdgeStyle;rounded=0;orthogonalLoop=1;jettySize=auto;html=1;endArrow=block;endFill=0;" parent="1" source="XTo-Y6ECLWpTsnrsbOr_-1" edge="1">
          <mxGeometry relative="1" as="geometry">
            <mxPoint x="157" y="310" as="targetPoint" />
          </mxGeometry>
        </mxCell>
        <mxCell id="XTo-Y6ECLWpTsnrsbOr_-1" value="&lt;p style=&quot;margin:0px;margin-top:4px;text-align:center;&quot;&gt;&lt;b&gt;Cliente&lt;/b&gt;&lt;/p&gt;&lt;hr size=&quot;1&quot;&gt;&lt;p style=&quot;margin:0px;margin-left:4px;&quot;&gt;+ Cédula: String&lt;/p&gt;&lt;p style=&quot;margin:0px;margin-left:4px;&quot;&gt;+ Nombre: String&lt;/p&gt;&lt;p style=&quot;margin:0px;margin-left:4px;&quot;&gt;+ Teléfono: String&lt;/p&gt;&lt;p style=&quot;margin:0px;margin-left:4px;&quot;&gt;+Dirección: String&lt;/p&gt;&lt;hr size=&quot;1&quot;&gt;&lt;p style=&quot;margin:0px;margin-left:4px;&quot;&gt;+ Ver producto ()&lt;/p&gt;&lt;p style=&quot;margin:0px;margin-left:4px;&quot;&gt;+ Añadir al carrito ()&lt;/p&gt;&lt;p style=&quot;margin:0px;margin-left:4px;&quot;&gt;+ Realizar pago ()&lt;/p&gt;&lt;p style=&quot;margin:0px;margin-left:4px;&quot;&gt;+ Consultar compras realizadas ()&lt;/p&gt;&lt;p class=&quot;MsoNormal&quot;&gt;&lt;span lang=&quot;ES-US&quot;&gt;&lt;/span&gt;&lt;/p&gt;" style="verticalAlign=top;align=left;overflow=fill;fontSize=12;fontFamily=Helvetica;html=1;whiteSpace=wrap;" parent="1" vertex="1">
          <mxGeometry x="117" y="396" width="210" height="164" as="geometry" />
        </mxCell>
        <mxCell id="1UZwpzc6q1hvR2u_jQSi-3" value="administra" style="edgeStyle=orthogonalEdgeStyle;rounded=0;orthogonalLoop=1;jettySize=auto;html=1;entryX=0.676;entryY=0.007;entryDx=0;entryDy=0;entryPerimeter=0;" parent="1" source="XTo-Y6ECLWpTsnrsbOr_-2" target="HsYgSBCZ7J4jQA-JqUkq-9" edge="1">
          <mxGeometry relative="1" as="geometry">
            <Array as="points">
              <mxPoint x="1030" y="312" />
              <mxPoint x="1030" y="440" />
              <mxPoint x="1025" y="440" />
            </Array>
            <mxPoint x="1120" y="440" as="targetPoint" />
          </mxGeometry>
        </mxCell>
        <mxCell id="fSV53SAg83PH5_xKsdlr-3" style="edgeStyle=orthogonalEdgeStyle;rounded=0;orthogonalLoop=1;jettySize=auto;html=1;entryX=0.994;entryY=0.163;entryDx=0;entryDy=0;entryPerimeter=0;endArrow=block;endFill=0;" parent="1" source="XTo-Y6ECLWpTsnrsbOr_-2" target="HsYgSBCZ7J4jQA-JqUkq-6" edge="1">
          <mxGeometry relative="1" as="geometry" />
        </mxCell>
        <mxCell id="XTo-Y6ECLWpTsnrsbOr_-2" value="&lt;p style=&quot;margin:0px;margin-top:4px;text-align:center;&quot;&gt;&lt;b&gt;Administrador&lt;/b&gt;&lt;/p&gt;&lt;hr size=&quot;1&quot;&gt;&lt;p style=&quot;margin:0px;margin-left:4px;&quot;&gt;+ Cédula: String&lt;/p&gt;&lt;p style=&quot;margin:0px;margin-left:4px;&quot;&gt;+ Nombre: String&lt;/p&gt;&lt;p style=&quot;margin:0px;margin-left:4px;&quot;&gt;+ Teléfono: String&lt;/p&gt;&lt;p style=&quot;margin:0px;margin-left:4px;&quot;&gt;+Dirección: String&lt;/p&gt;&lt;hr size=&quot;1&quot;&gt;&lt;p style=&quot;margin:0px;margin-left:4px;&quot;&gt;+ Ver productos ()&lt;/p&gt;&lt;p style=&quot;margin:0px;margin-left:4px;&quot;&gt;+ Agregar productos ()&lt;br&gt;&lt;/p&gt;&lt;p style=&quot;margin:0px;margin-left:4px;&quot;&gt;+ Eliminar productos ()&lt;br&gt;&lt;/p&gt;&lt;p style=&quot;margin:0px;margin-left:4px;&quot;&gt;+ Modificar productos ()&lt;br&gt;&lt;/p&gt;&lt;p class=&quot;MsoNormal&quot;&gt;&lt;span lang=&quot;ES-US&quot;&gt;&lt;/span&gt;&lt;/p&gt;" style="verticalAlign=top;align=left;overflow=fill;fontSize=12;fontFamily=Helvetica;html=1;whiteSpace=wrap;" parent="1" vertex="1">
          <mxGeometry x="307" y="180" width="160" height="160" as="geometry" />
        </mxCell>
        <mxCell id="1UZwpzc6q1hvR2u_jQSi-2" style="edgeStyle=orthogonalEdgeStyle;rounded=0;orthogonalLoop=1;jettySize=auto;html=1;endArrow=block;endFill=0;entryX=0.685;entryY=1.012;entryDx=0;entryDy=0;entryPerimeter=0;exitX=0.5;exitY=0;exitDx=0;exitDy=0;" parent="1" source="1UZwpzc6q1hvR2u_jQSi-1" target="HsYgSBCZ7J4jQA-JqUkq-15" edge="1">
          <mxGeometry relative="1" as="geometry">
            <mxPoint x="967" y="1130" as="targetPoint" />
            <Array as="points">
              <mxPoint x="987" y="1280" />
            </Array>
          </mxGeometry>
        </mxCell>
        <mxCell id="1UZwpzc6q1hvR2u_jQSi-1" value="&lt;p style=&quot;margin:0px;margin-top:4px;text-align:center;&quot;&gt;&lt;b&gt;Cupones de descuento&lt;/b&gt;&lt;/p&gt;&lt;hr size=&quot;1&quot;&gt;&lt;p style=&quot;margin:0px;margin-left:4px;&quot;&gt;+ Id cupón: String&lt;/p&gt;&lt;p style=&quot;margin:0px;margin-left:4px;&quot;&gt;+ Nombre cliente: String&lt;/p&gt;&lt;p style=&quot;margin:0px;margin-left:4px;&quot;&gt;+ Valor de descuento: float&lt;/p&gt;&lt;p class=&quot;MsoNormal&quot;&gt;&lt;span lang=&quot;ES-US&quot;&gt;&lt;/span&gt;&lt;/p&gt;" style="verticalAlign=top;align=left;overflow=fill;fontSize=12;fontFamily=Helvetica;html=1;whiteSpace=wrap;" parent="1" vertex="1">
          <mxGeometry x="902" y="1280" width="190" height="80" as="geometry" />
        </mxCell>
        <mxCell id="1UZwpzc6q1hvR2u_jQSi-4" value="1" style="text;html=1;align=center;verticalAlign=middle;resizable=0;points=[];autosize=1;strokeColor=none;fillColor=none;" parent="1" vertex="1">
          <mxGeometry x="467" y="280" width="30" height="30" as="geometry" />
        </mxCell>
        <mxCell id="1UZwpzc6q1hvR2u_jQSi-5" value="1..*" style="text;html=1;align=center;verticalAlign=middle;resizable=0;points=[];autosize=1;strokeColor=none;fillColor=none;" parent="1" vertex="1">
          <mxGeometry x="1030" y="450" width="40" height="30" as="geometry" />
        </mxCell>
        <mxCell id="1UZwpzc6q1hvR2u_jQSi-8" value="*" style="text;html=1;align=center;verticalAlign=middle;resizable=0;points=[];autosize=1;strokeColor=none;fillColor=none;" parent="1" vertex="1">
          <mxGeometry x="1332" y="588" width="30" height="30" as="geometry" />
        </mxCell>
        <mxCell id="1UZwpzc6q1hvR2u_jQSi-9" value="*" style="text;html=1;align=center;verticalAlign=middle;resizable=0;points=[];autosize=1;strokeColor=none;fillColor=none;" parent="1" vertex="1">
          <mxGeometry x="1077" y="528" width="30" height="30" as="geometry" />
        </mxCell>
        <mxCell id="fSV53SAg83PH5_xKsdlr-7" style="edgeStyle=orthogonalEdgeStyle;rounded=0;orthogonalLoop=1;jettySize=auto;html=1;entryX=-0.004;entryY=0.168;entryDx=0;entryDy=0;entryPerimeter=0;" parent="1" source="fSV53SAg83PH5_xKsdlr-1" target="HsYgSBCZ7J4jQA-JqUkq-11" edge="1">
          <mxGeometry relative="1" as="geometry">
            <Array as="points">
              <mxPoint x="387" y="992" />
            </Array>
          </mxGeometry>
        </mxCell>
        <mxCell id="fSV53SAg83PH5_xKsdlr-10" style="edgeStyle=orthogonalEdgeStyle;rounded=0;orthogonalLoop=1;jettySize=auto;html=1;entryX=-0.025;entryY=0.07;entryDx=0;entryDy=0;entryPerimeter=0;" parent="1" source="fSV53SAg83PH5_xKsdlr-1" target="HsYgSBCZ7J4jQA-JqUkq-25" edge="1">
          <mxGeometry relative="1" as="geometry" />
        </mxCell>
        <mxCell id="fSV53SAg83PH5_xKsdlr-1" value="&lt;p style=&quot;margin:0px;margin-top:4px;text-align:center;&quot;&gt;&lt;b&gt;Compra&lt;/b&gt;&lt;/p&gt;&lt;hr size=&quot;1&quot;&gt;&lt;p style=&quot;margin:0px;margin-left:4px;&quot;&gt;+ Id Compra:String&lt;/p&gt;&lt;p style=&quot;margin:0px;margin-left:4px;&quot;&gt;+ Estado: String&lt;/p&gt;&lt;p style=&quot;margin:0px;margin-left:4px;&quot;&gt;+ Fecha: String&lt;/p&gt;&amp;nbsp;+ Detalle: String&lt;br&gt;&amp;nbsp;+ Precio unitario:&amp;nbsp;Float&lt;br&gt;&amp;nbsp;&lt;br&gt;&lt;p style=&quot;margin:0px;margin-left:4px;&quot;&gt;&amp;nbsp; &amp;nbsp;&lt;br&gt;&lt;/p&gt;&lt;p class=&quot;MsoNormal&quot;&gt;&lt;span lang=&quot;ES-US&quot;&gt;&lt;/span&gt;&lt;/p&gt;" style="verticalAlign=top;align=left;overflow=fill;fontSize=12;fontFamily=Helvetica;html=1;whiteSpace=wrap;" parent="1" vertex="1">
          <mxGeometry x="217" y="700" width="190" height="110" as="geometry" />
        </mxCell>
        <mxCell id="fSV53SAg83PH5_xKsdlr-5" value="1" style="text;html=1;align=center;verticalAlign=middle;resizable=0;points=[];autosize=1;strokeColor=none;fillColor=none;" parent="1" vertex="1">
          <mxGeometry x="112" y="558" width="30" height="30" as="geometry" />
        </mxCell>
        <mxCell id="fSV53SAg83PH5_xKsdlr-6" value="1..*" style="text;html=1;align=center;verticalAlign=middle;resizable=0;points=[];autosize=1;strokeColor=none;fillColor=none;" parent="1" vertex="1">
          <mxGeometry x="177" y="688" width="40" height="30" as="geometry" />
        </mxCell>
        <mxCell id="fSV53SAg83PH5_xKsdlr-8" value="1" style="text;html=1;align=center;verticalAlign=middle;resizable=0;points=[];autosize=1;strokeColor=none;fillColor=none;" parent="1" vertex="1">
          <mxGeometry x="360" y="812" width="30" height="30" as="geometry" />
        </mxCell>
        <mxCell id="fSV53SAg83PH5_xKsdlr-9" value="1" style="text;html=1;align=center;verticalAlign=middle;resizable=0;points=[];autosize=1;strokeColor=none;fillColor=none;" parent="1" vertex="1">
          <mxGeometry x="437" y="952" width="30" height="30" as="geometry" />
        </mxCell>
        <mxCell id="fSV53SAg83PH5_xKsdlr-11" value="1" style="text;html=1;align=center;verticalAlign=middle;resizable=0;points=[];autosize=1;strokeColor=none;fillColor=none;" parent="1" vertex="1">
          <mxGeometry x="412" y="768" width="30" height="30" as="geometry" />
        </mxCell>
        <mxCell id="fSV53SAg83PH5_xKsdlr-12" value="1" style="text;html=1;align=center;verticalAlign=middle;resizable=0;points=[];autosize=1;strokeColor=none;fillColor=none;" parent="1" vertex="1">
          <mxGeometry x="1242" y="598" width="30" height="30" as="geometry" />
        </mxCell>
      </root>
    </mxGraphModel>
  </diagram>
  <diagram id="Opmp0-MdwP_0fJSJGr9X" name="Diagrama de Actividades 2 problema">
    <mxGraphModel dx="2100" dy="1158" grid="1" gridSize="10" guides="1" tooltips="1" connect="1" arrows="1" fold="1" page="1" pageScale="1" pageWidth="2339" pageHeight="3300" math="0" shadow="0">
      <root>
        <mxCell id="0" />
        <mxCell id="1" parent="0" />
        <mxCell id="ji_YYlonFdgKlNLtnSUO-1" value="Usuario" style="swimlane;startSize=20;whiteSpace=wrap;html=1;" vertex="1" parent="1">
          <mxGeometry x="190" y="180" width="280" height="740" as="geometry" />
        </mxCell>
        <mxCell id="ji_YYlonFdgKlNLtnSUO-2" style="edgeStyle=orthogonalEdgeStyle;rounded=0;orthogonalLoop=1;jettySize=auto;html=1;entryX=0.5;entryY=0;entryDx=0;entryDy=0;" edge="1" parent="ji_YYlonFdgKlNLtnSUO-1" source="ji_YYlonFdgKlNLtnSUO-3" target="ji_YYlonFdgKlNLtnSUO-5">
          <mxGeometry relative="1" as="geometry" />
        </mxCell>
        <mxCell id="ji_YYlonFdgKlNLtnSUO-3" value="" style="ellipse;fillColor=strokeColor;html=1;" vertex="1" parent="ji_YYlonFdgKlNLtnSUO-1">
          <mxGeometry x="135" y="60" width="30" height="30" as="geometry" />
        </mxCell>
        <mxCell id="ji_YYlonFdgKlNLtnSUO-4" value="" style="edgeStyle=orthogonalEdgeStyle;rounded=0;orthogonalLoop=1;jettySize=auto;html=1;" edge="1" parent="ji_YYlonFdgKlNLtnSUO-1" source="ji_YYlonFdgKlNLtnSUO-5" target="ji_YYlonFdgKlNLtnSUO-7">
          <mxGeometry relative="1" as="geometry" />
        </mxCell>
        <mxCell id="ji_YYlonFdgKlNLtnSUO-5" value="Ingreso a la tienda virtual&amp;nbsp;" style="rounded=1;whiteSpace=wrap;html=1;" vertex="1" parent="ji_YYlonFdgKlNLtnSUO-1">
          <mxGeometry x="90" y="130" width="120" height="60" as="geometry" />
        </mxCell>
        <mxCell id="ji_YYlonFdgKlNLtnSUO-6" value="" style="edgeStyle=orthogonalEdgeStyle;rounded=0;orthogonalLoop=1;jettySize=auto;html=1;" edge="1" parent="ji_YYlonFdgKlNLtnSUO-1" source="ji_YYlonFdgKlNLtnSUO-7" target="ji_YYlonFdgKlNLtnSUO-9">
          <mxGeometry relative="1" as="geometry" />
        </mxCell>
        <mxCell id="ji_YYlonFdgKlNLtnSUO-7" value="Seleccionar los productos a comprar" style="whiteSpace=wrap;html=1;rounded=1;" vertex="1" parent="ji_YYlonFdgKlNLtnSUO-1">
          <mxGeometry x="90" y="260" width="120" height="60" as="geometry" />
        </mxCell>
        <mxCell id="ji_YYlonFdgKlNLtnSUO-8" value="" style="edgeStyle=orthogonalEdgeStyle;rounded=0;orthogonalLoop=1;jettySize=auto;html=1;" edge="1" parent="ji_YYlonFdgKlNLtnSUO-1" source="ji_YYlonFdgKlNLtnSUO-9" target="ji_YYlonFdgKlNLtnSUO-10">
          <mxGeometry relative="1" as="geometry" />
        </mxCell>
        <mxCell id="ji_YYlonFdgKlNLtnSUO-9" value="Ver detalle de factura&amp;nbsp;" style="whiteSpace=wrap;html=1;rounded=1;" vertex="1" parent="ji_YYlonFdgKlNLtnSUO-1">
          <mxGeometry x="80" y="400" width="120" height="60" as="geometry" />
        </mxCell>
        <mxCell id="ji_YYlonFdgKlNLtnSUO-10" value="Realizar el pago" style="whiteSpace=wrap;html=1;rounded=1;" vertex="1" parent="ji_YYlonFdgKlNLtnSUO-1">
          <mxGeometry x="80" y="540" width="120" height="60" as="geometry" />
        </mxCell>
        <mxCell id="ji_YYlonFdgKlNLtnSUO-11" value="Ärea de ventas" style="swimlane;startSize=20;whiteSpace=wrap;html=1;" vertex="1" parent="1">
          <mxGeometry x="470" y="180" width="330" height="740" as="geometry" />
        </mxCell>
        <mxCell id="ji_YYlonFdgKlNLtnSUO-12" value="Revisión de factura generada" style="whiteSpace=wrap;html=1;rounded=1;" vertex="1" parent="ji_YYlonFdgKlNLtnSUO-11">
          <mxGeometry x="110" y="90" width="120" height="60" as="geometry" />
        </mxCell>
        <mxCell id="ji_YYlonFdgKlNLtnSUO-13" value="Generar cupón de descuento del 20% en proxima compra" style="whiteSpace=wrap;html=1;rounded=1;" vertex="1" parent="ji_YYlonFdgKlNLtnSUO-11">
          <mxGeometry x="80" y="490" width="120" height="60" as="geometry" />
        </mxCell>
        <mxCell id="ji_YYlonFdgKlNLtnSUO-14" style="edgeStyle=orthogonalEdgeStyle;rounded=0;orthogonalLoop=1;jettySize=auto;html=1;entryX=0.5;entryY=0;entryDx=0;entryDy=0;" edge="1" parent="ji_YYlonFdgKlNLtnSUO-11" source="ji_YYlonFdgKlNLtnSUO-16" target="ji_YYlonFdgKlNLtnSUO-13">
          <mxGeometry relative="1" as="geometry" />
        </mxCell>
        <mxCell id="ji_YYlonFdgKlNLtnSUO-15" style="edgeStyle=orthogonalEdgeStyle;rounded=0;orthogonalLoop=1;jettySize=auto;html=1;entryX=1;entryY=1;entryDx=0;entryDy=0;entryPerimeter=0;startArrow=classic;startFill=1;endArrow=none;endFill=0;" edge="1" parent="ji_YYlonFdgKlNLtnSUO-11" source="ji_YYlonFdgKlNLtnSUO-16" target="ji_YYlonFdgKlNLtnSUO-17">
          <mxGeometry relative="1" as="geometry">
            <Array as="points">
              <mxPoint x="170" y="330" />
            </Array>
          </mxGeometry>
        </mxCell>
        <mxCell id="ji_YYlonFdgKlNLtnSUO-16" value="Compensación al cliente afectado" style="rounded=1;whiteSpace=wrap;html=1;" vertex="1" parent="ji_YYlonFdgKlNLtnSUO-11">
          <mxGeometry x="110" y="370" width="120" height="60" as="geometry" />
        </mxCell>
        <mxCell id="ji_YYlonFdgKlNLtnSUO-17" value="" style="html=1;shape=mxgraph.flowchart.annotation_2;align=left;labelPosition=right;rotation=-180;" vertex="1" parent="ji_YYlonFdgKlNLtnSUO-11">
          <mxGeometry x="260" y="330" width="50" height="100" as="geometry" />
        </mxCell>
        <mxCell id="ji_YYlonFdgKlNLtnSUO-18" value="[Compra en línea]" style="edgeStyle=orthogonalEdgeStyle;rounded=0;orthogonalLoop=1;jettySize=auto;html=1;" edge="1" parent="1" source="ji_YYlonFdgKlNLtnSUO-10" target="ji_YYlonFdgKlNLtnSUO-12">
          <mxGeometry relative="1" as="geometry">
            <Array as="points">
              <mxPoint x="520" y="750" />
              <mxPoint x="520" y="300" />
            </Array>
          </mxGeometry>
        </mxCell>
        <mxCell id="ji_YYlonFdgKlNLtnSUO-19" value="Área de Bodega" style="swimlane;startSize=20;whiteSpace=wrap;html=1;" vertex="1" parent="1">
          <mxGeometry x="800" y="180" width="420" height="740" as="geometry" />
        </mxCell>
        <mxCell id="ji_YYlonFdgKlNLtnSUO-20" value="" style="edgeStyle=orthogonalEdgeStyle;rounded=0;orthogonalLoop=1;jettySize=auto;html=1;" edge="1" parent="ji_YYlonFdgKlNLtnSUO-19" source="ji_YYlonFdgKlNLtnSUO-21" target="ji_YYlonFdgKlNLtnSUO-24">
          <mxGeometry relative="1" as="geometry" />
        </mxCell>
        <mxCell id="ji_YYlonFdgKlNLtnSUO-21" value="Revisar si existe el producto en stock" style="whiteSpace=wrap;html=1;rounded=1;" vertex="1" parent="ji_YYlonFdgKlNLtnSUO-19">
          <mxGeometry x="150" y="30" width="120" height="60" as="geometry" />
        </mxCell>
        <mxCell id="ji_YYlonFdgKlNLtnSUO-22" value="[Existe el producto en stock]" style="edgeStyle=orthogonalEdgeStyle;rounded=0;orthogonalLoop=1;jettySize=auto;html=1;" edge="1" parent="ji_YYlonFdgKlNLtnSUO-19" source="ji_YYlonFdgKlNLtnSUO-24" target="ji_YYlonFdgKlNLtnSUO-26">
          <mxGeometry relative="1" as="geometry" />
        </mxCell>
        <mxCell id="ji_YYlonFdgKlNLtnSUO-23" value="{No existe el producto en stock]" style="edgeStyle=orthogonalEdgeStyle;rounded=0;orthogonalLoop=1;jettySize=auto;html=1;entryX=1;entryY=0.5;entryDx=0;entryDy=0;" edge="1" parent="ji_YYlonFdgKlNLtnSUO-19" source="ji_YYlonFdgKlNLtnSUO-24" target="ji_YYlonFdgKlNLtnSUO-28">
          <mxGeometry x="-0.4704" y="-30" relative="1" as="geometry">
            <Array as="points">
              <mxPoint x="180" y="360" />
              <mxPoint x="230" y="360" />
              <mxPoint x="230" y="470" />
            </Array>
            <mxPoint as="offset" />
          </mxGeometry>
        </mxCell>
        <mxCell id="ji_YYlonFdgKlNLtnSUO-24" value="" style="rhombus;whiteSpace=wrap;html=1;rounded=1;" vertex="1" parent="ji_YYlonFdgKlNLtnSUO-19">
          <mxGeometry x="140" y="160" width="80" height="80" as="geometry" />
        </mxCell>
        <mxCell id="ji_YYlonFdgKlNLtnSUO-25" value="" style="edgeStyle=orthogonalEdgeStyle;rounded=0;orthogonalLoop=1;jettySize=auto;html=1;entryX=0.5;entryY=0;entryDx=0;entryDy=0;" edge="1" parent="ji_YYlonFdgKlNLtnSUO-19" source="ji_YYlonFdgKlNLtnSUO-26" target="ji_YYlonFdgKlNLtnSUO-27">
          <mxGeometry relative="1" as="geometry">
            <mxPoint x="340" y="400" as="targetPoint" />
          </mxGeometry>
        </mxCell>
        <mxCell id="ji_YYlonFdgKlNLtnSUO-26" value="Realizar el despacho del producto" style="whiteSpace=wrap;html=1;rounded=1;" vertex="1" parent="ji_YYlonFdgKlNLtnSUO-19">
          <mxGeometry x="280" y="270" width="120" height="60" as="geometry" />
        </mxCell>
        <mxCell id="ji_YYlonFdgKlNLtnSUO-27" value="" style="ellipse;html=1;shape=endState;fillColor=strokeColor;" vertex="1" parent="ji_YYlonFdgKlNLtnSUO-19">
          <mxGeometry x="320" y="400" width="40" height="40" as="geometry" />
        </mxCell>
        <mxCell id="ji_YYlonFdgKlNLtnSUO-28" value="Notificar al personal de ventas" style="rounded=1;whiteSpace=wrap;html=1;" vertex="1" parent="ji_YYlonFdgKlNLtnSUO-19">
          <mxGeometry x="50" y="440" width="120" height="60" as="geometry" />
        </mxCell>
        <mxCell id="ji_YYlonFdgKlNLtnSUO-29" style="edgeStyle=orthogonalEdgeStyle;rounded=0;orthogonalLoop=1;jettySize=auto;html=1;entryX=1;entryY=0.5;entryDx=0;entryDy=0;" edge="1" parent="ji_YYlonFdgKlNLtnSUO-19" source="ji_YYlonFdgKlNLtnSUO-30" target="ji_YYlonFdgKlNLtnSUO-31">
          <mxGeometry relative="1" as="geometry" />
        </mxCell>
        <mxCell id="ji_YYlonFdgKlNLtnSUO-30" value="Realizar el despacho del producto" style="whiteSpace=wrap;html=1;rounded=1;" vertex="1" parent="ji_YYlonFdgKlNLtnSUO-19">
          <mxGeometry x="260" y="510" width="120" height="60" as="geometry" />
        </mxCell>
        <mxCell id="ji_YYlonFdgKlNLtnSUO-31" value="" style="ellipse;html=1;shape=endState;fillColor=strokeColor;" vertex="1" parent="ji_YYlonFdgKlNLtnSUO-19">
          <mxGeometry x="130" y="520" width="40" height="40" as="geometry" />
        </mxCell>
        <mxCell id="ji_YYlonFdgKlNLtnSUO-32" value="" style="edgeStyle=orthogonalEdgeStyle;rounded=0;orthogonalLoop=1;jettySize=auto;html=1;" edge="1" parent="1" source="ji_YYlonFdgKlNLtnSUO-12" target="ji_YYlonFdgKlNLtnSUO-21">
          <mxGeometry relative="1" as="geometry">
            <Array as="points">
              <mxPoint x="640" y="400" />
              <mxPoint x="820" y="400" />
              <mxPoint x="820" y="230" />
            </Array>
          </mxGeometry>
        </mxCell>
        <mxCell id="ji_YYlonFdgKlNLtnSUO-33" value="[Factura enviada]" style="edgeLabel;html=1;align=center;verticalAlign=middle;resizable=0;points=[];" vertex="1" connectable="0" parent="ji_YYlonFdgKlNLtnSUO-32">
          <mxGeometry x="-0.2367" y="-1" relative="1" as="geometry">
            <mxPoint x="-40" as="offset" />
          </mxGeometry>
        </mxCell>
        <mxCell id="ji_YYlonFdgKlNLtnSUO-34" value="Área de atención al cliente" style="swimlane;startSize=20;whiteSpace=wrap;html=1;" vertex="1" parent="1">
          <mxGeometry x="1220" y="180" width="350" height="740" as="geometry" />
        </mxCell>
        <mxCell id="ji_YYlonFdgKlNLtnSUO-35" value="" style="edgeStyle=orthogonalEdgeStyle;rounded=0;orthogonalLoop=1;jettySize=auto;html=1;" edge="1" parent="ji_YYlonFdgKlNLtnSUO-34" source="ji_YYlonFdgKlNLtnSUO-36" target="ji_YYlonFdgKlNLtnSUO-38">
          <mxGeometry relative="1" as="geometry" />
        </mxCell>
        <mxCell id="ji_YYlonFdgKlNLtnSUO-36" value="Llamada al usuario afectado" style="whiteSpace=wrap;html=1;rounded=1;" vertex="1" parent="ji_YYlonFdgKlNLtnSUO-34">
          <mxGeometry x="115" y="70" width="120" height="60" as="geometry" />
        </mxCell>
        <mxCell id="ji_YYlonFdgKlNLtnSUO-37" style="edgeStyle=orthogonalEdgeStyle;rounded=0;orthogonalLoop=1;jettySize=auto;html=1;" edge="1" parent="ji_YYlonFdgKlNLtnSUO-34" source="ji_YYlonFdgKlNLtnSUO-38" target="ji_YYlonFdgKlNLtnSUO-39">
          <mxGeometry relative="1" as="geometry" />
        </mxCell>
        <mxCell id="ji_YYlonFdgKlNLtnSUO-38" value="Dar información de su compra y su bonificación" style="whiteSpace=wrap;html=1;rounded=1;" vertex="1" parent="ji_YYlonFdgKlNLtnSUO-34">
          <mxGeometry x="115" y="210" width="120" height="60" as="geometry" />
        </mxCell>
        <mxCell id="ji_YYlonFdgKlNLtnSUO-39" value="" style="ellipse;html=1;shape=endState;fillColor=strokeColor;" vertex="1" parent="ji_YYlonFdgKlNLtnSUO-34">
          <mxGeometry x="155" y="340" width="40" height="40" as="geometry" />
        </mxCell>
        <mxCell id="ji_YYlonFdgKlNLtnSUO-40" value="{Bonificación generada]" style="edgeStyle=orthogonalEdgeStyle;rounded=0;orthogonalLoop=1;jettySize=auto;html=1;" edge="1" parent="1" source="ji_YYlonFdgKlNLtnSUO-13" target="ji_YYlonFdgKlNLtnSUO-36">
          <mxGeometry x="-0.2825" relative="1" as="geometry">
            <Array as="points">
              <mxPoint x="760" y="840" />
              <mxPoint x="760" y="770" />
              <mxPoint x="1250" y="770" />
              <mxPoint x="1250" y="280" />
            </Array>
            <mxPoint as="offset" />
          </mxGeometry>
        </mxCell>
        <mxCell id="ji_YYlonFdgKlNLtnSUO-41" style="edgeStyle=orthogonalEdgeStyle;rounded=0;orthogonalLoop=1;jettySize=auto;html=1;entryX=0;entryY=0.5;entryDx=0;entryDy=0;entryPerimeter=0;" edge="1" parent="1" source="ji_YYlonFdgKlNLtnSUO-28" target="ji_YYlonFdgKlNLtnSUO-17">
          <mxGeometry relative="1" as="geometry" />
        </mxCell>
        <mxCell id="ji_YYlonFdgKlNLtnSUO-42" value="Área de inventario" style="swimlane;startSize=20;whiteSpace=wrap;html=1;" vertex="1" parent="1">
          <mxGeometry x="1570" y="180" width="260" height="740" as="geometry" />
        </mxCell>
        <mxCell id="ji_YYlonFdgKlNLtnSUO-43" value="" style="edgeStyle=orthogonalEdgeStyle;rounded=0;orthogonalLoop=1;jettySize=auto;html=1;" edge="1" parent="ji_YYlonFdgKlNLtnSUO-42" source="ji_YYlonFdgKlNLtnSUO-44" target="ji_YYlonFdgKlNLtnSUO-45">
          <mxGeometry relative="1" as="geometry" />
        </mxCell>
        <mxCell id="ji_YYlonFdgKlNLtnSUO-44" value="Adquirir el producto faltante" style="rounded=1;whiteSpace=wrap;html=1;" vertex="1" parent="ji_YYlonFdgKlNLtnSUO-42">
          <mxGeometry x="90" y="60" width="120" height="60" as="geometry" />
        </mxCell>
        <mxCell id="ji_YYlonFdgKlNLtnSUO-45" value="Producto adquirido" style="whiteSpace=wrap;html=1;rounded=1;" vertex="1" parent="ji_YYlonFdgKlNLtnSUO-42">
          <mxGeometry x="90" y="200" width="120" height="60" as="geometry" />
        </mxCell>
        <mxCell id="ji_YYlonFdgKlNLtnSUO-46" style="edgeStyle=orthogonalEdgeStyle;rounded=0;orthogonalLoop=1;jettySize=auto;html=1;entryX=1;entryY=0;entryDx=0;entryDy=0;entryPerimeter=0;endArrow=none;endFill=0;startArrow=classic;startFill=1;" edge="1" parent="1" source="ji_YYlonFdgKlNLtnSUO-44" target="ji_YYlonFdgKlNLtnSUO-17">
          <mxGeometry relative="1" as="geometry">
            <Array as="points">
              <mxPoint x="1600" y="270" />
              <mxPoint x="1600" y="860" />
              <mxPoint x="710" y="860" />
              <mxPoint x="710" y="610" />
            </Array>
          </mxGeometry>
        </mxCell>
        <mxCell id="ji_YYlonFdgKlNLtnSUO-47" value="[Notificación de alerta]" style="edgeLabel;html=1;align=center;verticalAlign=middle;resizable=0;points=[];" vertex="1" connectable="0" parent="ji_YYlonFdgKlNLtnSUO-46">
          <mxGeometry x="0.246" y="1" relative="1" as="geometry">
            <mxPoint x="-1" as="offset" />
          </mxGeometry>
        </mxCell>
        <mxCell id="ji_YYlonFdgKlNLtnSUO-48" value="" style="edgeStyle=orthogonalEdgeStyle;rounded=0;orthogonalLoop=1;jettySize=auto;html=1;" edge="1" parent="1" source="ji_YYlonFdgKlNLtnSUO-45" target="ji_YYlonFdgKlNLtnSUO-30">
          <mxGeometry relative="1" as="geometry">
            <Array as="points">
              <mxPoint x="1740" y="720" />
            </Array>
          </mxGeometry>
        </mxCell>
        <mxCell id="ji_YYlonFdgKlNLtnSUO-49" value="[Envío de producto adquirido]" style="edgeLabel;html=1;align=center;verticalAlign=middle;resizable=0;points=[];" vertex="1" connectable="0" parent="ji_YYlonFdgKlNLtnSUO-48">
          <mxGeometry x="0.1468" y="3" relative="1" as="geometry">
            <mxPoint x="-70" y="-3" as="offset" />
          </mxGeometry>
        </mxCell>
      </root>
    </mxGraphModel>
  </diagram>
  <diagram id="QqZhLn78Jdir6fSnJRlX" name="Página-3">
    <mxGraphModel dx="1050" dy="579" grid="1" gridSize="10" guides="1" tooltips="1" connect="1" arrows="1" fold="1" page="1" pageScale="1" pageWidth="827" pageHeight="1169" math="0" shadow="0">
      <root>
        <mxCell id="0" />
        <mxCell id="1" parent="0" />
        <mxCell id="A-jvLPGMzh5l7a9f45Lc-9" style="edgeStyle=orthogonalEdgeStyle;rounded=0;orthogonalLoop=1;jettySize=auto;html=1;entryX=0;entryY=0.75;entryDx=0;entryDy=0;" parent="1" source="HNSODulGz9ibIiqVu8n0-6" target="HNSODulGz9ibIiqVu8n0-15" edge="1">
          <mxGeometry relative="1" as="geometry" />
        </mxCell>
        <mxCell id="HNSODulGz9ibIiqVu8n0-6" value="&lt;p style=&quot;margin:0px;margin-top:4px;text-align:center;&quot;&gt;&lt;b&gt;Cliente&lt;/b&gt;&lt;/p&gt;&lt;hr size=&quot;1&quot;&gt;&lt;p style=&quot;margin:0px;margin-left:4px;&quot;&gt;DNI: String&lt;/p&gt;&lt;hr size=&quot;1&quot;&gt;&lt;p style=&quot;margin:0px;margin-left:4px;&quot;&gt;+ Ver producto ()&lt;/p&gt;&lt;p style=&quot;margin:0px;margin-left:4px;&quot;&gt;+ Añadir al carrito ()&lt;/p&gt;&lt;p style=&quot;margin:0px;margin-left:4px;&quot;&gt;+ Realizar pago ()&lt;/p&gt;&lt;p style=&quot;margin:0px;margin-left:4px;&quot;&gt;+ Consultar compras realizadas ()&lt;/p&gt;&lt;p style=&quot;margin:0px;margin-left:4px;&quot;&gt;+ Ingresar cupones de descuento ()&lt;/p&gt;&lt;p class=&quot;MsoNormal&quot;&gt;&lt;span lang=&quot;ES-US&quot;&gt;&lt;/span&gt;&lt;/p&gt;" style="verticalAlign=top;align=left;overflow=fill;fontSize=12;fontFamily=Helvetica;html=1;whiteSpace=wrap;" parent="1" vertex="1">
          <mxGeometry x="300" y="290" width="210" height="178" as="geometry" />
        </mxCell>
        <mxCell id="HNSODulGz9ibIiqVu8n0-9" value="&lt;p style=&quot;margin:0px;margin-top:4px;text-align:center;&quot;&gt;&lt;b&gt;Hotel&lt;/b&gt;&lt;/p&gt;&lt;hr size=&quot;1&quot;&gt;&lt;p style=&quot;margin:0px;margin-left:4px;&quot;&gt;&lt;br&gt;&lt;/p&gt;&lt;p style=&quot;margin:0px;margin-left:4px;&quot;&gt;+ Nombre: String&lt;/p&gt;&lt;p class=&quot;MsoNormal&quot;&gt;&lt;span lang=&quot;ES-US&quot;&gt;&lt;/span&gt;&lt;/p&gt;" style="verticalAlign=top;align=left;overflow=fill;fontSize=12;fontFamily=Helvetica;html=1;whiteSpace=wrap;" parent="1" vertex="1">
          <mxGeometry x="570" y="140" width="160" height="90" as="geometry" />
        </mxCell>
        <mxCell id="A-jvLPGMzh5l7a9f45Lc-4" style="edgeStyle=orthogonalEdgeStyle;rounded=0;orthogonalLoop=1;jettySize=auto;html=1;entryX=0.349;entryY=1.003;entryDx=0;entryDy=0;entryPerimeter=0;endArrow=block;endFill=0;" parent="1" source="HNSODulGz9ibIiqVu8n0-11" target="HNSODulGz9ibIiqVu8n0-6" edge="1">
          <mxGeometry relative="1" as="geometry">
            <Array as="points">
              <mxPoint x="225" y="574" />
              <mxPoint x="370" y="574" />
              <mxPoint x="370" y="530" />
              <mxPoint x="373" y="530" />
            </Array>
          </mxGeometry>
        </mxCell>
        <mxCell id="HNSODulGz9ibIiqVu8n0-11" value="&lt;p style=&quot;margin:0px;margin-top:4px;text-align:center;&quot;&gt;&lt;b&gt;Habitual&amp;nbsp;&lt;/b&gt;&lt;/p&gt;&lt;hr size=&quot;1&quot;&gt;&lt;p style=&quot;margin:0px;margin-left:4px;&quot;&gt;+ descuento: double&lt;/p&gt;&lt;p class=&quot;MsoNormal&quot;&gt;&lt;span lang=&quot;ES-US&quot;&gt;&lt;/span&gt;&lt;/p&gt;" style="verticalAlign=top;align=left;overflow=fill;fontSize=12;fontFamily=Helvetica;html=1;whiteSpace=wrap;" parent="1" vertex="1">
          <mxGeometry x="130" y="637" width="190" height="190" as="geometry" />
        </mxCell>
        <mxCell id="HNSODulGz9ibIiqVu8n0-15" value="&lt;p style=&quot;margin:0px;margin-top:4px;text-align:center;&quot;&gt;&lt;b&gt;Reserva&lt;/b&gt;&lt;/p&gt;&lt;hr size=&quot;1&quot;&gt;&lt;p style=&quot;margin:0px;margin-left:4px;&quot;&gt;+ Id Pago: String&lt;/p&gt;&lt;p style=&quot;margin:0px;margin-left:4px;&quot;&gt;+ id Cliente: String&lt;/p&gt;&lt;p style=&quot;margin:0px;margin-left:4px;&quot;&gt;+ Fecha inicio: String&lt;/p&gt;&lt;p style=&quot;border-color: var(--border-color); margin: 0px 0px 0px 4px;&quot;&gt;+ Fecha final: tring&lt;/p&gt;&lt;div&gt;&lt;br&gt;&lt;/div&gt;&lt;p style=&quot;margin:0px;margin-left:4px;&quot;&gt;+ Valor total: String&lt;/p&gt;&lt;p class=&quot;MsoNormal&quot;&gt;&lt;span lang=&quot;ES-US&quot;&gt;&lt;/span&gt;&lt;/p&gt;" style="verticalAlign=top;align=left;overflow=fill;fontSize=12;fontFamily=Helvetica;html=1;whiteSpace=wrap;" parent="1" vertex="1">
          <mxGeometry x="680" y="310" width="160" height="90" as="geometry" />
        </mxCell>
        <mxCell id="HNSODulGz9ibIiqVu8n0-16" value="1" style="text;html=1;align=center;verticalAlign=middle;resizable=0;points=[];autosize=1;strokeColor=none;fillColor=none;" parent="1" vertex="1">
          <mxGeometry x="745" y="150" width="30" height="30" as="geometry" />
        </mxCell>
        <mxCell id="A-jvLPGMzh5l7a9f45Lc-26" style="edgeStyle=orthogonalEdgeStyle;rounded=0;orthogonalLoop=1;jettySize=auto;html=1;entryX=0.25;entryY=1;entryDx=0;entryDy=0;endArrow=blockThin;endFill=0;" parent="1" source="HNSODulGz9ibIiqVu8n0-17" target="HNSODulGz9ibIiqVu8n0-20" edge="1">
          <mxGeometry relative="1" as="geometry" />
        </mxCell>
        <mxCell id="HNSODulGz9ibIiqVu8n0-17" value="&lt;p style=&quot;margin:0px;margin-top:4px;text-align:center;&quot;&gt;&lt;b&gt;Doble&lt;/b&gt;&lt;/p&gt;&lt;hr size=&quot;1&quot;&gt;&lt;p style=&quot;margin:0px;margin-left:4px;&quot;&gt;+ Id transferencia: String&lt;/p&gt;&lt;p style=&quot;margin:0px;margin-left:4px;&quot;&gt;+ Nombre del titular: String&lt;/p&gt;&lt;p style=&quot;margin:0px;margin-left:4px;&quot;&gt;+ Monto a pagar: String&lt;/p&gt;&lt;p class=&quot;MsoNormal&quot;&gt;&lt;span lang=&quot;ES-US&quot;&gt;&lt;/span&gt;&lt;/p&gt;" style="verticalAlign=top;align=left;overflow=fill;fontSize=12;fontFamily=Helvetica;html=1;whiteSpace=wrap;" parent="1" vertex="1">
          <mxGeometry x="1020" y="690" width="160" height="82" as="geometry" />
        </mxCell>
        <mxCell id="A-jvLPGMzh5l7a9f45Lc-27" style="edgeStyle=orthogonalEdgeStyle;rounded=0;orthogonalLoop=1;jettySize=auto;html=1;endArrow=block;endFill=0;" parent="1" source="HNSODulGz9ibIiqVu8n0-18" target="HNSODulGz9ibIiqVu8n0-20" edge="1">
          <mxGeometry relative="1" as="geometry" />
        </mxCell>
        <mxCell id="HNSODulGz9ibIiqVu8n0-18" value="&lt;p style=&quot;margin:0px;margin-top:4px;text-align:center;&quot;&gt;&lt;b&gt;Habitual&lt;/b&gt;&lt;/p&gt;&lt;hr size=&quot;1&quot;&gt;&lt;p style=&quot;margin:0px;margin-left:4px;&quot;&gt;+ Id Tarjeta de credito: String&lt;/p&gt;&lt;p style=&quot;margin:0px;margin-left:4px;&quot;&gt;+ Nombre cliente: String&lt;/p&gt;&lt;p style=&quot;margin:0px;margin-left:4px;&quot;&gt;+ Valor a pagar: String&lt;/p&gt;&lt;p class=&quot;MsoNormal&quot;&gt;&lt;span lang=&quot;ES-US&quot;&gt;&lt;/span&gt;&lt;/p&gt;" style="verticalAlign=top;align=left;overflow=fill;fontSize=12;fontFamily=Helvetica;html=1;whiteSpace=wrap;" parent="1" vertex="1">
          <mxGeometry x="1210" y="692" width="190" height="80" as="geometry" />
        </mxCell>
        <mxCell id="7lXASeLMBWBlddBXM0hv-1" style="edgeStyle=orthogonalEdgeStyle;rounded=0;orthogonalLoop=1;jettySize=auto;html=1;entryX=0.5;entryY=1;entryDx=0;entryDy=0;endArrow=diamondThin;endFill=0;" parent="1" source="HNSODulGz9ibIiqVu8n0-20" target="HNSODulGz9ibIiqVu8n0-28" edge="1">
          <mxGeometry relative="1" as="geometry" />
        </mxCell>
        <mxCell id="HNSODulGz9ibIiqVu8n0-20" value="&lt;p style=&quot;margin:0px;margin-top:4px;text-align:center;&quot;&gt;&lt;b&gt;Habitacion&lt;/b&gt;&lt;/p&gt;&lt;hr size=&quot;1&quot;&gt;&lt;p style=&quot;margin:0px;margin-left:4px;&quot;&gt;numero: int&lt;/p&gt;&lt;p style=&quot;margin:0px;margin-left:4px;&quot;&gt;precio: double&lt;/p&gt;&lt;p class=&quot;MsoNormal&quot;&gt;&lt;span lang=&quot;ES-US&quot;&gt;&lt;/span&gt;&lt;/p&gt;" style="verticalAlign=top;align=left;overflow=fill;fontSize=12;fontFamily=Helvetica;html=1;whiteSpace=wrap;" parent="1" vertex="1">
          <mxGeometry x="1030" y="478" width="250" height="112" as="geometry" />
        </mxCell>
        <mxCell id="HNSODulGz9ibIiqVu8n0-22" value="1" style="text;html=1;align=center;verticalAlign=middle;resizable=0;points=[];autosize=1;strokeColor=none;fillColor=none;" parent="1" vertex="1">
          <mxGeometry x="510" y="350" width="30" height="30" as="geometry" />
        </mxCell>
        <mxCell id="HNSODulGz9ibIiqVu8n0-23" value="1" style="text;html=1;align=center;verticalAlign=middle;resizable=0;points=[];autosize=1;strokeColor=none;fillColor=none;" parent="1" vertex="1">
          <mxGeometry x="370" y="212" width="30" height="30" as="geometry" />
        </mxCell>
        <mxCell id="HNSODulGz9ibIiqVu8n0-28" value="&lt;p style=&quot;margin:0px;margin-top:4px;text-align:center;&quot;&gt;&lt;b&gt;ListadoHabitacionres&lt;/b&gt;&lt;/p&gt;&lt;hr size=&quot;1&quot;&gt;&lt;p style=&quot;margin:0px;margin-left:4px;&quot;&gt;+ Cédula: String&lt;/p&gt;&lt;p style=&quot;margin:0px;margin-left:4px;&quot;&gt;+ Nombre: String&lt;/p&gt;&lt;p style=&quot;margin:0px;margin-left:4px;&quot;&gt;+ Teléfono: String&lt;/p&gt;&lt;p style=&quot;margin:0px;margin-left:4px;&quot;&gt;+Dirección: String&lt;/p&gt;&lt;hr size=&quot;1&quot;&gt;&lt;p style=&quot;margin:0px;margin-left:4px;&quot;&gt;+ Ver productos ()&lt;/p&gt;&lt;p style=&quot;margin:0px;margin-left:4px;&quot;&gt;+ Agregar productos ()&lt;br&gt;&lt;/p&gt;&lt;p style=&quot;margin:0px;margin-left:4px;&quot;&gt;+ Eliminar productos ()&lt;br&gt;&lt;/p&gt;&lt;p style=&quot;margin:0px;margin-left:4px;&quot;&gt;+ Modificar productos ()&lt;br&gt;&lt;/p&gt;&lt;p class=&quot;MsoNormal&quot;&gt;&lt;span lang=&quot;ES-US&quot;&gt;&lt;/span&gt;&lt;/p&gt;" style="verticalAlign=top;align=left;overflow=fill;fontSize=12;fontFamily=Helvetica;html=1;whiteSpace=wrap;" parent="1" vertex="1">
          <mxGeometry x="1310" y="342" width="160" height="160" as="geometry" />
        </mxCell>
        <mxCell id="A-jvLPGMzh5l7a9f45Lc-7" style="edgeStyle=orthogonalEdgeStyle;rounded=0;orthogonalLoop=1;jettySize=auto;html=1;entryX=0.5;entryY=1;entryDx=0;entryDy=0;endArrow=block;endFill=0;" parent="1" source="A-jvLPGMzh5l7a9f45Lc-6" target="HNSODulGz9ibIiqVu8n0-6" edge="1">
          <mxGeometry relative="1" as="geometry">
            <mxPoint x="410" y="535" as="targetPoint" />
            <Array as="points">
              <mxPoint x="490" y="570" />
              <mxPoint x="405" y="570" />
            </Array>
          </mxGeometry>
        </mxCell>
        <mxCell id="A-jvLPGMzh5l7a9f45Lc-6" value="&lt;p style=&quot;margin:0px;margin-top:4px;text-align:center;&quot;&gt;&lt;b&gt;Esporadico&lt;/b&gt;&lt;/p&gt;&lt;hr size=&quot;1&quot;&gt;&lt;p style=&quot;margin:0px;margin-left:4px;&quot;&gt;&lt;br&gt;&lt;/p&gt;&lt;p class=&quot;MsoNormal&quot;&gt;&lt;span lang=&quot;ES-US&quot;&gt;&lt;/span&gt;&lt;/p&gt;" style="verticalAlign=top;align=left;overflow=fill;fontSize=12;fontFamily=Helvetica;html=1;whiteSpace=wrap;" parent="1" vertex="1">
          <mxGeometry x="380" y="637" width="190" height="190" as="geometry" />
        </mxCell>
        <mxCell id="A-jvLPGMzh5l7a9f45Lc-12" value="" style="ellipse;html=1;fillColor=strokeColor;" parent="1" vertex="1">
          <mxGeometry x="1010" y="370" width="4" height="4" as="geometry" />
        </mxCell>
        <mxCell id="A-jvLPGMzh5l7a9f45Lc-13" value="" style="endArrow=open;html=1;rounded=0;align=center;verticalAlign=top;endFill=0;labelBackgroundColor=none;endSize=6;exitX=1;exitY=0.75;exitDx=0;exitDy=0;" parent="1" source="HNSODulGz9ibIiqVu8n0-15" edge="1">
          <mxGeometry relative="1" as="geometry">
            <mxPoint x="850" y="372" as="sourcePoint" />
            <mxPoint x="1140" y="480" as="targetPoint" />
            <Array as="points">
              <mxPoint x="1140" y="380" />
              <mxPoint x="1140" y="440" />
            </Array>
          </mxGeometry>
        </mxCell>
        <mxCell id="A-jvLPGMzh5l7a9f45Lc-30" style="edgeStyle=orthogonalEdgeStyle;rounded=0;orthogonalLoop=1;jettySize=auto;html=1;exitX=1;exitY=0.25;exitDx=0;exitDy=0;endArrow=open;endFill=0;" parent="1" source="HNSODulGz9ibIiqVu8n0-9" target="HNSODulGz9ibIiqVu8n0-28" edge="1">
          <mxGeometry relative="1" as="geometry" />
        </mxCell>
        <mxCell id="A-jvLPGMzh5l7a9f45Lc-14" value="0.1" style="text;html=1;strokeColor=none;fillColor=none;align=center;verticalAlign=middle;whiteSpace=wrap;rounded=0;" parent="1" vertex="1">
          <mxGeometry x="840" y="350" width="60" height="30" as="geometry" />
        </mxCell>
        <mxCell id="A-jvLPGMzh5l7a9f45Lc-15" value="1" style="text;html=1;strokeColor=none;fillColor=none;align=center;verticalAlign=middle;whiteSpace=wrap;rounded=0;" parent="1" vertex="1">
          <mxGeometry x="1130" y="448" width="60" height="30" as="geometry" />
        </mxCell>
        <mxCell id="A-jvLPGMzh5l7a9f45Lc-17" value="1" style="text;html=1;align=center;verticalAlign=middle;resizable=0;points=[];autosize=1;strokeColor=none;fillColor=none;" parent="1" vertex="1">
          <mxGeometry x="755" y="160" width="30" height="30" as="geometry" />
        </mxCell>
        <mxCell id="A-jvLPGMzh5l7a9f45Lc-18" value="1" style="text;html=1;align=center;verticalAlign=middle;resizable=0;points=[];autosize=1;strokeColor=none;fillColor=none;" parent="1" vertex="1">
          <mxGeometry x="1200" y="340" width="30" height="30" as="geometry" />
        </mxCell>
        <mxCell id="A-jvLPGMzh5l7a9f45Lc-19" value="0.1" style="text;html=1;strokeColor=none;fillColor=none;align=center;verticalAlign=middle;whiteSpace=wrap;rounded=0;" parent="1" vertex="1">
          <mxGeometry x="620" y="350" width="60" height="30" as="geometry" />
        </mxCell>
        <mxCell id="A-jvLPGMzh5l7a9f45Lc-20" value="realiza" style="text;html=1;align=center;verticalAlign=middle;resizable=0;points=[];autosize=1;strokeColor=none;fillColor=none;" parent="1" vertex="1">
          <mxGeometry x="550" y="378" width="60" height="30" as="geometry" />
        </mxCell>
        <mxCell id="A-jvLPGMzh5l7a9f45Lc-21" value="tiene" style="text;html=1;align=center;verticalAlign=middle;resizable=0;points=[];autosize=1;strokeColor=none;fillColor=none;" parent="1" vertex="1">
          <mxGeometry x="1075" y="378" width="50" height="30" as="geometry" />
        </mxCell>
        <mxCell id="A-jvLPGMzh5l7a9f45Lc-25" style="edgeStyle=orthogonalEdgeStyle;rounded=0;orthogonalLoop=1;jettySize=auto;html=1;entryX=0.09;entryY=1.005;entryDx=0;entryDy=0;entryPerimeter=0;endArrow=block;endFill=0;" parent="1" source="A-jvLPGMzh5l7a9f45Lc-24" target="HNSODulGz9ibIiqVu8n0-20" edge="1">
          <mxGeometry relative="1" as="geometry">
            <Array as="points">
              <mxPoint x="907" y="640" />
              <mxPoint x="1053" y="640" />
            </Array>
          </mxGeometry>
        </mxCell>
        <mxCell id="A-jvLPGMzh5l7a9f45Lc-24" value="&lt;p style=&quot;margin:0px;margin-top:4px;text-align:center;&quot;&gt;&lt;b&gt;Simple&lt;/b&gt;&lt;/p&gt;&lt;hr size=&quot;1&quot;&gt;&lt;p style=&quot;margin:0px;margin-left:4px;&quot;&gt;+ Id transferencia: String&lt;/p&gt;&lt;p style=&quot;margin:0px;margin-left:4px;&quot;&gt;+ Nombre del titular: String&lt;/p&gt;&lt;p style=&quot;margin:0px;margin-left:4px;&quot;&gt;+ Monto a pagar: String&lt;/p&gt;&lt;p class=&quot;MsoNormal&quot;&gt;&lt;span lang=&quot;ES-US&quot;&gt;&lt;/span&gt;&lt;/p&gt;" style="verticalAlign=top;align=left;overflow=fill;fontSize=12;fontFamily=Helvetica;html=1;whiteSpace=wrap;" parent="1" vertex="1">
          <mxGeometry x="827" y="692" width="160" height="80" as="geometry" />
        </mxCell>
      </root>
    </mxGraphModel>
  </diagram>
</mxfile>
