{
  "data": {
    "entity_name": "AAAS",
    "entity_type": "gene",
    "gene_data": {
      "gene_name": "aladin WD repeat nucleoporin",
      "omim_gene": ["605378"]
    }
  },
  "panels": [
    {
      "id": 285,
      "name": "Intellectual disability",
      "version": "3.2",
      "relevant_disorders": [
        "Intellectual disability - microarray",
        "fragile X and sequencing",
        "R29"
      ],
      "entity": {
        "confidence_level": "3",
        "mode_of_inheritance": "BIALLELIC, autosomal or pseudoautosomal",
        "phenotypes": ["Achalasia-addisonianism-alacrimia syndrome  231550"]
      }
    },
    {
      "id": 847,
      "name": "Childhood onset dystonia or chorea or related movement disorder",
      "version": "1.58",
      "relevant_disorders": [],
      "entity": {
        "confidence_level": "2",
        "mode_of_inheritance": "BIALLELIC, autosomal or pseudoautosomal",
        "phenotypes": ["Achalasia-addisonianism-alacrimia syndrome, 231550"]
      }
    },
    {
      "id": 474,
      "name": "Neurodegenerative disorders - adult onset",
      "version": "2.31",
      "relevant_disorders": ["R58", "R59"],
      "entity": {
        "confidence_level": "1",
        "mode_of_inheritance": "BIALLELIC, autosomal or pseudoautosomal",
        "phenotypes": ["Achalasia-addisonianism-alacrimia syndrome, 231550"]
      }
    }
  ]
}
