{
  "panel": {
    "id": 486,
    "name": "Paediatric disorders",
    "version": "14.43",
    "relevant_disorders": [
      "Acutely unwell children with a likely monogenic disorder",
      "Congenital malformation and dysmorphism syndromes - microarray and sequencing",
      "Congenital malformation and dysmorphism syndromes",
      "R14",
      "R27"
    ],
    "signed_off": "2020-03-04",
    "types": [
      { "name": "GMS Rare Disease Virtual" },
      { "name": "Super Panel" },
      { "name": "GMS signed-off" }
    ]
  },
  "entities": [
    {
      "entity_name": "AAAS",
      "entity_type": "gene",
      "tags": [],
      "mode_of_pathogenicity": "",
      "gene_data": {
        "gene_name": "aladin WD repeat nucleoporin",
        "omim_gene": ["605378"]
      },
      "panel": { "id": 484, "name": "DDG2P", "version": "2.3" },
      "confidence_level": "3",
      "mode_of_inheritance": "BIALLELIC, autosomal or pseudoautosomal",
      "phenotypes": ["ACHALASIA-ADDISONIANISM-ALACRIMA SYNDROME 231550"]
    },
    {
      "entity_name": "AAAS",
      "entity_type": "gene",
      "tags": [],
      "mode_of_pathogenicity": "",
      "gene_data": {
        "gene_name": "aladin WD repeat nucleoporin",
        "omim_gene": ["605378"]
      },
      "panel": {
        "id": 285,
        "name": "Intellectual disability",
        "version": "3.3"
      },
      "confidence_level": "3",
      "mode_of_inheritance": "BIALLELIC, autosomal or pseudoautosomal",
      "phenotypes": ["Achalasia-addisonianism-alacrimia syndrome  231550"]
    }
  ]
}
