// Jest Snapshot v1, https://goo.gl/fbAQLP

exports[`<Header /> 1`] = `
<div
  className="fixed top-0	w-full flex items-center h-16 px-40 bg-nhs-blue text-white"
>
  <div
    className="mr-6"
  >
    <a
      href="/"
    >
      <svg
        fill="none"
        focusable="false"
        height="82"
        viewBox="0 0 160 82"
        width="107"
        xmlns="http://www.w3.org/2000/svg"
      >
        <title>
          Genomics England
        </title>
        <path
          clipRule="evenodd"
          d="m103.59 77.998h-5.9956c-1.1045 0-1.9986 0.8942-1.9986 2.0001 0 1.1048 0.8941 2.0001 1.9986 2.0001h5.9956c1.105 0 1.998-0.8953 1.998-2.0001 0-1.1059-0.893-2.0001-1.998-2.0001z"
          fill="#fff"
          fillRule="evenodd"
        />
        <path
          clipRule="evenodd"
          d="m151.55 72h-5.996c-1.104 0-1.998 0.892-1.998 1.999 0 1.1059 0.894 2.0001 1.998 2.0001h5.996c1.103 0 1.998-0.8942 1.998-2.0001 0-1.107-0.895-1.999-1.998-1.999z"
          fill="#fff"
          fillRule="evenodd"
        />
        <path
          clipRule="evenodd"
          d="m151.55 65.998h-5.996c-1.104 0-1.998 0.8926-1.998 1.9996 0 1.1053 0.894 1.9996 1.998 1.9996h5.996c1.103 0 1.998-0.8943 1.998-1.9996 0-1.107-0.895-1.9996-1.998-1.9996z"
          fill="#fff"
          fillRule="evenodd"
        />
        <path
          clipRule="evenodd"
          d="m151.55 60.002h-5.996c-1.104 0-1.998 0.8926-1.998 1.9985s0.894 2.0007 1.998 2.0007h5.996c1.103 0 1.998-0.8948 1.998-2.0007s-0.895-1.9985-1.998-1.9985z"
          fill="#fff"
          fillRule="evenodd"
        />
        <path
          clipRule="evenodd"
          d="m151.55 54h-5.996c-1.104 0-1.998 0.8925-1.998 1.9995 0 1.1048 0.894 1.9996 1.998 1.9996h5.996c1.103 0 1.998-0.8948 1.998-1.9996 0-1.107-0.895-1.9995-1.998-1.9995z"
          fill="#fff"
          fillRule="evenodd"
        />
        <path
          clipRule="evenodd"
          d="m151.55 48.004h-5.996c-1.104 0-1.998 0.8926-1.998 1.9996 0 1.1048 0.894 1.999 1.998 1.999h5.996c1.103 0 1.998-0.8942 1.998-1.999 0-1.107-0.895-1.9996-1.998-1.9996z"
          fill="#fff"
          fillRule="evenodd"
        />
        <path
          clipRule="evenodd"
          d="m139.56 72h-5.996c-1.104 0-1.998 0.892-1.998 1.999 0 1.1059 0.894 2.0001 1.998 2.0001h5.996c1.104 0 1.998-0.8942 1.998-2.0001 0-1.107-0.894-1.999-1.998-1.999z"
          fill="#fff"
          fillRule="evenodd"
        />
        <path
          clipRule="evenodd"
          d="m139.56 65.998h-5.996c-1.104 0-1.998 0.8926-1.998 1.9996 0 1.1053 0.894 1.9996 1.998 1.9996h5.996c1.104 0 1.998-0.8943 1.998-1.9996 0-1.107-0.894-1.9996-1.998-1.9996z"
          fill="#fff"
          fillRule="evenodd"
        />
        <path
          clipRule="evenodd"
          d="m139.56 60.002h-5.996c-1.104 0-1.998 0.8926-1.998 1.9985s0.894 2.0007 1.998 2.0007h5.996c1.104 0 1.998-0.8948 1.998-2.0007s-0.894-1.9985-1.998-1.9985z"
          fill="#fff"
          fillRule="evenodd"
        />
        <path
          clipRule="evenodd"
          d="m139.56 54h-5.996c-1.104 0-1.998 0.8925-1.998 1.9995 0 1.1048 0.894 1.9996 1.998 1.9996h5.996c1.104 0 1.998-0.8948 1.998-1.9996 0-1.107-0.894-1.9995-1.998-1.9995z"
          fill="#fff"
          fillRule="evenodd"
        />
        <path
          clipRule="evenodd"
          d="m139.56 48.004h-5.996c-1.104 0-1.998 0.8926-1.998 1.9996 0 1.1048 0.894 1.999 1.998 1.999h5.996c1.104 0 1.998-0.8942 1.998-1.999 0-1.107-0.894-1.9996-1.998-1.9996z"
          fill="#fff"
          fillRule="evenodd"
        />
        <path
          clipRule="evenodd"
          d="m139.56 42.002h-5.996c-1.104 0-1.998 0.8926-1.998 1.999 0 1.1048 0.894 1.9996 1.998 1.9996h5.996c1.104 0 1.998-0.8948 1.998-1.9996 0-1.1064-0.894-1.999-1.998-1.999z"
          fill="#fff"
          fillRule="evenodd"
        />
        <path
          clipRule="evenodd"
          d="m139.56 36.006h-5.996c-1.104 0-1.998 0.8925-1.998 1.9995 0 1.1048 0.894 2.0002 1.998 2.0002h5.996c1.104 0 1.998-0.8954 1.998-2.0002 0-1.107-0.894-1.9995-1.998-1.9995z"
          fill="#fff"
          fillRule="evenodd"
        />
        <path
          clipRule="evenodd"
          d="m139.56 30.004h-5.996c-1.104 0-1.998 0.8926-1.998 1.9996 0 1.1047 0.894 1.9995 1.998 1.9995h5.996c1.104 0 1.998-0.8948 1.998-1.9995 0-1.107-0.894-1.9996-1.998-1.9996z"
          fill="#fff"
          fillRule="evenodd"
        />
        <path
          clipRule="evenodd"
          d="m139.56 24.007h-5.996c-1.104 0-1.998 0.8936-1.998 2.0001 0 1.1059 0.894 2.0007 1.998 2.0007h5.996c1.104 0 1.998-0.8948 1.998-2.0007 0-1.1065-0.894-2.0001-1.998-2.0001z"
          fill="#fff"
          fillRule="evenodd"
        />
        <path
          clipRule="evenodd"
          d="m139.56 18.006h-5.996c-1.104 0-1.998 0.8925-1.998 1.999 0 1.1059 0.894 1.9996 1.998 1.9996h5.996c1.104 0 1.998-0.8937 1.998-1.9996 0-1.1065-0.894-1.999-1.998-1.999z"
          fill="#fff"
          fillRule="evenodd"
        />
        <path
          clipRule="evenodd"
          d="m103.59 72h-5.9956c-1.1045 0-1.9986 0.892-1.9986 1.999 0 1.1059 0.8941 2.0001 1.9986 2.0001h5.9956c1.105 0 1.998-0.8942 1.998-2.0001 0-1.107-0.893-1.999-1.998-1.999z"
          fill="#fff"
          fillRule="evenodd"
        />
        <path
          clipRule="evenodd"
          d="m115.58 72h-5.997c-1.105 0-1.999 0.892-1.999 1.999 0 1.1059 0.894 2.0001 1.999 2.0001h5.997c1.103 0 1.997-0.8942 1.997-2.0001 0-1.107-0.894-1.999-1.997-1.999z"
          fill="#fff"
          fillRule="evenodd"
        />
        <path
          clipRule="evenodd"
          d="m115.58 65.998h-5.997c-1.105 0-1.999 0.8926-1.999 1.9996 0 1.1053 0.894 1.9996 1.999 1.9996h5.997c1.103 0 1.997-0.8943 1.997-1.9996 0-1.107-0.894-1.9996-1.997-1.9996z"
          fill="#fff"
          fillRule="evenodd"
        />
        <path
          clipRule="evenodd"
          d="m127.57 72h-5.996c-1.105 0-1.999 0.892-1.999 1.999 0 1.1059 0.894 2.0001 1.999 2.0001h5.996c1.104 0 1.997-0.8942 1.997-2.0001 0-1.107-0.893-1.999-1.997-1.999z"
          fill="#fff"
          fillRule="evenodd"
        />
        <path
          clipRule="evenodd"
          d="m127.57 65.998h-5.996c-1.105 0-1.999 0.8926-1.999 1.9996 0 1.1053 0.894 1.9996 1.999 1.9996h5.996c1.104 0 1.997-0.8943 1.997-1.9996 0-1.107-0.893-1.9996-1.997-1.9996z"
          fill="#fff"
          fillRule="evenodd"
        />
        <path
          clipRule="evenodd"
          d="m127.57 60.002h-5.996c-1.105 0-1.999 0.8926-1.999 1.9985s0.894 2.0007 1.999 2.0007h5.996c1.104 0 1.997-0.8948 1.997-2.0007s-0.893-1.9985-1.997-1.9985z"
          fill="#fff"
          fillRule="evenodd"
        />
        <path
          clipRule="evenodd"
          d="m127.57 54h-5.996c-1.105 0-1.999 0.8925-1.999 1.9995 0 1.1048 0.894 1.9996 1.999 1.9996h5.996c1.104 0 1.997-0.8948 1.997-1.9996 0-1.107-0.893-1.9995-1.997-1.9995z"
          fill="#fff"
          fillRule="evenodd"
        />
        <path
          clipRule="evenodd"
          d="m127.57 48.004h-5.996c-1.105 0-1.999 0.8926-1.999 1.9996 0 1.1048 0.894 1.999 1.999 1.999h5.996c1.104 0 1.997-0.8942 1.997-1.999 0-1.107-0.893-1.9996-1.997-1.9996z"
          fill="#fff"
          fillRule="evenodd"
        />
        <path
          clipRule="evenodd"
          d="m127.57 42.002h-5.996c-1.105 0-1.999 0.8926-1.999 1.999 0 1.1048 0.894 1.9996 1.999 1.9996h5.996c1.104 0 1.997-0.8948 1.997-1.9996 0-1.1064-0.893-1.999-1.997-1.999z"
          fill="#fff"
          fillRule="evenodd"
        />
        <path
          clipRule="evenodd"
          d="m127.57 36.006h-5.996c-1.105 0-1.999 0.8925-1.999 1.9995 0 1.1048 0.894 2.0002 1.999 2.0002h5.996c1.104 0 1.997-0.8954 1.997-2.0002 0-1.107-0.893-1.9995-1.997-1.9995z"
          fill="#fff"
          fillRule="evenodd"
        />
        <path
          clipRule="evenodd"
          d="m127.57 30.004h-5.996c-1.105 0-1.999 0.8926-1.999 1.9996 0 1.1047 0.894 1.9995 1.999 1.9995h5.996c1.104 0 1.997-0.8948 1.997-1.9995 0-1.107-0.893-1.9996-1.997-1.9996z"
          fill="#fff"
          fillRule="evenodd"
        />
        <path
          clipRule="evenodd"
          d="m127.57 24.007h-5.996c-1.105 0-1.999 0.8936-1.999 2.0001 0 1.1059 0.894 2.0007 1.999 2.0007h5.996c1.104 0 1.997-0.8948 1.997-2.0007 0-1.1065-0.893-2.0001-1.997-2.0001z"
          fill="#fff"
          fillRule="evenodd"
        />
        <path
          clipRule="evenodd"
          d="m127.57 18.006h-5.996c-1.105 0-1.999 0.8925-1.999 1.999 0 1.1059 0.894 1.9996 1.999 1.9996h5.996c1.104 0 1.997-0.8937 1.997-1.9996 0-1.1065-0.893-1.999-1.997-1.999z"
          fill="#fff"
          fillRule="evenodd"
        />
        <path
          clipRule="evenodd"
          d="m127.57 12.01h-5.996c-1.105 0-1.999 0.8937-1.999 1.9996 0 1.1047 0.894 2.0001 1.999 2.0001h5.996c1.104 0 1.997-0.8954 1.997-2.0001 0-1.1059-0.893-1.9996-1.997-1.9996z"
          fill="#fff"
          fillRule="evenodd"
        />
        <path
          clipRule="evenodd"
          d="m129.57 79.998c0 1.1048-0.894 2.0001-1.998 2.0001s-1.999-0.8953-1.999-2.0001c0-1.1059 0.895-2.0001 1.999-2.0001s1.998 0.8942 1.998 2.0001z"
          fill="#fff"
          fillRule="evenodd"
        />
        <path
          clipRule="evenodd"
          d="m93.594 80c0 1.1031-0.8936 2.0001-1.9992 2.0001-1.104 0-1.9986-0.897-1.9986-2.0001 0-1.1065 0.8946-2.0018 1.9986-2.0018 1.1056 0 1.9992 0.8953 1.9992 2.0018z"
          fill="#fff"
          fillRule="evenodd"
        />
        <path
          clipRule="evenodd"
          d="m105.59 67.997c0 1.107-0.894 2.0012-1.998 2.0012-1.107 0-2-0.8942-2-2.0012 0-1.1037 0.893-1.9996 2-1.9996 1.104 0 1.998 0.8959 1.998 1.9996z"
          fill="#fff"
          fillRule="evenodd"
        />
        <path
          clipRule="evenodd"
          d="m117.58 55.999c0 1.1048-0.894 1.9996-1.998 1.9996-1.106 0-1.999-0.8948-1.999-1.9996 0-1.107 0.893-1.9995 1.999-1.9995 1.104 0 1.998 0.8925 1.998 1.9995z"
          fill="#fff"
          fillRule="evenodd"
        />
        <path
          clipRule="evenodd"
          d="m159.54 55.999c0 1.1048-0.895 1.9996-1.999 1.9996-1.105 0-1.998-0.8948-1.998-1.9996 0-1.107 0.893-1.9995 1.998-1.9995 1.104 0 1.999 0.8925 1.999 1.9995z"
          fill="#fff"
          fillRule="evenodd"
        />
        <path
          clipRule="evenodd"
          d="m159.54 67.997c0 1.1053-0.895 1.9996-1.999 1.9996-1.105 0-1.998-0.8943-1.998-1.9996 0-1.107 0.893-1.9996 1.998-1.9996 1.104 0 1.999 0.8926 1.999 1.9996z"
          fill="#fff"
          fillRule="evenodd"
        />
        <path
          clipRule="evenodd"
          d="m159.54 49.999c0 1.1054-0.895 2.0002-1.999 2.0002-1.105 0-1.998-0.8948-1.998-2.0002 0-1.1047 0.893-2.0006 1.998-2.0006 1.104 0 1.999 0.8959 1.999 2.0006z"
          fill="#fff"
          fillRule="evenodd"
        />
        <path
          clipRule="evenodd"
          d="m117.58 49.999c0 1.1054-0.894 2.0002-1.998 2.0002-1.106 0-1.999-0.8948-1.999-2.0002 0-1.1047 0.893-2.0006 1.999-2.0006 1.104 0 1.998 0.8959 1.998 2.0006z"
          fill="#fff"
          fillRule="evenodd"
        />
        <path
          clipRule="evenodd"
          d="m147.55 43.998c0 1.1059-0.894 2.0001-1.999 2.0001s-1.998-0.8942-1.998-2.0001c0-1.1048 0.893-1.999 1.998-1.999s1.999 0.8942 1.999 1.999z"
          fill="#fff"
          fillRule="evenodd"
        />
        <path
          clipRule="evenodd"
          d="m117.58 43.998c0 1.1059-0.894 2.0001-1.998 2.0001-1.106 0-1.999-0.8942-1.999-2.0001 0-1.1048 0.893-1.999 1.999-1.999 1.104 0 1.998 0.8942 1.998 1.999z"
          fill="#fff"
          fillRule="evenodd"
        />
        <path
          clipRule="evenodd"
          d="m147.55 37.999c0 1.1048-0.894 1.9996-1.999 1.9996s-1.998-0.8948-1.998-1.9996c0-1.1059 0.893-1.999 1.998-1.999s1.999 0.8931 1.999 1.999z"
          fill="#fff"
          fillRule="evenodd"
        />
        <path
          clipRule="evenodd"
          d="m117.58 19.999c0 1.1059-0.894 2.0002-1.998 2.0002-1.106 0-1.999-0.8943-1.999-2.0002s0.893-1.9995 1.999-1.9995c1.104 0 1.998 0.8936 1.998 1.9995z"
          fill="#fff"
          fillRule="evenodd"
        />
        <path
          clipRule="evenodd"
          d="m135.56 14c0 1.1037-0.894 1.9996-1.998 1.9996-1.106 0-2-0.8959-2-1.9996 0-1.1064 0.894-2.0012 2-2.0012 1.104 0 1.998 0.8948 1.998 2.0012z"
          fill="#fff"
          fillRule="evenodd"
        />
        <path
          clipRule="evenodd"
          d="m117.58 14c0 1.1037-0.894 1.9996-1.998 1.9996-1.106 0-1.999-0.8959-1.999-1.9996 0-1.1064 0.893-2.0012 1.999-2.0012 1.104 0 1.998 0.8948 1.998 2.0012z"
          fill="#fff"
          fillRule="evenodd"
        />
        <path
          clipRule="evenodd"
          d="m135.56 7.9983c0 1.107-0.894 2.0007-1.998 2.0007-1.106 0-2-0.89369-2-2.0007 0-1.1037 0.894-2.0001 2-2.0001 1.104 0 1.998 0.89646 1.998 2.0001z"
          fill="#fff"
          fillRule="evenodd"
        />
        <path
          clipRule="evenodd"
          d="m129.57 7.9983c0 1.107-0.894 2.0007-1.998 2.0007s-1.999-0.89369-1.999-2.0007c0-1.1037 0.895-2.0001 1.999-2.0001s1.998 0.89646 1.998 2.0001z"
          fill="#fff"
          fillRule="evenodd"
        />
        <path
          clipRule="evenodd"
          d="m129.57 1.9996c0 1.1059-0.894 1.9996-1.998 1.9996s-1.999-0.89369-1.999-1.9996c0-1.1048 0.895-1.9996 1.999-1.9996s1.998 0.8948 1.998 1.9996z"
          fill="#fff"
          fillRule="evenodd"
        />
        <path
          clipRule="evenodd"
          d="m14.475 39.612c-1.1465 0.3907-3.3146 0.9275-5.4837 0.9275-2.9974 0-5.1654-0.7563-6.6768-2.1957-1.486-1.4389-2.3142-3.5842-2.3142-5.9993 0.023806-5.4613 3.9972-8.5828 9.3813-8.5828 2.1193 0 3.7536 0.415 4.557 0.7806l-0.7795 2.9997c-0.9008-0.4167-1.9987-0.707-3.8013-0.707-3.0954 0-5.4583 1.7309-5.4583 5.3145 0 3.4146 2.1442 5.3898 5.1892 5.3898 0.82935 0 1.5109-0.0975 1.8032-0.2194v-3.4628h-2.5334v-2.9016h6.1165v8.6565z"
          fill="#fff"
          fillRule="evenodd"
        />
        <path
          clipRule="evenodd"
          d="m24.614 33.05c0-0.9014-0.3897-2.4123-2.096-2.4123-1.5596 0-2.1913 1.4389-2.2899 2.4123h4.3859zm-4.361 2.5365c0.0974 1.5375 1.6327 2.2683 3.3617 2.2683 1.2667 0 2.2903-0.1701 3.2907-0.512l0.4867 2.5121c-1.2191 0.512-2.7045 0.7558-4.3134 0.7558-4.0448 0-6.3595-2.3415-6.3595-6.0714 0-3.0234 1.8762-6.3638 6.0185-6.3638 3.8505 0 5.3116 2.9996 5.3116 5.9488 0 0.6344-0.0742 1.1951-0.1213 1.4622h-7.675z"
          fill="#fff"
          fillRule="evenodd"
        />
        <path
          clipRule="evenodd"
          d="m30.269 32.246c0-1.4865-0.0487-2.7298-0.0974-3.8036h3.216l0.1717 1.6583h0.0736c0.4866-0.7796 1.6803-1.9253 3.6789-1.9253 2.4349 0 4.2635 1.6328 4.2635 5.1449v7.0465h-3.7038v-6.6077c0-1.5369-0.5354-2.5841-1.8757-2.5841-1.0231 0-1.6332 0.7064-1.9001 1.389-0.0985 0.2438-0.1223 0.5846-0.1223 0.9259v6.8769h-3.7044v-8.1208z"
          fill="#fff"
          fillRule="evenodd"
        />
        <path
          clipRule="evenodd"
          d="m47.694 34.392c0 2.0494 0.8521 3.5858 2.436 3.5858 1.4627 0 2.3641-1.4389 2.3641-3.6097 0-1.7563-0.681-3.5609-2.3641-3.5609-1.7533 0-2.436 1.8306-2.436 3.5848zm8.6251-0.1219c0 4.3648-3.0948 6.3644-6.2853 6.3644-3.4857 0-6.1664-2.2916-6.1664-6.1439 0-3.879 2.5351-6.3412 6.3861-6.3412 3.6291 0 6.0656 2.5121 6.0656 6.1207z"
          fill="#fff"
          fillRule="evenodd"
        />
        <path
          clipRule="evenodd"
          d="m58.612 32.246c0-1.4865-0.0476-2.7298-0.0975-3.8036h3.1441l0.1456 1.6084h0.0737c0.5104-0.7795 1.5839-1.9015 3.6058-1.9015 1.5596 0 2.7532 0.8062 3.2659 2.0495h0.0476c0.4634-0.6344 0.976-1.1225 1.5601-1.4633 0.6583-0.3673 1.3885-0.5862 2.2666-0.5862 2.2898 0 4.0188 1.6107 4.0188 5.1948v7.0227h-3.6052v-6.4863c0-1.732-0.5603-2.7315-1.7545-2.7315-0.8781 0-1.4622 0.5862-1.729 1.2931-0.0736 0.2676-0.124 0.6344-0.124 0.9502v6.9745h-3.6058v-6.7057c0-1.4888-0.5348-2.5121-1.729-2.5121-0.9501 0-1.5103 0.7324-1.7301 1.317-0.1218 0.2936-0.1456 0.6344-0.1456 0.9513v6.9495h-3.6075v-8.1208z"
          fill="#fff"
          fillRule="evenodd"
        />
        <path
          clipRule="evenodd"
          d="m79.573 40.367h3.7038v-11.924h-3.7038v11.924zm3.8272-15.241c0 1.0239-0.7568 1.8533-1.9992 1.8533-1.1704 0-1.9261-0.8294-1.9261-1.8533 0-1.0478 0.7801-1.8522 1.9743-1.8522s1.925 0.8044 1.951 1.8522z"
          fill="#fff"
          fillRule="evenodd"
        />
        <path
          clipRule="evenodd"
          d="m95.193 40.05c-0.6571 0.3169-1.8995 0.5607-3.3135 0.5607-3.8505 0-6.3108-2.3653-6.3108-6.0952 0-3.4878 2.3883-6.34 6.8213-6.34 0.9755 0 2.0484 0.1695 2.8279 0.4626l-0.5846 2.7564c-0.4374-0.1956-1.0967-0.3668-2.0723-0.3668-1.9471 0-3.2155 1.3896-3.1916 3.3404 0 2.1708 1.4615 3.3404 3.2653 3.3404 0.878 0 1.5612-0.1457 2.121-0.3895l0.4373 2.731z"
          fill="#fff"
          fillRule="evenodd"
        />
        <path
          clipRule="evenodd"
          d="m97.217 37.148c0.6821 0.415 2.0955 0.8782 3.1926 0.8782 1.121 0 1.583-0.3657 1.583-0.9757 0-0.6333-0.365-0.9258-1.73-1.3901-2.4853-0.8289-3.4348-2.1702-3.411-3.5836 0-2.2429 1.9006-3.9272 4.848-3.9272 1.39 0 2.608 0.3408 3.339 0.7076l-0.634 2.5613c-0.535-0.2931-1.584-0.6831-2.583-0.6831-0.902 0-1.412 0.3662-1.412 0.9502 0 0.5845 0.463 0.8787 1.924 1.3912 2.267 0.7796 3.192 1.9497 3.217 3.6823 0 2.2433-1.731 3.8756-5.141 3.8756-1.5594 0-2.9495-0.3651-3.8514-0.8522l0.6588-2.6345z"
          fill="#fff"
          fillRule="evenodd"
        />
        <path
          clipRule="evenodd"
          d="m51.685 52.534v1.4509c-0.5552 0.2007-1.1876 0.5094-2.4832 0.5094-2.7917 0-4.0718-1.6979-4.0718-4.2602 0-2.3307 1.4652-3.9823 3.6862-3.9823 2.6221 0 3.4704 1.914 3.4704 4.4454h-5.6143c0 1.5589 1.2185 2.624 2.5912 2.624 0.9563 0 2.0668-0.4939 2.4215-0.7872zm-5.0128-2.9173h4.0719c0-1.204-0.7095-2.1918-1.9588-2.1918-1.419 0-2.0051 1.1731-2.1131 2.1918zm7.6021 4.6924v-7.8721h1.4036v1.2503h0.0308c0.4319-0.8953 1.4807-1.4355 2.5758-1.4355 2.0359 0 2.9459 1.2657 2.9459 3.3803v4.677h-1.4498v-4.075c0-1.8368-0.401-2.7321-1.6658-2.8092-1.6503 0-2.3906 1.3274-2.3906 3.2414v3.6428h-1.4499zm16.424-7.8721v7.5325c0 2.3925-1.2339 3.7662-4.0564 3.7662-0.8329 0-1.5578-0.108-2.8226-0.5402l0.1543-1.3429c1.1105 0.5094 1.7737 0.71 2.8379 0.71 1.527 0 2.437-1.0341 2.437-2.7012v-0.7717h-0.0309c-0.6169 0.818-1.6349 1.2194-2.6374 1.2194-2.2519 0-3.3624-1.8369-3.3624-3.8743 0-2.0221 1.1413-4.183 3.5166-4.183 1.3881 0 2.1593 0.5093 2.5912 1.3583h0.0308v-1.1731h1.3419zm-3.7476 6.699c1.3572 0 2.2981-1.204 2.2981-2.6703 0-1.6362-0.7558-3.0408-2.2981-3.0408-1.4653 0-2.1902 1.5898-2.1902 2.9327 0 1.4818 0.8329 2.7784 2.1902 2.7784zm6.445 1.1731v-11.577h1.4498v11.577h-1.4498zm4.5944-6.0816-0.0771-1.2348c0.7249-0.4322 1.5886-0.7409 2.5912-0.7409 2.2518 0 3.1618 1.1113 3.1618 3.2568v3.2569c0 0.8953 0.0309 1.312 0.0617 1.5436h-1.3573v-1.0188h-0.0308c-0.3393 0.4785-1.1105 1.204-2.437 1.204-1.6966 0-2.8842-0.7409-2.8842-2.4542 0-1.9758 2.1593-2.5932 3.6554-2.5932 0.5707 0 0.9717 0 1.5424 0.0309 0-1.3583-0.4936-2.0529-1.9434-2.0529-0.8175 0-1.6966 0.3087-2.2827 0.8026zm4.226 3.0254v-0.6946c-0.3085 0-0.617-0.0309-0.9254-0.0309-0.7866 0-2.73 0.1235-2.73 1.5127 0 0.8335 0.802 1.2811 1.4652 1.2811 1.4344 0 2.1902-0.8953 2.1902-2.0683zm3.9462 3.0562v-7.8721h1.4036v1.2503h0.0308c0.4319-0.8953 1.4807-1.4355 2.5758-1.4355 2.0359 0 2.9459 1.2657 2.9459 3.3803v4.677h-1.4498v-4.075c0-1.8368-0.401-2.7321-1.6658-2.8092-1.6503 0-2.3907 1.3274-2.3907 3.2414v3.6428h-1.4498zm15.036 0v-1.1114h-0.03c-0.386 0.5866-1.2806 1.2966-2.6841 1.2966-2.3752 0-3.3778-2.1147-3.3778-4.2602 0-2.1146 1.1105-3.9823 3.3932-3.9823 1.3727 0 2.1597 0.5402 2.6067 1.2657h0.031v-4.785h1.45v11.577h-1.389zm-4.5496-3.9669c-0.0309 1.2348 0.6169 2.979 2.1747 2.979 1.6349 0 2.3139-1.6207 2.3139-2.9327 0-1.4664-0.756-2.9636-2.3293-2.9636-1.5732 0-2.1902 1.4818-2.1593 2.9173z"
          fill="#fff"
          fillRule="evenodd"
        />
      </svg>
    </a>
  </div>
  <div
    className="mr-8 text-lg"
  >
    <a
      href="/"
    >
      GMS Panels
    </a>
  </div>
  <div
    className="mr-8"
  >
    <a
      href="/panels"
    >
      Panels
    </a>
  </div>
  <div
    className="mr-8"
  >
    <a
      href="/entities"
    >
      Genes and Entities
    </a>
  </div>
</div>
`;
