// Jest Snapshot v1, https://goo.gl/fbAQLP

exports[`<SuperPanelInfo /> 1`] = `
<div
  className="mb-2 font-normal"
>
  <div
    className="text-xl font-semibold mb-1"
  >
    This panel contains these 
    2
     panels:
     
  </div>
  <ul>
    <li>
      Intellectual disability
    </li>
    <li>
      Inborn errors of metabolism
    </li>
  </ul>
</div>
`;
