// Jest Snapshot v1, https://goo.gl/fbAQLP

exports[`<RelevantDisorder /> with R-number 1`] = `
<span
  className="font-semibold"
>
  R42
</span>
`;

exports[`<RelevantDisorder /> without R-number 1`] = `
<span
  className=""
>
  Cardiac arrythmias
</span>
`;
