// Jest Snapshot v1, https://goo.gl/fbAQLP

exports[`<EntitiesSearchBox /> 1`] = `
[
  <div
    className="font-bold"
  >
    Gene or Genomic Entity Name
  </div>,
  <div
    className="text-nhs-dark-grey mb-2"
  >
    <label
      htmlFor="search-bar"
    >
      Enter a gene symbol, STR name, Region name, or the beginning of one, eg "CD" or "CD19"
    </label>
  </div>,
  <div
    className="flex h-10 bg-nhs-pale-grey"
  >
    <input
      autoComplete="off"
      className="flex-grow border py-2 px-3"
      id="search-bar"
      name="search-bar"
      placeholder="Filter genes or genomic entities"
      type="text"
    />
    <span
      className="p-2"
    >
      6
       genes and genomic entities
    </span>
  </div>,
  <div>
    Show
     
    <label
      className="mr-1"
      htmlFor="genes"
    >
      Genes
    </label>
    <input
      className="mr-2"
      defaultChecked={true}
      id="genes"
      name="genes"
      type="checkbox"
    />
    <label
      className="mr-1"
      htmlFor="strs"
    >
      STRs
    </label>
    <input
      className="mr-2"
      defaultChecked={true}
      id="strs"
      name="strs"
      type="checkbox"
    />
    <label
      className="mr-1"
      htmlFor="regions"
    >
      Regions
    </label>
    <input
      defaultChecked={true}
      id="regions"
      name="regions"
      type="checkbox"
    />
  </div>,
]
`;
