[
  {
    "name": "groupId",
    "required": true,
    "type": "TEXT",
    "description": "",
    "multiValue": false
  },
  {
    "name": "piepelineId",
    "required": true,
    "type": "TEXT",
    "description": "",
    "multiValue": false
  },
  {
    "name": "pipelineMainFolder",
    "required": true,
    "type": "TEXT",
    "description": "",
    "multiValue": false
  },
  {
    "name": "cohortName",
    "required": true,
    "type": "TEXT",
    "description": "",
    "multiValue": false
  },
  {
    "name": "startDate",
    "required": true,
    "type": "TEXT",
    "description": "",
    "multiValue": false
  },
  {
    "name": "lastStepDate",
    "required": false,
    "type": "TEXT",
    "description": "",
    "multiValue": false
  },
  {
    "name": "pipelineParameters",
    "required": true,
    "type": "OBJECT",
    "description": "",
    "multiValue": false
  },
  {
    "name": "tieringConfigurationFile",
    "required": true,
    "type": "TEXT",
    "description": "",
    "multiValue": false
  },
  {
    "name": "softwareVersions",
    "required": false,
    "type": "OBJECT",
    "description": "",
    "multiValue": false
  },
  {
    "name": "dataBaseVersions",
    "required": false,
    "type": "OBJECT",
    "description": "",
    "multiValue": false
  },
  {
    "name": "listOfSamples",
    "required": false,
    "type": "TEXT",
    "description": "",
    "multiValue": true
  },
  {
    "name": "readyToDispatch",
    "required": true,
    "type": "BOOLEAN",
    "description": "",
    "multiValue": false
  },
  {
    "name": "steps",
    "required": false,
    "type": "OBJECT",
    "description": "",
    "variableSet": [
      {
        "name": "stepName",
        "required": true,
        "type": "TEXT",
        "description": "",
        "multiValue": false
      },
      {
        "name": "date",
        "required": true,
        "type": "TEXT",
        "description": "",
        "multiValue": false
      },
      {
        "name": "status",
        "required": true,
        "type": "CATEGORICAL",
        "description": "",
        "allowedValues": [
          "failed",
          "ready"
        ],
        "multiValue": false
      }
    ],
    "multiValue": true
  },
  {
    "name": "listOfFilesToDispatch",
    "required": false,
    "type": "OBJECT",
    "description": "",
    "variableSet": [
      {
        "name": "SampleId",
        "required": false,
        "type": "TEXT",
        "description": "Unique ID(s) of the Sample, for example in a multisample vcf this would have an array of all the sample ids",
        "multiValue": false
      },
      {
        "name": "URIFile",
        "required": true,
        "type": "TEXT",
        "description": "URI PATH",
        "multiValue": false
      },
      {
        "name": "fileType",
        "required": true,
        "type": "CATEGORICAL",
        "description": "",
        "allowedValues": [
          "BAM",
          "gVCF",
          "VCF_small",
          "VCF_somatic_small",
          "VCF_CNV",
          "VCF_somatic_CNV",
          "VCF_SV",
          "VCF_somatic_SV",
          "VCF_SV_CNV",
          "SVG",
          "ANN",
          "BigWig",
          "MD5Sum",
          "ROH",
          "OTHER"
        ],
        "multiValue": false
      },
      {
        "name": "md5Sum",
        "required": false,
        "type": "TEXT",
        "description": "",
        "multiValue": false
      }
    ],
    "multiValue": true
  }
]