{
    "builds": [
        {
            "version": "9.0",
            "packages": [
                {
                    "package": "org.ga4gh.models",
                    "python_package": "ga4gh",
                    "version": "3.1.1",
                    "dependencies": [],
                    "json_hash": "4afea7e1111294cf205e50745979b668"
                },
                {
                    "package": "org.gel.models.metrics.avro",
                    "python_package": "metrics",
                    "version": "1.3.0",
                    "dependencies": [
                        "org.gel.models.participant.avro"
                    ],
                    "catalog_variable_sets": [
                        "FamilySelection",
                        "ReportedVsGeneticChecks",
                        "RareDiseaseInterpretationStatus"
                    ],
                    "json_hash": "3a2639c66be6f52d51eed1d84098b3d7"
                },
                {
                    "package": "org.gel.models.participant.avro",
                    "python_package": "participant",
                    "version": "1.5.0",
                    "dependencies": [],
                    "catalog_variable_sets": [
                        "GermlineSample",
                        "Pedigree",
                        "Referral",
                        "TumourSample",
                        "BirthClinicalQuestions"
                    ],
                    "json_hash": "2a51668a00e6f7c09974221461e1d8e1"
                },
                {
                    "package": "org.gel.models.report.avro",
                    "python_package": "reports",
                    "version": "7.0.0",
                    "dependencies": [
                        "org.gel.models.participant.avro"
                    ],
                    "json_hash": "195a649b37fc5b0b98856dc341e1049f"
                },
                {
                    "package": "org.gel.models.system.avro",
                    "python_package": "system",
                    "version": "0.1.0",
                    "dependencies": [],
                    "json_hash": "8790ab8ce68df34bed099239f2e47ee4"
                },
                {
                    "package": "org.opencb.biodata.models.variant.avro",
                    "python_package": "opencb",
                    "version": "2.9.3-GEL",
                    "dependencies": [],
                    "json_hash": "9718cd2e4ce4788afaecedfb563baf81"
                },
                {
                    "package": "org.gel.models.coverage.avro",
                    "python_package": "coverage",
                    "version": "0.1.0",
                    "dependencies": [],
                    "json_hash": "779a1c54a064adbb10a9c8f474bb6d6c"
                },
                {
                    "package": "org.gel.models.cva.avro",
                    "python_package": "cva",
                    "version": "1.5.3",
                    "dependencies": [
                        "org.gel.models.report.avro",
                        "org.gel.models.participant.avro",
                        "org.gel.models.system.avro",
                        "org.opencb.biodata.models.variant.avro"
                    ],
                    "json_hash": "799b5e37b20bda5600b0e866f78b7273"
                }
            ]
        },
        {
            "version": "8.9",
            "packages": [
                {
                    "package": "org.ga4gh.models",
                    "python_package": "ga4gh",
                    "version": "3.1.1",
                    "dependencies": [],
                    "json_hash": "ed532ecdbffbb390b42dae32be293a92"
                },
                {
                    "package": "org.gel.models.metrics.avro",
                    "python_package": "metrics",
                    "version": "1.3.0",
                    "dependencies": [
                        "org.gel.models.participant.avro"
                    ],
                    "catalog_variable_sets": [
                        "FamilySelection",
                        "ReportedVsGeneticChecks",
                        "RareDiseaseInterpretationStatus"
                    ],
                    "json_hash": "162e327e4d5adc5caf1b94b3a7ae8222"
                },
                {
                    "package": "org.gel.models.participant.avro",
                    "python_package": "participant",
                    "version": "1.5.0",
                    "dependencies": [],
                    "catalog_variable_sets": [
                        "GermlineSample",
                        "Pedigree",
                        "Referral",
                        "TumourSample",
                        "BirthClinicalQuestions"
                    ],
                    "json_hash": "3a25bb78cdcf27d251ad57148b6c65cc"
                },
                {
                    "package": "org.gel.models.report.avro",
                    "python_package": "reports",
                    "version": "6.10.0",
                    "dependencies": [
                        "org.gel.models.participant.avro"
                    ],
                    "json_hash": "e9b0aba92dea08e1ce33d70bedf7b1df"
                },
                {
                    "package": "org.gel.models.system.avro",
                    "python_package": "system",
                    "version": "0.1.0",
                    "dependencies": [],
                    "json_hash": "6b785f98b39f96e13b463b87b04c2797"
                },
                {
                    "package": "org.opencb.biodata.models.variant.avro",
                    "python_package": "opencb",
                    "version": "2.9.3-GEL",
                    "dependencies": [],
                    "json_hash": "b050979c5c79b76370bdffe53281cab7"
                },
                {
                    "package": "org.gel.models.coverage.avro",
                    "python_package": "coverage",
                    "version": "0.1.0",
                    "dependencies": [],
                    "json_hash": "de078089d06a2664a39aeacb664f34b2"
                },
                {
                    "package": "org.gel.models.cva.avro",
                    "python_package": "cva",
                    "version": "1.5.3",
                    "dependencies": [
                        "org.gel.models.report.avro",
                        "org.gel.models.participant.avro",
                        "org.gel.models.system.avro",
                        "org.opencb.biodata.models.variant.avro"
                    ],
                    "json_hash": "698c7500b8b085706d02e1ab02b06e05"
                }
            ]
        },
        {
            "version": "8.8",
            "packages": [
                {
                    "package": "org.ga4gh.models",
                    "python_package": "ga4gh",
                    "version": "3.1.1",
                    "dependencies": [],
                    "json_hash": "06b05c64b78ae2f2279f3ea5909c27aa"
                },
                {
                    "package": "org.gel.models.metrics.avro",
                    "python_package": "metrics",
                    "version": "1.3.0",
                    "dependencies": [
                        "org.gel.models.participant.avro"
                    ],
                    "catalog_variable_sets": [
                        "FamilySelection",
                        "ReportedVsGeneticChecks",
                        "RareDiseaseInterpretationStatus"
                    ],
                    "json_hash": "3c0fd8206b237fc7981c45c6444a05ed"
                },
                {
                    "package": "org.gel.models.participant.avro",
                    "python_package": "participant",
                    "version": "1.5.0",
                    "dependencies": [],
                    "catalog_variable_sets": [
                        "GermlineSample",
                        "Pedigree",
                        "Referral",
                        "TumourSample",
                        "BirthClinicalQuestions"
                    ],
                    "json_hash": "7c1f13f6bd14d386ffaade756c900c8b"
                },
                {
                    "package": "org.gel.models.report.avro",
                    "python_package": "reports",
                    "version": "6.9.0",
                    "dependencies": [
                        "org.gel.models.participant.avro"
                    ],
                    "json_hash": "f4ddd5c7d76934c92c62879082ea0770"
                },
                {
                    "package": "org.gel.models.system.avro",
                    "python_package": "system",
                    "version": "0.1.0",
                    "dependencies": [],
                    "json_hash": "833ebbb71e1f75113333346ee9faa31f"
                },
                {
                    "package": "org.opencb.biodata.models.variant.avro",
                    "python_package": "opencb",
                    "version": "2.9.3-GEL",
                    "dependencies": [],
                    "json_hash": "0ffef27bcb1279968690fa8d95a83615"
                },
                {
                    "package": "org.gel.models.coverage.avro",
                    "python_package": "coverage",
                    "version": "0.1.0",
                    "dependencies": [],
                    "json_hash": "d017ca0608b081e37f0e052fb3ab4adb"
                },
                {
                    "package": "org.gel.models.cva.avro",
                    "python_package": "cva",
                    "version": "1.5.3",
                    "dependencies": [
                        "org.gel.models.report.avro",
                        "org.gel.models.participant.avro",
                        "org.gel.models.system.avro",
                        "org.opencb.biodata.models.variant.avro"
                    ],
                    "json_hash": "89fbfd9d489d86ecd36284ff6189bd02"
                }
            ]
        },
        {
            "version": "8.7",
            "packages": [
                {
                    "package": "org.ga4gh.models",
                    "python_package": "ga4gh",
                    "version": "3.1.1",
                    "dependencies": [],
                    "json_hash": "1ba374c6cb06440cb28f43a9ac11deac"
                },
                {
                    "package": "org.gel.models.metrics.avro",
                    "python_package": "metrics",
                    "version": "1.2.5",
                    "dependencies": [
                        "org.gel.models.participant.avro"
                    ],
                    "catalog_variable_sets": [
                        "FamilySelection",
                        "ReportedVsGeneticChecks",
                        "RareDiseaseInterpretationStatus"
                    ],
                    "json_hash": "16ed298a994cffddc8b57f9a11e30457"
                },
                {
                    "package": "org.gel.models.participant.avro",
                    "python_package": "participant",
                    "version": "1.5.0",
                    "dependencies": [],
                    "catalog_variable_sets": [
                        "GermlineSample",
                        "Pedigree",
                        "Referral",
                        "TumourSample",
                        "BirthClinicalQuestions"
                    ],
                    "json_hash": "3dd29fdb3ac43ea555bbcd6c9c702874"
                },
                {
                    "package": "org.gel.models.report.avro",
                    "python_package": "reports",
                    "version": "6.9.0",
                    "dependencies": [
                        "org.gel.models.participant.avro"
                    ],
                    "json_hash": "31241ab39c6e3027cbcba201beab22db"
                },
                {
                    "package": "org.gel.models.system.avro",
                    "python_package": "system",
                    "version": "0.1.0",
                    "dependencies": [],
                    "json_hash": "00bdaa34fd332786b96c6db28bc9c385"
                },
                {
                    "package": "org.opencb.biodata.models.variant.avro",
                    "python_package": "opencb",
                    "version": "2.9.3-GEL",
                    "dependencies": [],
                    "json_hash": "f65a04b3b085322e0d842347284a2098"
                },
                {
                    "package": "org.gel.models.coverage.avro",
                    "python_package": "coverage",
                    "version": "0.1.0",
                    "dependencies": [],
                    "json_hash": "430d799221a51bd7d07511049be2d289"
                },
                {
                    "package": "org.gel.models.cva.avro",
                    "python_package": "cva",
                    "version": "1.5.3",
                    "dependencies": [
                        "org.gel.models.report.avro",
                        "org.gel.models.participant.avro",
                        "org.gel.models.system.avro",
                        "org.opencb.biodata.models.variant.avro"
                    ],
                    "json_hash": "18c5070b0a1d0123bf8b79b61554af6a"
                }
            ]
        },
        {
            "version": "8.6",
            "packages": [
                {
                    "package": "org.ga4gh.models",
                    "python_package": "ga4gh",
                    "version": "3.1.1",
                    "dependencies": [],
                    "json_hash": "c4bbc3a42dcb4dd2dcdeec70aaae0aad"
                },
                {
                    "package": "org.gel.models.metrics.avro",
                    "python_package": "metrics",
                    "version": "1.2.4",
                    "dependencies": [
                        "org.gel.models.participant.avro"
                    ],
                    "catalog_variable_sets": [
                        "FamilySelection",
                        "ReportedVsGeneticChecks",
                        "RareDiseaseInterpretationStatus"
                    ],
                    "json_hash": "200d7a1a15c53a7809ef4ed48e4efa4a"
                },
                {
                    "package": "org.gel.models.participant.avro",
                    "python_package": "participant",
                    "version": "1.5.0",
                    "dependencies": [],
                    "catalog_variable_sets": [
                        "GermlineSample",
                        "Pedigree",
                        "Referral",
                        "TumourSample",
                        "BirthClinicalQuestions"
                    ],
                    "json_hash": "c5698e0f351ac7b098cdc182d21b2980"
                },
                {
                    "package": "org.gel.models.report.avro",
                    "python_package": "reports",
                    "version": "6.9.0",
                    "dependencies": [
                        "org.gel.models.participant.avro"
                    ],
                    "json_hash": "41a44834cf446ad6b6958ee1e98db228"
                },
                {
                    "package": "org.gel.models.system.avro",
                    "python_package": "system",
                    "version": "0.1.0",
                    "dependencies": [],
                    "json_hash": "7e7bce366dd0ee4cd496c244dfb23cb7"
                },
                {
                    "package": "org.opencb.biodata.models.variant.avro",
                    "python_package": "opencb",
                    "version": "2.9.3-GEL",
                    "dependencies": [],
                    "json_hash": "f787aeb353f0b11d958dd502f4bd8103"
                },
                {
                    "package": "org.gel.models.coverage.avro",
                    "python_package": "coverage",
                    "version": "0.1.0",
                    "dependencies": [],
                    "json_hash": "264db63c0949364cc6fd7c21f4fbd2c7"
                },
                {
                    "package": "org.gel.models.cva.avro",
                    "python_package": "cva",
                    "version": "1.5.3",
                    "dependencies": [
                        "org.gel.models.report.avro",
                        "org.gel.models.participant.avro",
                        "org.gel.models.system.avro",
                        "org.opencb.biodata.models.variant.avro"
                    ],
                    "json_hash": "81b4f06cf49c8493e45da795f4343c50"
                }
            ]
        },
        {
            "version": "8.5",
            "packages": [
                {
                    "package": "org.ga4gh.models",
                    "python_package": "ga4gh",
                    "version": "3.1.1",
                    "dependencies": [],
                    "json_hash": "c0a7e4da9abe1ab93d40bd352b16f40a"
                },
                {
                    "package": "org.gel.models.metrics.avro",
                    "python_package": "metrics",
                    "version": "1.2.4",
                    "dependencies": [
                        "org.gel.models.participant.avro"
                    ],
                    "catalog_variable_sets": [
                        "FamilySelection",
                        "ReportedVsGeneticChecks",
                        "RareDiseaseInterpretationStatus"
                    ],
                    "json_hash": "13f2339100717f7b626f86daf9ade84e"
                },
                {
                    "package": "org.gel.models.participant.avro",
                    "python_package": "participant",
                    "version": "1.5.0",
                    "dependencies": [],
                    "catalog_variable_sets": [
                        "GermlineSample",
                        "Pedigree",
                        "Referral",
                        "TumourSample",
                        "BirthClinicalQuestions"
                    ],
                    "json_hash": "9f755b0c5dbdb81142c9edb801f1abb8"
                },
                {
                    "package": "org.gel.models.report.avro",
                    "python_package": "reports",
                    "version": "6.8.0",
                    "dependencies": [
                        "org.gel.models.participant.avro"
                    ],
                    "json_hash": "79d29f4e0cfb9200717690e2a520e81e"
                },
                {
                    "package": "org.gel.models.system.avro",
                    "python_package": "system",
                    "version": "0.1.0",
                    "dependencies": [],
                    "json_hash": "5fb649cef2b5f7237dc114187a50b8b2"
                },
                {
                    "package": "org.opencb.biodata.models.variant.avro",
                    "python_package": "opencb",
                    "version": "2.9.3-GEL",
                    "dependencies": [],
                    "json_hash": "5169736826f5866d9c941deb90dd4fba"
                },
                {
                    "package": "org.gel.models.coverage.avro",
                    "python_package": "coverage",
                    "version": "0.1.0",
                    "dependencies": [],
                    "json_hash": "3fcab2521dcb841241adfc9a18e2da74"
                },
                {
                    "package": "org.gel.models.cva.avro",
                    "python_package": "cva",
                    "version": "1.5.3",
                    "dependencies": [
                        "org.gel.models.report.avro",
                        "org.gel.models.participant.avro",
                        "org.gel.models.system.avro",
                        "org.opencb.biodata.models.variant.avro"
                    ],
                    "json_hash": "f5e0a61a6329fe6324fba31ca4031494"
                }
            ]
        },
        {
            "version": "8.4",
            "packages": [
                {
                    "package": "org.ga4gh.models",
                    "python_package": "ga4gh",
                    "version": "3.1.1",
                    "dependencies": [],
                    "json_hash": "b061511598f39514dd8d2daaae12e2dc"
                },
                {
                    "package": "org.gel.models.metrics.avro",
                    "python_package": "metrics",
                    "version": "1.2.3",
                    "dependencies": [
                        "org.gel.models.participant.avro"
                    ],
                    "catalog_variable_sets": [
                        "FamilySelection",
                        "ReportedVsGeneticChecks",
                        "RareDiseaseInterpretationStatus"
                    ],
                    "json_hash": "a60b1a5fdc628a2eed583f2779ff12f2"
                },
                {
                    "package": "org.gel.models.participant.avro",
                    "python_package": "participant",
                    "version": "1.5.0",
                    "dependencies": [],
                    "catalog_variable_sets": [
                        "GermlineSample",
                        "Pedigree",
                        "Referral",
                        "TumourSample",
                        "BirthClinicalQuestions"
                    ],
                    "json_hash": "b63b39ccfeb2659673db2afcb8e92ddc"
                },
                {
                    "package": "org.gel.models.report.avro",
                    "python_package": "reports",
                    "version": "6.8.0",
                    "dependencies": [
                        "org.gel.models.participant.avro"
                    ],
                    "json_hash": "2659c3f7a06b172bc9121d891de0fe49"
                },
                {
                    "package": "org.gel.models.system.avro",
                    "python_package": "system",
                    "version": "0.1.0",
                    "dependencies": [],
                    "json_hash": "1820b05f62a865396d2528702353093b"
                },
                {
                    "package": "org.opencb.biodata.models.variant.avro",
                    "python_package": "opencb",
                    "version": "2.9.3-GEL",
                    "dependencies": [],
                    "json_hash": "5d76d004489a767a9b255641b0e0722b"
                },
                {
                    "package": "org.gel.models.coverage.avro",
                    "python_package": "coverage",
                    "version": "0.1.0",
                    "dependencies": [],
                    "json_hash": "6b47a942dc60a2d25044db209757ba3e"
                },
                {
                    "package": "org.gel.models.cva.avro",
                    "python_package": "cva",
                    "version": "1.5.3",
                    "dependencies": [
                        "org.gel.models.report.avro",
                        "org.gel.models.participant.avro",
                        "org.gel.models.system.avro",
                        "org.opencb.biodata.models.variant.avro"
                    ],
                    "json_hash": "d411c5c8148110bb9cbf0d8efbe2b1b4"
                }
            ]
        },
        {
            "version": "8.3",
            "packages": [
                {
                    "package": "org.ga4gh.models",
                    "python_package": "ga4gh",
                    "version": "3.1.1",
                    "dependencies": [],
                    "json_hash": "f34569dd96439fce7dd0f21ff32cc769"
                },
                {
                    "package": "org.gel.models.metrics.avro",
                    "python_package": "metrics",
                    "version": "1.2.3",
                    "dependencies": [
                        "org.gel.models.participant.avro"
                    ],
                    "catalog_variable_sets": [
                        "FamilySelection",
                        "ReportedVsGeneticChecks",
                        "RareDiseaseInterpretationStatus"
                    ],
                    "json_hash": "067ec26a5925b32f285b9c4835e68ece"
                },
                {
                    "package": "org.gel.models.participant.avro",
                    "python_package": "participant",
                    "version": "1.5.0",
                    "dependencies": [],
                    "catalog_variable_sets": [
                        "GermlineSample",
                        "Pedigree",
                        "Referral",
                        "TumourSample",
                        "BirthClinicalQuestions"
                    ],
                    "json_hash": "714c152620d2be35d9edcb58afa51e2e"
                },
                {
                    "package": "org.gel.models.report.avro",
                    "python_package": "reports",
                    "version": "6.7.2",
                    "dependencies": [
                        "org.gel.models.participant.avro"
                    ],
                    "json_hash": "cccfb697bfc2d4f9087e8eb0e3ebf9fc"
                },
                {
                    "package": "org.gel.models.system.avro",
                    "python_package": "system",
                    "version": "0.1.0",
                    "dependencies": [],
                    "json_hash": "9e03ae79a553a77ff99196089e67801c"
                },
                {
                    "package": "org.opencb.biodata.models.variant.avro",
                    "python_package": "opencb",
                    "version": "2.9.3-GEL",
                    "dependencies": [],
                    "json_hash": "4886ae73e0049e4c5e276a7eb587ccf0"
                },
                {
                    "package": "org.gel.models.coverage.avro",
                    "python_package": "coverage",
                    "version": "0.1.0",
                    "dependencies": [],
                    "json_hash": "a1dbe11448a9ad3477f7edea32f2687a"
                },
                {
                    "package": "org.gel.models.cva.avro",
                    "python_package": "cva",
                    "version": "1.5.3",
                    "dependencies": [
                        "org.gel.models.report.avro",
                        "org.gel.models.participant.avro",
                        "org.gel.models.system.avro",
                        "org.opencb.biodata.models.variant.avro"
                    ],
                    "json_hash": "07bd7f64d122139b449eec44f1043c76"
                }
            ]
        },
        {
            "version": "8.2",
            "packages": [
                {
                    "package": "org.ga4gh.models",
                    "python_package": "ga4gh",
                    "version": "3.1.1",
                    "dependencies": [],
                    "json_hash": "24883f3024e209777e4629080e25a956"
                },
                {
                    "package": "org.gel.models.metrics.avro",
                    "python_package": "metrics",
                    "version": "1.2.3",
                    "dependencies": [
                        "org.gel.models.participant.avro"
                    ],
                    "catalog_variable_sets": [
                        "FamilySelection",
                        "ReportedVsGeneticChecks",
                        "RareDiseaseInterpretationStatus"
                    ],
                    "json_hash": "21853a02d1eea69c53d91fa094c322b4"
                },
                {
                    "package": "org.gel.models.participant.avro",
                    "python_package": "participant",
                    "version": "1.5.0",
                    "dependencies": [],
                    "catalog_variable_sets": [
                        "GermlineSample",
                        "Pedigree",
                        "Referral",
                        "TumourSample",
                        "BirthClinicalQuestions"
                    ],
                    "json_hash": "8fc17f80e7bf57c2583dd645802d3aea"
                },
                {
                    "package": "org.gel.models.report.avro",
                    "python_package": "reports",
                    "version": "6.7.1",
                    "dependencies": [
                        "org.gel.models.participant.avro"
                    ],
                    "json_hash": "ba339ea725c07626631f5139d9d126c2"
                },
                {
                    "package": "org.gel.models.system.avro",
                    "python_package": "system",
                    "version": "0.1.0",
                    "dependencies": [],
                    "json_hash": "0d419d4bfcc0fd5b3cf804de8dc2e10a"
                },
                {
                    "package": "org.opencb.biodata.models.variant.avro",
                    "python_package": "opencb",
                    "version": "2.9.3-GEL",
                    "dependencies": [],
                    "json_hash": "ff218d198a172c1fa16725b39097716b"
                },
                {
                    "package": "org.gel.models.coverage.avro",
                    "python_package": "coverage",
                    "version": "0.1.0",
                    "dependencies": [],
                    "json_hash": "5803d4828668eb24f962043eccdeeeb6"
                },
                {
                    "package": "org.gel.models.cva.avro",
                    "python_package": "cva",
                    "version": "1.5.3",
                    "dependencies": [
                        "org.gel.models.report.avro",
                        "org.gel.models.participant.avro",
                        "org.gel.models.system.avro",
                        "org.opencb.biodata.models.variant.avro"
                    ],
                    "json_hash": "a65bf014c6e4b32184332187717ef3e6"
                }
            ]
        },
        {
            "version": "8.1",
            "packages": [
                {
                    "package": "org.ga4gh.models",
                    "python_package": "ga4gh",
                    "version": "3.1.1",
                    "dependencies": [],
                    "json_hash": "37b9ad8a31c34d9693ef3e20e7832c17"
                },
                {
                    "package": "org.gel.models.metrics.avro",
                    "python_package": "metrics",
                    "version": "1.2.3",
                    "dependencies": [
                        "org.gel.models.participant.avro"
                    ],
                    "catalog_variable_sets": [
                        "FamilySelection",
                        "ReportedVsGeneticChecks",
                        "RareDiseaseInterpretationStatus"
                    ],
                    "json_hash": "4b49b15e2f7a3a8ca34efbfe83affa31"
                },
                {
                    "package": "org.gel.models.participant.avro",
                    "python_package": "participant",
                    "version": "1.5.0",
                    "dependencies": [],
                    "catalog_variable_sets": [
                        "GermlineSample",
                        "Pedigree",
                        "Referral",
                        "TumourSample",
                        "BirthClinicalQuestions"
                    ],
                    "json_hash": "f17baf9b7de2785660baf37677163545"
                },
                {
                    "package": "org.gel.models.report.avro",
                    "python_package": "reports",
                    "version": "6.7.0",
                    "dependencies": [
                        "org.gel.models.participant.avro"
                    ],
                    "json_hash": "2ba0f923f802f3808825b291d04939fc"
                },
                {
                    "package": "org.gel.models.system.avro",
                    "python_package": "system",
                    "version": "0.1.0",
                    "dependencies": [],
                    "json_hash": "18c7f19b6984a7b8be2f8401ce98e726"
                },
                {
                    "package": "org.opencb.biodata.models.variant.avro",
                    "python_package": "opencb",
                    "version": "1.3.1",
                    "dependencies": [],
                    "json_hash": "28b96d8538dbd02d0f0e7ee5ff229170"
                },
                {
                    "package": "org.gel.models.coverage.avro",
                    "python_package": "coverage",
                    "version": "0.1.0",
                    "dependencies": [],
                    "json_hash": "f4a8c305ad273a6187744a04ab6b806c"
                },
                {
                    "package": "org.gel.models.cva.avro",
                    "python_package": "cva",
                    "version": "1.5.3",
                    "dependencies": [
                        "org.gel.models.report.avro",
                        "org.gel.models.participant.avro",
                        "org.gel.models.system.avro",
                        "org.opencb.biodata.models.variant.avro"
                    ],
                    "json_hash": "bd6c5ca611f132e989d5278428a15486"
                }
            ]
        },
        {
            "version": "8.0",
            "packages": [
                {
                    "package": "org.ga4gh.models",
                    "python_package": "ga4gh",
                    "version": "3.1.0",
                    "dependencies": [],
                    "json_hash": "4c155a1249a0597cc77c1cf320a2d3b3"
                },
                {
                    "package": "org.gel.models.metrics.avro",
                    "python_package": "metrics",
                    "version": "1.2.3",
                    "dependencies": [
                        "org.gel.models.participant.avro"
                    ],
                    "catalog_variable_sets": [
                        "FamilySelection",
                        "ReportedVsGeneticChecks",
                        "RareDiseaseInterpretationStatus"
                    ],
                    "json_hash": "f22161fee6474c449d36138afdfe20af"
                },
                {
                    "package": "org.gel.models.participant.avro",
                    "python_package": "participant",
                    "version": "1.5.0",
                    "dependencies": [],
                    "catalog_variable_sets": [
                        "GermlineSample",
                        "Pedigree",
                        "Referral",
                        "TumourSample",
                        "BirthClinicalQuestions"
                    ],
                    "json_hash": "130acc6cd03d3670795b704e96f319b7"
                },
                {
                    "package": "org.gel.models.report.avro",
                    "python_package": "reports",
                    "version": "6.6.0",
                    "dependencies": [
                        "org.gel.models.participant.avro"
                    ],
                    "json_hash": "f39eecab760bdc055958e1850d304927"
                },
                {
                    "package": "org.gel.models.system.avro",
                    "python_package": "system",
                    "version": "0.1.0",
                    "dependencies": [],
                    "json_hash": "9625b7759b20175ab12e5857aad75249"
                },
                {
                    "package": "org.opencb.biodata.models.variant.avro",
                    "python_package": "opencb",
                    "version": "1.3.1",
                    "dependencies": [],
                    "json_hash": "dbe1447e2565e08bbe91b37dc7a45b9e"
                },
                {
                    "package": "org.gel.models.coverage.avro",
                    "python_package": "coverage",
                    "version": "0.1.0",
                    "dependencies": [],
                    "json_hash": "73b92a83f12f7ac64f0ec80d318b6b04"
                },
                {
                    "package": "org.gel.models.cva.avro",
                    "python_package": "cva",
                    "version": "1.5.3",
                    "dependencies": [
                        "org.gel.models.report.avro",
                        "org.gel.models.participant.avro",
                        "org.gel.models.system.avro",
                        "org.opencb.biodata.models.variant.avro"
                    ],
                    "json_hash": "acc89868c6406a87eede0af5ec00f65a"
                }
            ]
        },
        {
            "version": "7.13",
            "packages": [
                {
                    "package": "org.ga4gh.models",
                    "python_package": "ga4gh",
                    "version": "3.1.0",
                    "dependencies": [],
                    "json_hash": "fb12b5a015a6ea8c81c1c724fc2fad40"
                },
                {
                    "package": "org.gel.models.metrics.avro",
                    "python_package": "metrics",
                    "version": "1.2.2",
                    "dependencies": [
                        "org.gel.models.participant.avro"
                    ],
                    "catalog_variable_sets": [
                        "FamilySelection",
                        "ReportedVsGeneticChecks",
                        "RareDiseaseInterpretationStatus"
                    ],
                    "json_hash": "ea27b2bc939ae26e18a29f8225e6e1c1"
                },
                {
                    "package": "org.gel.models.participant.avro",
                    "python_package": "participant",
                    "version": "1.4.0",
                    "dependencies": [],
                    "catalog_variable_sets": [
                        "GermlineSample",
                        "Pedigree",
                        "Referral",
                        "TumourSample",
                        "BirthClinicalQuestions"
                    ],
                    "json_hash": "2ad99aca48fb7d6f09715e5ee93eccd3"
                },
                {
                    "package": "org.gel.models.report.avro",
                    "python_package": "reports",
                    "version": "6.5.0",
                    "dependencies": [
                        "org.gel.models.participant.avro"
                    ],
                    "json_hash": "4808a0b958417ee1e01b54497406a7c0"
                },
                {
                    "package": "org.gel.models.system.avro",
                    "python_package": "system",
                    "version": "0.1.0",
                    "dependencies": [],
                    "json_hash": "bcc3e722fd6d82a037ccfab44d4855d7"
                },
                {
                    "package": "org.opencb.biodata.models.variant.avro",
                    "python_package": "opencb",
                    "version": "1.3.1",
                    "dependencies": [],
                    "json_hash": "218139072704b6a79b9ff6d62cc142b7"
                },
                {
                    "package": "org.gel.models.coverage.avro",
                    "python_package": "coverage",
                    "version": "0.1.0",
                    "dependencies": [],
                    "json_hash": "762773d1791d2bc5f439e5d5bc385d1d"
                },
                {
                    "package": "org.gel.models.cva.avro",
                    "python_package": "cva",
                    "version": "1.5.3",
                    "dependencies": [
                        "org.gel.models.report.avro",
                        "org.gel.models.participant.avro",
                        "org.gel.models.system.avro",
                        "org.opencb.biodata.models.variant.avro"
                    ],
                    "json_hash": "b634c78a5fc04e570dd808b72e8d72f4"
                }
            ]
        },
        {
            "version": "7.12",
            "packages": [
                {
                    "package": "org.ga4gh.models",
                    "python_package": "ga4gh",
                    "version": "3.1.0",
                    "dependencies": [],
                    "json_hash": "b21114954c8c5cfdadcbf32894bdd0f7"
                },
                {
                    "package": "org.gel.models.metrics.avro",
                    "python_package": "metrics",
                    "version": "1.2.2",
                    "dependencies": [
                        "org.gel.models.participant.avro"
                    ],
                    "catalog_variable_sets": [
                        "FamilySelection",
                        "ReportedVsGeneticChecks",
                        "RareDiseaseInterpretationStatus"
                    ],
                    "json_hash": "f92fd664f4ee43107540a45c99c87be4"
                },
                {
                    "package": "org.gel.models.participant.avro",
                    "python_package": "participant",
                    "version": "1.4.0",
                    "dependencies": [],
                    "catalog_variable_sets": [
                        "GermlineSample",
                        "Pedigree",
                        "Referral",
                        "TumourSample",
                        "BirthClinicalQuestions"
                    ],
                    "json_hash": "e80b57cedc4c54651a63d44d2dfe2903"
                },
                {
                    "package": "org.gel.models.report.avro",
                    "python_package": "reports",
                    "version": "6.4.0",
                    "dependencies": [
                        "org.gel.models.participant.avro"
                    ],
                    "json_hash": "5b64c2634dcc3513b1fed741739a3508"
                },
                {
                    "package": "org.gel.models.system.avro",
                    "python_package": "system",
                    "version": "0.1.0",
                    "dependencies": [],
                    "json_hash": "238e8c698936628d8f1e1bec11bfeb8a"
                },
                {
                    "package": "org.opencb.biodata.models.variant.avro",
                    "python_package": "opencb",
                    "version": "1.3.1",
                    "dependencies": [],
                    "json_hash": "e2dfef4dad9f5f0e3631e6453eacdddb"
                },
                {
                    "package": "org.gel.models.coverage.avro",
                    "python_package": "coverage",
                    "version": "0.1.0",
                    "dependencies": [],
                    "json_hash": "5d8d5bfcd741f16a51eeac4f02647ac8"
                },
                {
                    "package": "org.gel.models.cva.avro",
                    "python_package": "cva",
                    "version": "1.5.3",
                    "dependencies": [
                        "org.gel.models.report.avro",
                        "org.gel.models.participant.avro",
                        "org.gel.models.system.avro",
                        "org.opencb.biodata.models.variant.avro"
                    ],
                    "json_hash": "54b74209c54207f046e0569d6ee0ccf5"
                }
            ]
        },
        {
            "version": "7.11",
            "packages": [
                {
                    "package": "org.ga4gh.models",
                    "python_package": "ga4gh",
                    "version": "3.1.0",
                    "dependencies": [],
                    "json_hash": "68ce18564298b38c75a262ea860c37d1"
                },
                {
                    "package": "org.gel.models.metrics.avro",
                    "python_package": "metrics",
                    "version": "1.2.2",
                    "dependencies": [
                        "org.gel.models.participant.avro"
                    ],
                    "catalog_variable_sets": [
                        "FamilySelection",
                        "ReportedVsGeneticChecks",
                        "RareDiseaseInterpretationStatus"
                    ],
                    "json_hash": "55b70209a86aff0465b58d4f42a089d4"
                },
                {
                    "package": "org.gel.models.participant.avro",
                    "python_package": "participant",
                    "version": "1.4.0",
                    "dependencies": [],
                    "catalog_variable_sets": [
                        "GermlineSample",
                        "Pedigree",
                        "Referral",
                        "TumourSample",
                        "BirthClinicalQuestions"
                    ],
                    "json_hash": "97a3e342ce5f58388061275745f0ef29"
                },
                {
                    "package": "org.gel.models.report.avro",
                    "python_package": "reports",
                    "version": "6.4.0",
                    "dependencies": [
                        "org.gel.models.participant.avro"
                    ],
                    "json_hash": "9d112247b40fac028cbdea5f55cdcb67"
                },
                {
                    "package": "org.gel.models.system.avro",
                    "python_package": "system",
                    "version": "0.1.0",
                    "dependencies": [],
                    "json_hash": "c3ae46dafa67ac0dacf57af8cdd68b5b"
                },
                {
                    "package": "org.opencb.biodata.models.variant.avro",
                    "python_package": "opencb",
                    "version": "1.3.0",
                    "dependencies": [],
                    "json_hash": "30f99715c378343562c50347f6e709aa"
                },
                {
                    "package": "org.gel.models.coverage.avro",
                    "python_package": "coverage",
                    "version": "0.1.0",
                    "dependencies": [],
                    "json_hash": "3dcec6a22c90ae5f6c97d18901302d3e"
                },
                {
                    "package": "org.gel.models.cva.avro",
                    "python_package": "cva",
                    "version": "1.5.3",
                    "dependencies": [
                        "org.gel.models.report.avro",
                        "org.gel.models.participant.avro",
                        "org.gel.models.system.avro",
                        "org.opencb.biodata.models.variant.avro"
                    ],
                    "json_hash": "e3dde9f01f3b9e1abb485df185c974e4"
                }
            ]
        },
        {
            "version": "7.10",
            "packages": [
                {
                    "package": "org.ga4gh.models",
                    "python_package": "ga4gh",
                    "version": "3.1.0",
                    "dependencies": [],
                    "json_hash": "26afd8b981286fd4f65020228b947ce4"
                },
                {
                    "package": "org.gel.models.metrics.avro",
                    "python_package": "metrics",
                    "version": "1.2.2",
                    "dependencies": [
                        "org.gel.models.participant.avro"
                    ],
                    "catalog_variable_sets": [
                        "FamilySelection",
                        "ReportedVsGeneticChecks",
                        "RareDiseaseInterpretationStatus"
                    ],
                    "json_hash": "3ad62facee0c10b9405103ec0c1e21d3"
                },
                {
                    "package": "org.gel.models.participant.avro",
                    "python_package": "participant",
                    "version": "1.3.0",
                    "dependencies": [],
                    "catalog_variable_sets": [
                        "GermlineSample",
                        "Pedigree",
                        "Referral",
                        "TumourSample"
                    ],
                    "json_hash": "da944e074cbf5558912017213d535186"
                },
                {
                    "package": "org.gel.models.report.avro",
                    "python_package": "reports",
                    "version": "6.4.0",
                    "dependencies": [
                        "org.gel.models.participant.avro"
                    ],
                    "json_hash": "0992ee77b3312e18d4d1020d576c4033"
                },
                {
                    "package": "org.gel.models.system.avro",
                    "python_package": "system",
                    "version": "0.1.0",
                    "dependencies": [],
                    "json_hash": "8d82c0ea3f5e6b009834e815200043ec"
                },
                {
                    "package": "org.opencb.biodata.models.variant.avro",
                    "python_package": "opencb",
                    "version": "1.3.0",
                    "dependencies": [],
                    "json_hash": "91affbefe0e509e4ea370cc18df559b0"
                },
                {
                    "package": "org.gel.models.coverage.avro",
                    "python_package": "coverage",
                    "version": "0.1.0",
                    "dependencies": [],
                    "json_hash": "685007045526d5429d15c90222485363"
                },
                {
                    "package": "org.gel.models.cva.avro",
                    "python_package": "cva",
                    "version": "1.5.3",
                    "dependencies": [
                        "org.gel.models.report.avro",
                        "org.gel.models.participant.avro",
                        "org.gel.models.system.avro",
                        "org.opencb.biodata.models.variant.avro"
                    ],
                    "json_hash": "70f3add9df0ad78371df56849ca16c63"
                }
            ]
        },
        {
            "version": "7.9",
            "packages": [
                {
                    "package": "org.ga4gh.models",
                    "python_package": "ga4gh",
                    "version": "3.1.0",
                    "dependencies": [],
                    "json_hash": "3ce61189e5d641536d6fa7cba934d32e"
                },
                {
                    "package": "org.gel.models.metrics.avro",
                    "python_package": "metrics",
                    "version": "1.2.2",
                    "dependencies": [
                        "org.gel.models.participant.avro"
                    ],
                    "json_hash": "7316c532682a94d3f96535aafdaa4232"
                },
                {
                    "package": "org.gel.models.participant.avro",
                    "python_package": "participant",
                    "version": "1.3.0",
                    "dependencies": [],
                    "json_hash": "09215e69ba488babbff005b8204bf3c8"
                },
                {
                    "package": "org.gel.models.report.avro",
                    "python_package": "reports",
                    "version": "6.3.0",
                    "dependencies": [
                        "org.gel.models.participant.avro"
                    ],
                    "json_hash": "b1acb488efc02f2df30a9778eb1f1f04"
                },
                {
                    "package": "org.gel.models.system.avro",
                    "python_package": "system",
                    "version": "0.1.0",
                    "dependencies": [],
                    "json_hash": "ca6e6e1019f9b34877efa7ffd8f99c64"
                },
                {
                    "package": "org.opencb.biodata.models.variant.avro",
                    "python_package": "opencb",
                    "version": "1.3.0",
                    "dependencies": [],
                    "json_hash": "569dc2d1ac377e6bbf0e4a7556775a06"
                },
                {
                    "package": "org.gel.models.coverage.avro",
                    "python_package": "coverage",
                    "version": "0.1.0",
                    "dependencies": [],
                    "json_hash": "a156827e29bc052c1fcc19766bc83e35"
                },
                {
                    "package": "org.gel.models.cva.avro",
                    "python_package": "cva",
                    "version": "1.5.3",
                    "dependencies": [
                        "org.gel.models.report.avro",
                        "org.gel.models.participant.avro",
                        "org.gel.models.system.avro",
                        "org.opencb.biodata.models.variant.avro"
                    ],
                    "json_hash": "8b88ac76450c83d7c776b3e6f5f83934"
                }
            ]
        },
        {
            "version": "7.8",
            "packages": [
                {
                    "package": "org.ga4gh.models",
                    "python_package": "ga4gh",
                    "version": "3.1.0",
                    "dependencies": [],
                    "json_hash": "32f32162eacb364c2060b2e515f20ae8"
                },
                {
                    "package": "org.gel.models.metrics.avro",
                    "python_package": "metrics",
                    "version": "1.2.2",
                    "dependencies": [
                        "org.gel.models.participant.avro"
                    ],
                    "json_hash": "37a51691bbd77dca324e33a540d44f08"
                },
                {
                    "package": "org.gel.models.participant.avro",
                    "python_package": "participant",
                    "version": "1.3.0",
                    "dependencies": [],
                    "json_hash": "dfe77a3fb8e18532e82884f7c76425f0"
                },
                {
                    "package": "org.gel.models.report.avro",
                    "python_package": "reports",
                    "version": "6.2.0",
                    "dependencies": [
                        "org.gel.models.participant.avro"
                    ],
                    "json_hash": "ed0ee3f3bb54a23ae6178562ce551d58"
                },
                {
                    "package": "org.gel.models.system.avro",
                    "python_package": "system",
                    "version": "0.1.0",
                    "dependencies": [],
                    "json_hash": "803aa03a85f661f49745ff28707b5b9b"
                },
                {
                    "package": "org.opencb.biodata.models.variant.avro",
                    "python_package": "opencb",
                    "version": "1.3.0",
                    "dependencies": [],
                    "json_hash": "19de8b96b0eb0eaeeddb28c586a9442f"
                },
                {
                    "package": "org.gel.models.coverage.avro",
                    "python_package": "coverage",
                    "version": "0.1.0",
                    "dependencies": [],
                    "json_hash": "8e1ba5898bbed11cfabd96843c2bbbd2"
                },
                {
                    "package": "org.gel.models.cva.avro",
                    "python_package": "cva",
                    "version": "1.5.2",
                    "dependencies": [
                        "org.gel.models.report.avro",
                        "org.gel.models.participant.avro",
                        "org.gel.models.system.avro",
                        "org.opencb.biodata.models.variant.avro"
                    ],
                    "json_hash": "b3f2a11bfb158cf8a63e86985d459862"
                }
            ]
        },
        {
            "version": "7.7",
            "packages": [
                {
                    "package": "org.ga4gh.models",
                    "python_package": "ga4gh",
                    "version": "3.1.0",
                    "dependencies": [],
                    "json_hash": "9dcc607ab28bd4e9e3db14e385f31b4b"
                },
                {
                    "package": "org.gel.models.metrics.avro",
                    "python_package": "metrics",
                    "version": "1.2.2",
                    "dependencies": [
                        "org.gel.models.participant.avro"
                    ],
                    "json_hash": "8d2616b7be71e7797006be72e5c94b08"
                },
                {
                    "package": "org.gel.models.participant.avro",
                    "python_package": "participant",
                    "version": "1.3.0",
                    "dependencies": [],
                    "json_hash": "28da6517052f04af18b46e3a6e7e94e7"
                },
                {
                    "package": "org.gel.models.report.avro",
                    "python_package": "reports",
                    "version": "6.1.1",
                    "dependencies": [
                        "org.gel.models.participant.avro"
                    ],
                    "json_hash": "6ecccc406c0f5d1d9e9b767bb003ab58"
                },
                {
                    "package": "org.gel.models.system.avro",
                    "python_package": "system",
                    "version": "0.1.0",
                    "dependencies": [],
                    "json_hash": "2e3d1b15194f8bff2356efee9f2599d1"
                },
                {
                    "package": "org.opencb.biodata.models.variant.avro",
                    "python_package": "opencb",
                    "version": "1.3.0",
                    "dependencies": [],
                    "json_hash": "fcbd42e52b25fcbc751d31b974f46810"
                },
                {
                    "package": "org.gel.models.coverage.avro",
                    "python_package": "coverage",
                    "version": "0.1.0",
                    "dependencies": [],
                    "json_hash": "6219506b9d693814c4352bd1e792dfda"
                },
                {
                    "package": "org.gel.models.cva.avro",
                    "python_package": "cva",
                    "version": "1.5.1",
                    "dependencies": [
                        "org.gel.models.report.avro",
                        "org.gel.models.participant.avro",
                        "org.gel.models.system.avro",
                        "org.opencb.biodata.models.variant.avro"
                    ],
                    "json_hash": "8c5498d516c1bf76c98b76f56c2d45a4"
                }
            ]
        },
        {
            "version": "7.6",
            "packages": [
                {
                    "package": "org.ga4gh.models",
                    "python_package": "ga4gh",
                    "version": "3.1.0",
                    "dependencies": [],
                    "json_hash": "86548568335c6184e67ac84ced25ddbe"
                },
                {
                    "package": "org.gel.models.metrics.avro",
                    "python_package": "metrics",
                    "version": "1.2.2",
                    "dependencies": [
                        "org.gel.models.participant.avro"
                    ],
                    "json_hash": "15be0c34e7aad4741d261f2589239cd8"
                },
                {
                    "package": "org.gel.models.participant.avro",
                    "python_package": "participant",
                    "version": "1.2.0",
                    "dependencies": [],
                    "json_hash": "46e50f9cbaea6986db9761b4008d7854"
                },
                {
                    "package": "org.gel.models.report.avro",
                    "python_package": "reports",
                    "version": "6.1.0",
                    "dependencies": [
                        "org.gel.models.participant.avro"
                    ],
                    "json_hash": "5708f7504289d719aec3859d223ed810"
                },
                {
                    "package": "org.gel.models.system.avro",
                    "python_package": "system",
                    "version": "0.1.0",
                    "dependencies": [],
                    "json_hash": "0b753487e5574f900ab5d09256d56a40"
                },
                {
                    "package": "org.opencb.biodata.models.variant.avro",
                    "python_package": "opencb",
                    "version": "1.3.0",
                    "dependencies": [],
                    "json_hash": "c77f947de4876849985a251bb8814d77"
                },
                {
                    "package": "org.gel.models.coverage.avro",
                    "python_package": "coverage",
                    "version": "0.1.0",
                    "dependencies": [],
                    "json_hash": "c506929150e44e93b4278229545341ce"
                },
                {
                    "package": "org.gel.models.cva.avro",
                    "python_package": "cva",
                    "version": "1.5.0",
                    "dependencies": [
                        "org.gel.models.report.avro",
                        "org.gel.models.participant.avro",
                        "org.gel.models.system.avro",
                        "org.opencb.biodata.models.variant.avro"
                    ],
                    "json_hash": "c646e2b48762452dc1d474ce8c63657e"
                }
            ]
        },
        {
            "version": "7.4",
            "packages": [
                {
                    "package": "org.ga4gh.models",
                    "python_package": "ga4gh",
                    "version": "3.0.0",
                    "dependencies": [],
                    "json_hash": "f8a9834077f34649f6e3c70fadce1a15"
                },
                {
                    "package": "org.gel.models.metrics.avro",
                    "python_package": "metrics",
                    "version": "1.2.1",
                    "dependencies": [
                        "org.gel.models.participant.avro"
                    ],
                    "json_hash": "d88ee2dfcac5eb38401c1a5bef9e0827"
                },
                {
                    "package": "org.gel.models.participant.avro",
                    "python_package": "participant",
                    "version": "1.2.0",
                    "dependencies": [],
                    "json_hash": "d37ced7e63bb1e697a4130fa75ddd8b4"
                },
                {
                    "package": "org.gel.models.report.avro",
                    "python_package": "reports",
                    "version": "6.1.0",
                    "dependencies": [
                        "org.gel.models.participant.avro"
                    ],
                    "json_hash": "e29b68a6d2b1202f3c6a2e8770f9a6f7"
                },
                {
                    "package": "org.gel.models.system.avro",
                    "python_package": "system",
                    "version": "0.1.0",
                    "dependencies": [],
                    "json_hash": "16b803c1c968119f59c4ff385ef5452e"
                },
                {
                    "package": "org.opencb.biodata.models.variant.avro",
                    "python_package": "opencb",
                    "version": "1.3.0",
                    "dependencies": [],
                    "json_hash": "c07befddcdbdb154d72f61b8f7280ef3"
                },
                {
                    "package": "org.gel.models.coverage.avro",
                    "python_package": "coverage",
                    "version": "0.1.0",
                    "dependencies": [],
                    "json_hash": "d4b9afec71ab758dbbd9941f40f80da0"
                },
                {
                    "package": "org.gel.models.cva.avro",
                    "python_package": "cva",
                    "version": "1.5.0",
                    "dependencies": [
                        "org.gel.models.report.avro",
                        "org.gel.models.participant.avro",
                        "org.gel.models.system.avro",
                        "org.opencb.biodata.models.variant.avro"
                    ],
                    "json_hash": "47e24ad6c3f48066e046f6bcc2f5d80c"
                }
            ]
        },
        {
            "version": "7.3",
            "packages": [
                {
                    "package": "org.ga4gh.models",
                    "python_package": "ga4gh",
                    "version": "3.0.0",
                    "dependencies": [],
                    "json_hash": "8d3d1a66ae3b588d344845513835b132"
                },
                {
                    "package": "org.gel.models.metrics.avro",
                    "python_package": "metrics",
                    "version": "1.2.1",
                    "dependencies": [
                        "org.gel.models.participant.avro"
                    ],
                    "json_hash": "fd2d32e994c1a470c9a2f5c5d88dafe5"
                },
                {
                    "package": "org.gel.models.participant.avro",
                    "python_package": "participant",
                    "version": "1.2.0",
                    "dependencies": [],
                    "json_hash": "7ac3609261de85df2ffcb8ab1a410cef"
                },
                {
                    "package": "org.gel.models.report.avro",
                    "python_package": "reports",
                    "version": "6.1.0",
                    "dependencies": [
                        "org.gel.models.participant.avro"
                    ],
                    "json_hash": "41e49c5671f4f0a164b365c44204d1aa"
                },
                {
                    "package": "org.gel.models.system.avro",
                    "python_package": "system",
                    "version": "0.1.0",
                    "dependencies": [],
                    "json_hash": "a3b56d1e8cb8945e86f2c31310c02acf"
                },
                {
                    "package": "org.opencb.biodata.models.variant.avro",
                    "python_package": "opencb",
                    "version": "1.3.0",
                    "dependencies": [],
                    "json_hash": "8d22aa96d62929bbfe1a6fbdd1ea2087"
                },
                {
                    "package": "org.gel.models.coverage.avro",
                    "python_package": "coverage",
                    "version": "0.1.0",
                    "dependencies": [],
                    "json_hash": "55c36f50ba3a35a5f09097d2bc124a65"
                },
                {
                    "package": "org.gel.models.cva.avro",
                    "python_package": "cva",
                    "version": "1.4.0",
                    "dependencies": [
                        "org.gel.models.report.avro",
                        "org.gel.models.participant.avro",
                        "org.gel.models.system.avro",
                        "org.opencb.biodata.models.variant.avro"
                    ],
                    "json_hash": "381852abb1b6e3b568b31bba64792c4b"
                }
            ]
        },
        {
            "version": "7.2.1",
            "packages": [
                {
                    "package": "org.ga4gh.models",
                    "python_package": "ga4gh",
                    "version": "3.0.0",
                    "dependencies": [],
                    "json_hash": "1d8a18e294e0a5055d12ca1788a5cb98"
                },
                {
                    "package": "org.gel.models.metrics.avro",
                    "python_package": "metrics",
                    "version": "1.2.0",
                    "dependencies": [
                        "org.gel.models.participant.avro"
                    ],
                    "json_hash": "502f87134e2d2d583cd20b8b4bb5dfa8"
                },
                {
                    "package": "org.gel.models.participant.avro",
                    "python_package": "participant",
                    "version": "1.1.3",
                    "dependencies": [],
                    "json_hash": "d3189eec99e8c1aa0a83abf22e757118"
                },
                {
                    "package": "org.gel.models.report.avro",
                    "python_package": "reports",
                    "version": "6.0.2",
                    "dependencies": [
                        "org.gel.models.participant.avro"
                    ],
                    "json_hash": "2f0abf58aa27ecc67846c3d81c22cbae"
                },
                {
                    "package": "org.gel.models.system.avro",
                    "python_package": "system",
                    "version": "0.1.0",
                    "dependencies": [],
                    "json_hash": "4b9f7d874cdc2424340b2f674703895a"
                },
                {
                    "package": "org.opencb.biodata.models.variant.avro",
                    "python_package": "opencb",
                    "version": "1.3.0",
                    "dependencies": [],
                    "json_hash": "f8975207811bd437ee988ba9b6b78dfb"
                },
                {
                    "package": "org.gel.models.coverage.avro",
                    "python_package": "coverage",
                    "version": "0.1.0",
                    "dependencies": [],
                    "json_hash": "cba1d626ec225fa35d652117d10e031a"
                },
                {
                    "package": "org.gel.models.cva.avro",
                    "python_package": "cva",
                    "version": "1.3.1",
                    "dependencies": [
                        "org.gel.models.report.avro",
                        "org.gel.models.participant.avro",
                        "org.gel.models.system.avro",
                        "org.opencb.biodata.models.variant.avro"
                    ],
                    "json_hash": "ac3683500acd6752a17dd6304c8e943d"
                }
            ]
        },
        {
            "version": "7.2",
            "packages": [
                {
                    "package": "org.ga4gh.models",
                    "python_package": "ga4gh",
                    "version": "3.0.0",
                    "dependencies": [],
                    "json_hash": "ccb33ae1b814888a6e1e3fa8dee55ed5"
                },
                {
                    "package": "org.gel.models.metrics.avro",
                    "python_package": "metrics",
                    "version": "1.2.0",
                    "dependencies": [
                        "org.gel.models.participant.avro"
                    ],
                    "json_hash": "c3084506cca2a94c3429ca21892bd608"
                },
                {
                    "package": "org.gel.models.participant.avro",
                    "python_package": "participant",
                    "version": "1.1.2",
                    "dependencies": [],
                    "json_hash": "538ec40cde881a8e235df381329ac1e5"
                },
                {
                    "package": "org.gel.models.report.avro",
                    "python_package": "reports",
                    "version": "6.0.1",
                    "dependencies": [
                        "org.gel.models.participant.avro"
                    ],
                    "json_hash": "c0c405071f6fe0e1a17c50a063529955"
                },
                {
                    "package": "org.gel.models.system.avro",
                    "python_package": "system",
                    "version": "0.1.0",
                    "dependencies": [],
                    "json_hash": "fcd3d06c89810cfe5ed90445232d730a"
                },
                {
                    "package": "org.opencb.biodata.models.variant.avro",
                    "python_package": "opencb",
                    "version": "1.3.0",
                    "dependencies": [],
                    "json_hash": "314923560a876718ef93394fc19407f9"
                },
                {
                    "package": "org.gel.models.coverage.avro",
                    "python_package": "coverage",
                    "version": "0.1.0",
                    "dependencies": [],
                    "json_hash": "ae3ada33a60c7773f1495cb98a8e166d"
                },
                {
                    "package": "org.gel.models.cva.avro",
                    "python_package": "cva",
                    "version": "1.3.0",
                    "dependencies": [
                        "org.gel.models.report.avro",
                        "org.gel.models.participant.avro",
                        "org.gel.models.system.avro",
                        "org.opencb.biodata.models.variant.avro"
                    ],
                    "json_hash": "7c2b20e2f852181f375172ece7dcfecf"
                }
            ]
        },
        {
            "version": "7.0",
            "packages": [
                {
                    "package": "org.ga4gh.models",
                    "python_package": "ga4gh",
                    "version": "3.0.0",
                    "dependencies": [],
                    "json_hash": "db5bf82a0886fb9ba8e8d7224e9889fa"
                },
                {
                    "package": "org.gel.models.metrics.avro",
                    "python_package": "metrics",
                    "version": "1.2.0",
                    "dependencies": [
                        "org.gel.models.participant.avro"
                    ],
                    "json_hash": "4367427042e83c3ac1d8f718a318e7c5"
                },
                {
                    "package": "org.gel.models.participant.avro",
                    "python_package": "participant",
                    "version": "1.1.1",
                    "dependencies": [],
                    "json_hash": "8d0e83e4afe6adb86edf74c1cbc5bd91"
                },
                {
                    "package": "org.gel.models.report.avro",
                    "python_package": "reports",
                    "version": "6.0.0",
                    "dependencies": [
                        "org.gel.models.participant.avro"
                    ],
                    "json_hash": "ccf3b3f0446cc0743648350155df803c"
                },
                {
                    "package": "org.gel.models.system.avro",
                    "python_package": "system",
                    "version": "0.1.0",
                    "dependencies": [],
                    "json_hash": "2e4af88315b104d813e7ccdcb04defd4"
                },
                {
                    "package": "org.opencb.biodata.models.variant.avro",
                    "python_package": "opencb",
                    "version": "1.3.0",
                    "dependencies": [],
                    "json_hash": "b0e5082f9725540bf7449865f86d455f"
                },
                {
                    "package": "org.gel.models.coverage.avro",
                    "python_package": "coverage",
                    "version": "0.1.0",
                    "dependencies": [],
                    "json_hash": "6e46fe86dbf1cd7450853ad358a1ebf2"
                },
                {
                    "package": "org.gel.models.cva.avro",
                    "python_package": "cva",
                    "version": "1.1.0",
                    "dependencies": [
                        "org.gel.models.report.avro",
                        "org.gel.models.participant.avro",
                        "org.gel.models.system.avro",
                        "org.opencb.biodata.models.variant.avro"
                    ],
                    "json_hash": "779217c54cbc648bcb8dc7151c392b84"
                }
            ]
        },
        {
            "version": "6.1",
            "packages": [
                {
                    "package": "org.ga4gh.models",
                    "python_package": "ga4gh",
                    "version": "3.0.0",
                    "dependencies": [],
                    "json_hash": "2e8dc18536485cb514a331ed8696766f"
                },
                {
                    "package": "org.gel.models.metrics.avro",
                    "python_package": "metrics",
                    "version": "1.1.0",
                    "dependencies": [
                        "org.gel.models.participant.avro"
                    ],
                    "json_hash": "58503eeab5f1af78e7678e36a586a6f6"
                },
                {
                    "package": "org.gel.models.participant.avro",
                    "python_package": "participant",
                    "version": "1.1.0",
                    "dependencies": [],
                    "json_hash": "d42f40384f94a43c64ee0bcc100a244d"
                },
                {
                    "package": "org.gel.models.report.avro",
                    "python_package": "reports",
                    "version": "5.0.0",
                    "dependencies": [
                        "org.gel.models.participant.avro"
                    ],
                    "json_hash": "e526492e36d2ecc7467b6cbc05226245"
                },
                {
                    "package": "org.gel.models.system.avro",
                    "python_package": "system",
                    "version": "0.1.0",
                    "dependencies": [],
                    "json_hash": "4bbb039ccac94aca548d510a3627fd86"
                },
                {
                    "package": "org.opencb.biodata.models.variant.avro",
                    "python_package": "opencb",
                    "version": "1.3.0",
                    "dependencies": [],
                    "json_hash": "ac216e93f394e91614b89eca10b510f9"
                },
                {
                    "package": "org.gel.models.coverage.avro",
                    "python_package": "coverage",
                    "version": "0.1.0",
                    "dependencies": [],
                    "json_hash": "f8001e496a7c6bfc4759a7929777952d"
                },
                {
                    "package": "org.gel.models.cva.avro",
                    "python_package": "cva",
                    "version": "1.0.0",
                    "dependencies": [
                        "org.gel.models.report.avro",
                        "org.gel.models.participant.avro",
                        "org.gel.models.system.avro",
                        "org.opencb.biodata.models.variant.avro"
                    ],
                    "json_hash": "180b98d718eec84504927c48d75330f4"
                }
            ]
        },
        {
            "version": "5.0.0",
            "packages": [
                {
                    "package": "org.ga4gh.models",
                    "python_package": "ga4gh",
                    "version": "3.0.0",
                    "dependencies": [],
                    "json_hash": "f4329c13d24ac3e3faee0f6f605e8051"
                },
                {
                    "package": "org.gel.models.metrics.avro",
                    "python_package": "metrics",
                    "version": "1.0.1",
                    "dependencies": [],
                    "json_hash": "19ed28cb626d8986073497779427a370"
                },
                {
                    "package": "org.gel.models.participant.avro",
                    "python_package": "participant",
                    "version": "1.0.3",
                    "dependencies": [],
                    "json_hash": "fbbf37b12bab2a285a99eab8f54d104c"
                },
                {
                    "package": "org.gel.models.report.avro",
                    "python_package": "reports",
                    "version": "4.2.0",
                    "dependencies": [
                        "org.gel.models.participant.avro"
                    ],
                    "json_hash": "f86f0dd35daf1f0684f857d39d086120"
                },
                {
                    "package": "org.opencb.biodata.models.variant.avro",
                    "python_package": "opencb",
                    "version": "1.3.0-SNAPSHOT",
                    "dependencies": [],
                    "json_hash": "681d239f4b5e8afc256c4251cceb3343"
                }
            ]
        },
        {
            "version": "4.1",
            "packages": [
                {
                    "package": "org.gel.models.participant.avro",
                    "python_package": "participant",
                    "version": "1.0.1",
                    "dependencies": [],
                    "json_hash": "c440595a8e29b39dd06dc55747301027"
                }
            ]
        },
        {
            "version": "4.0.0",
            "packages": [
                {
                    "package": "org.gel.models.participant.avro",
                    "python_package": "participant",
                    "version": "1.0.0",
                    "dependencies": [],
                    "json_hash": "782171830e71678147ba644b82854047"
                },
                {
                    "package": "org.gel.models.report.avro",
                    "python_package": "reports",
                    "version": "4.0.0",
                    "dependencies": [
                        "org.gel.models.participant.avro"
                    ],
                    "json_hash": "b3378082df18ba6239630d616466fb0b"
                },
                {
                    "package": "org.gel.models.metrics.avro",
                    "python_package": "metrics",
                    "version": "1.0.1",
                    "dependencies": [],
                    "json_hash": "e791e472fea7d0b3e768e6bc57e2b508"
                },
                {
                    "package": "org.ga4gh.models",
                    "python_package": "ga4gh",
                    "version": "3.0.0",
                    "dependencies": [],
                    "json_hash": "6bbbd571ad8c1061e836a0bc25c39dc2"
                }
            ]
        },
        {
            "version": "3.0.0",
            "packages": [
                {
                    "package": "org.gel.models.report.avro",
                    "python_package": "reports",
                    "version": "3.0.0",
                    "dependencies": [],
                    "json_hash": "0342b577450a80da5bf9241731bfe3eb"
                }
            ]
        },
        {
            "version": "2.1.0",
            "packages": [
                {
                    "package": "Gel_BioInf_Models",
                    "python_package": "reports",
                    "version": "2.1.0",
                    "dependencies": [],
                    "json_hash": "48209c27f237d6b6513ad7213ee078f6"
                }
            ]
        },
        {
            "version": "1.2.0-opencb",
            "packages": [
                {
                    "package": "org.opencb.biodata.models.variant.avro",
                    "python_package": "opencb",
                    "version": "1.2.0",
                    "dependencies": [],
                    "json_hash": "092b485b1bcdb030328f6f52379e2c67"
                }
            ]
        },
        {
            "version": "1.0.0-metrics",
            "packages": [
                {
                    "package": "org.gel.models.metrics.avro",
                    "python_package": "metrics",
                    "version": "1.0.0",
                    "dependencies": [],
                    "json_hash": "7cc4a3f7672e2672e3290c7316c58d37"
                }
            ]
        }
    ]
}