[
  {
    "name": "sampleId",
    "required": true,
    "type": "TEXT",
    "description": "Sample identifier (e.g, LP00012645_5GH))",
    "multiValue": false
  },
  {
    "name": "labSampleId",
    "required": true,
    "type": "TEXT",
    "description": "Lab sample identifier",
    "multiValue": false
  },
  {
    "name": "LDPCode",
    "required": false,
    "type": "TEXT",
    "description": "LDP Code (Local Delivery Partner)",
    "multiValue": false
  },
  {
    "name": "source",
    "required": false,
    "type": "CATEGORICAL",
    "description": "Source of the sample",
    "allowedValues": [
      "AMNIOTIC_FLUID",
      "BLOOD",
      "BLOOD_CAPILLARY_HEEL_PRICK",
      "BLOOD_CLOT",
      "BLOOD_CORD",
      "BLOOD_DRIED_BLOOD_SPOT",
      "BONE_MARROW",
      "BONE_MARROW_ASPIRATE_TUMOUR_CELLS",
      "BONE_MARROW_ASPIRATE_TUMOUR_SORTED_CELLS",
      "BUCCAL_SPONGE",
      "BUCCAL_SWAB",
      "BUFFY_COAT",
      "CHORIONIC_VILLUS_SAMPLE",
      "FIBROBLAST",
      "FLUID",
      "FRESH_TISSUE_IN_CULTURE_MEDIUM",
      "OTHER",
      "SALIVA",
      "TISSUE",
      "TUMOUR",
      "URINE"
    ],
    "multiValue": false
  },
  {
    "name": "product",
    "required": false,
    "type": "CATEGORICAL",
    "description": "Product of the sample",
    "allowedValues": [
      "DNA",
      "RNA"
    ],
    "multiValue": false
  },
  {
    "name": "preparationMethod",
    "required": false,
    "type": "CATEGORICAL",
    "description": "Preparation method\n        NOTE: In GMS, this has been deprecated in favour of Method and storageMedium",
    "allowedValues": [
      "ASPIRATE",
      "CD128_SORTED_CELLS",
      "CD138_SORTED_CELLS",
      "EDTA",
      "FF",
      "FFPE",
      "LI_HEP",
      "ORAGENE"
    ],
    "multiValue": false
  },
  {
    "name": "programmePhase",
    "required": false,
    "type": "CATEGORICAL",
    "description": "Genomics England programme phase",
    "allowedValues": [
      "CRUK",
      "OXFORD",
      "CLL",
      "IIP",
      "MAIN",
      "EXPT"
    ],
    "multiValue": false
  },
  {
    "name": "clinicalSampleDateTime",
    "required": false,
    "type": "TEXT",
    "description": "The time when the sample was received. In the format YYYY-MM-DDTHH:MM:SS+0000",
    "multiValue": false
  },
  {
    "name": "participantId",
    "required": false,
    "type": "TEXT",
    "description": "",
    "multiValue": false
  },
  {
    "name": "participantUid",
    "required": false,
    "type": "TEXT",
    "description": "Participant UId of the sample",
    "multiValue": false
  },
  {
    "name": "sampleUid",
    "required": false,
    "type": "TEXT",
    "description": "",
    "multiValue": false
  },
  {
    "name": "maskedPid",
    "required": false,
    "type": "TEXT",
    "description": "",
    "multiValue": false
  },
  {
    "name": "method",
    "required": false,
    "type": "CATEGORICAL",
    "description": "In GMS, this is how the sample was extracted from the participant",
    "allowedValues": [
      "ASPIRATE",
      "BIOPSY",
      "NOT_APPLICABLE",
      "RESECTION",
      "SORTED_OTHER",
      "UNKNOWN",
      "UNSORTED",
      "CD138_SORTED"
    ],
    "multiValue": false
  },
  {
    "name": "storageMedium",
    "required": false,
    "type": "CATEGORICAL",
    "description": "In GMS, this is what solvent/medium the sample was stored in",
    "allowedValues": [
      "EDTA",
      "FF",
      "LI_HEP",
      "ORAGENE",
      "FFPE",
      "PAXGENE",
      "RNALater"
    ],
    "multiValue": false
  },
  {
    "name": "sampleType",
    "required": false,
    "type": "TEXT",
    "description": "In GMS, this is the sampleType as entered by the clinician in TOMs",
    "multiValue": false
  },
  {
    "name": "sampleState",
    "required": false,
    "type": "TEXT",
    "description": "In GMS, this is the sampleState as entered by the clinician in TOMs",
    "multiValue": false
  },
  {
    "name": "sampleCollectionOperationsQuestions",
    "required": false,
    "type": "OBJECT",
    "description": "In Newborns BaMMs, this is operational sample collection questions",
    "variableSet": [
      {
        "name": "easeOfSampleCollection",
        "required": false,
        "type": "CATEGORICAL",
        "description": "Ease of successful sample collection",
        "allowedValues": [
          "EASY",
          "DIFFICULT",
          "NOT_APPLICABLE"
        ],
        "multiValue": false
      },
      {
        "name": "minutes",
        "required": false,
        "type": "INTEGER",
        "description": "Time taken to collect the sample (from opening collection kit to completion) in minutes",
        "multiValue": false
      }
    ],
    "multiValue": false
  }
]