[
  {
    "name": "events",
    "required": true,
    "type": "OBJECT",
    "description": "List of SelectionEvents, one for each test performed",
    "variableSet": [
      {
        "name": "name",
        "required": true,
        "type": "CATEGORICAL",
        "description": "Name of the test performed during this event",
        "allowedValues": [
          "ALIGNMENT_STATS",
          "ANALYSIS_PANELS",
          "BAM_STATS_CHECK",
          "BLACKLIST",
          "CNV_QC_STATUS",
          "DELIVERY_CHECK",
          "DISEASE_PENETRANCE",
          "FAMILY_SELECTION",
          "GEL_STATUS",
          "HPO_CHECK",
          "PANEL_VERSION",
          "RVG_RESULTS",
          "SEX_CHECK"
        ],
        "multiValue": false
      },
      {
        "name": "passed",
        "required": true,
        "type": "BOOLEAN",
        "description": "Whether the test passed or failed",
        "multiValue": false
      },
      {
        "name": "description",
        "required": true,
        "type": "TEXT",
        "description": "List of descriptive strings relating to test execution",
        "multiValue": true
      },
      {
        "name": "flags",
        "required": false,
        "type": "TEXT",
        "description": "List of flags raised during test execution",
        "multiValue": true
      }
    ],
    "multiValue": true
  },
  {
    "name": "status",
    "required": true,
    "type": "CATEGORICAL",
    "description": "Overall family selection status",
    "allowedValues": [
      "NOT_CHECKED",
      "REJECTED",
      "SELECTED"
    ],
    "multiValue": false
  },
  {
    "name": "flagged",
    "required": true,
    "type": "BOOLEAN",
    "description": "True if any flags are raised in the selection events",
    "multiValue": false
  },
  {
    "name": "rvsgAnnotation",
    "required": true,
    "type": "TEXT",
    "description": "Name of ReportedVsGenetic annotation set that this data is based on",
    "multiValue": false
  }
]