{
  "*": {
    "language": "pt-BR",
    "scope": {
     "id": "Apocalipse/Project"
    },
    "resources": {
      "assets": {
        "root": "resources/assets"
      },
      "views": {
        "page": {
          "root": "resources/views",
          "suffix": "html.php",
          "template": "pages",
          "design": "designs/portal"
        },
        "app": {
          "root": "resources/views",
          "suffix": "html.php",
          "template": "app",
          "design": "designs/portal"
        }
      },
      "download": {
        "root": "storage/files"
      },
      "upload": {
        "root": "temp/files"
      }
    },
    "auth": {
      "driver": "json",
      "collection": "users",
      "fields": {
        "login": "login",
        "additional": [
          "email"
        ],
        "password": "password",
        "name": "name",
        "email": "email",
        "role": "role",
        "token": "token"
      }
    }
  },
  "app": {
    "language": "pt-BR",
    "scope": {
      "id": "Apocalipse/Basic"
    },
    "resources": {
      "assets": {
        "root": "resources/assets"
      }
    }
  }
}