{
  "id": "index",
  "layout": "index",
  "type": "form",
  "templateOptions": {
    "recover": "read",
    "wrapper": "recordSet"
  },
  "fields": [
    {
      "key": "resource",
      "component": "select",
      "wrapper": "col-sm-2",
      "label": "Recurso",
      "placeholder": "Recurso"
    },
    {
      "key": "path",
      "component": "input[text]",
      "wrapper": "col-sm-5",
      "label": "Url",
      "placeholder": "Url"
    },
    {
      "key": "template",
      "component": "input[text]",
      "wrapper": "col-sm-5",
      "label": "Template",
      "placeholder": "Template"
    }
  ],
  "actions": {
    "add": {
      "id": "add",
      "position": {
        "fab": 0
      },
      "className": "btn waves-effect btn-theme",
      "classIcon": "zmdi zmdi-plus"
    },
    "add-top": {
      "id": "add",
      "position": {
        "top": 0
      },
      "className": "",
      "classIcon": "zmdi zmdi-plus"
    },
    "index": {
      "id": "index",
      "position": {
        "top": 1
      },
      "className": "",
      "classIcon": "zmdi zmdi-refresh-alt"
    },
    "show": {
      "id": "show",
      "position": {
        "middle": 0
      },
      "conditions": [],
      "className": "btn btn-sm btn-default",
      "classIcon": "glyphicon glyphicon-search"
    },
    "edit": {
      "id": "edit",
      "position": {
        "middle": 1
      },
      "conditions": [],
      "className": "btn btn-sm btn-default",
      "classIcon": "glyphicon glyphicon-edit"
    },
    "remove": {
      "id": "delete",
      "after": "index",
      "position": {
        "middle": 2
      },
      "conditions": [],
      "className": "btn btn-sm btn-danger",
      "classIcon": "glyphicon glyphicon-trash"
    }
  }
}