{
  "properties": {
    "module": "manager",
    "entity": "Usuario",
    "id": "_id",
    "name": "Usuário",
    "description": ""
  },
  "driver": {
    "id": "json",
    "collection": "users"
  },
  "items": [
    {
      "name": "role",
      "type": "string",
      "required": true,
      "field": {
        "component": "input[text]"
      }
    },
    {
      "name": "name",
      "type": "string",
      "required": true,
      "field": {
        "component": "input[text]"
      }
    },
    {
      "name": "email",
      "type": "string",
      "required": true,
      "field": {
        "component": "input[text]"
      }
    },
    {
      "name": "login",
      "type": "string",
      "required": true,
      "field": {
        "component": "input[text]"
      }
    },
    {
      "name": "password",
      "type": "string",
      "required": false,
      "read": false,
      "field": {
        "component": "input[password]",
        "behavior": "password"
      }
    },
    {
      "name": "token",
      "type": "string",
      "required": true,
      "field": {
        "component": "input[text]"
      }
    }
  ]
}