{
  "id": "show",
  "layout": "form",
  "type": "form",
  "templateOptions": {
    "recover": "read",
    "wrapper": "record"
  },
  "fields": [
    {
      "key": "code",
      "component": "input[text]",
      "wrapper": "col-sm-12",
      "label": "Código",
      "placeholder": "Código",
      "readonly": true,
      "readonly": true
    },
    {
      "key": "module",
      "component": "select[remote]",
      "wrapper": "col-sm-12",
      "label": "Módulo",
      "placeholder": "Módulo",
      "required": true,
      "readonly": true
    },
    {
      "key": "entity",
      "component": "input[text]",
      "wrapper": "col-sm-6",
      "label": "Classe",
      "placeholder": "Classe",
      "required": true,
      "readonly": true
    },
    {
      "key": "collection",
      "component": "input[text]",
      "wrapper": "col-sm-6",
      "label": "Coleção",
      "placeholder": "Coleção",
      "required": true,
      "readonly": true
    },
    {
      "key": "prefix",
      "component": "input[text]",
      "wrapper": "col-sm-6",
      "label": "Prefixo",
      "placeholder": "Prefixo",
      "readonly": true
    },
    {
      "key": "driver",
      "component": "input[text]",
      "wrapper": "col-sm-6",
      "label": "Driver",
      "placeholder": "Driver",
      "readonly": true
    },
    {
      "key": "name",
      "component": "input[text]",
      "wrapper": "col-sm-12",
      "label": "Nome",
      "placeholder": "Nome",
      "required": true,
      "readonly": true
    },
    {
      "key": "description",
      "component": "textarea",
      "wrapper": "col-sm-12",
      "label": "Descrição",
      "placeholder": "Descrição",
      "readonly": true
    }
  ],
  "actions": {
    "add": {
      "id": "add",
      "position": {
        "fab": 0
      },
      "className": "btn waves-effect btn-theme",
      "classIcon": "zmdi zmdi-plus"
    },
    "save": {
      "id": "save",
      "position": {
        "top": 0,
        "bottom": 0
      },
      "className": "btn btn-theme waves-effect",
      "classIcon": "",
      "label": "Salvar"
    },
    "save-index": {
      "id": "save",
      "position": {
        "top": 1,
        "bottom": 1
      },
      "className": "btn btn-default",
      "classIcon": "",
      "label": "Salvar e Fechar",
      "after": "index"
    },
    "index": {
      "id": "index",
      "position": {
        "top": 2,
        "bottom": 2
      },
      "className": "btn btn-link waves-effect",
      "classIcon": "",
      "label": "Fechar"
    }
  }
}