{
  "id": "index",
  "layout": "index",
  "type": "form",
  "templateOptions": {
    "recover": "read",
    "wrapper": "recordSet"
  },
  "fields": [
    {
      "key": "role",
      "component": "input[text]",
      "wrapper": "col-sm-3",
      "label": "Perfil",
      "placeholder": "Perfil"
    },
    {
      "key": "name",
      "component": "input[text]",
      "wrapper": "col-sm-5",
      "label": "Nome",
      "placeholder": "Nome"
    },
    {
      "key": "login",
      "component": "input[text]",
      "wrapper": "col-sm-3",
      "label": "Login",
      "placeholder": "Login"
    }
  ],
  "actions": {
    "add": {
      "id": "add",
      "position": {
        "fab": 0
      },
      "className": "btn waves-effect btn-theme",
      "classIcon": "zmdi zmdi-plus"
    },
    "add-top": {
      "id": "add",
      "position": {
        "top": 0
      },
      "className": "",
      "classIcon": "zmdi zmdi-plus"
    },
    "index": {
      "id": "index",
      "position": {
        "top": 1
      },
      "className": "",
      "classIcon": "zmdi zmdi-refresh-alt"
    },
    "show": {
      "id": "show",
      "position": {
        "middle": 0
      },
      "conditions": [],
      "className": "btn btn-sm btn-default",
      "classIcon": "glyphicon glyphicon-search"
    },
    "edit": {
      "id": "edit",
      "position": {
        "middle": 1
      },
      "conditions": [],
      "className": "btn btn-sm btn-default",
      "classIcon": "glyphicon glyphicon-edit"
    },
    "remove": {
      "id": "delete",
      "after": "index",
      "position": {
        "middle": 2
      },
      "conditions": [],
      "className": "btn btn-sm btn-danger",
      "classIcon": "glyphicon glyphicon-trash"
    }
  }
}