{
  "id": "add",
  "layout": "form",
  "type": "form",
  "templateOptions": {
    "recover": false
  },
  "fields": [
    {
      "key": "resource",
      "component": "select[local]",
      "wrapper": "col-sm-6",
      "label": "Recurso",
      "placeholder": "Recurso",
      "options": [
        {
          "id": "page",
          "text": "Página"
        },
        {
          "id": "app",
          "text": "Aplicativo"
        }
      ],
      "required": true
    },
    {
      "key": "path",
      "component": "input[text]",
      "wrapper": "col-sm-6",
      "label": "Url",
      "placeholder": "Url",
      "required": true
    },
    {
      "key": "template",
      "component": "input[text]",
      "wrapper": "col-sm-6",
      "label": "Template",
      "placeholder": "Template",
      "required": true
    },
    {
      "key": "controller",
      "component": "input[text]",
      "wrapper": "col-sm-6",
      "label": "Controller",
      "placeholder": "Controller"
    },
    {
      "key": "brook",
      "component": "input[checkbox]",
      "wrapper": "col-sm-6",
      "label": "Brook",
      "placeholder": "Aceita overload da Url"
    },
    {
      "key": "cache",
      "component": "input[radio]",
      "wrapper": "col-sm-6",
      "label": "Cache",
      "placeholder": "Cria cache do recurso",
      "options": [
        {
          "id": "1",
          "text": "Sim"
        },
        {
          "id": "0",
          "text": "Não"
        }
      ]
    }
  ],
  "actions": {
    "add": {
      "id": "add",
      "position": {
        "fab": 0
      },
      "className": "btn waves-effect btn-theme",
      "classIcon": "zmdi zmdi-plus"
    },
    "save": {
      "id": "save",
      "position": {
        "top": 0,
        "bottom": 0
      },
      "className": "btn btn-theme waves-effect",
      "classIcon": "",
      "label": "Salvar"
    },
    "save-index": {
      "id": "save",
      "position": {
        "top": 1,
        "bottom": 1
      },
      "className": "btn btn-default",
      "classIcon": "",
      "label": "Salvar e Fechar",
      "after": "index"
    },
    "index": {
      "id": "index",
      "position": {
        "top": 2,
        "bottom": 2
      },
      "className": "btn btn-link waves-effect",
      "classIcon": "",
      "label": "Fechar"
    }
  }
}